polygene-dev mailing list archives

Site index · List index
Message view « Date » · « Thread »
Top « Date » · « Thread »
From Niclas Hedhman <nic...@hedhman.org>
Subject Re: Build failed in Jenkins: Zest(JavaEdition)-develop-java8-checkDists #63
Date Fri, 15 Apr 2016 15:46:09 GMT
I will look into this tomorrow. I don't think I made any serious mistake in
the change of source headers.

On Fri, Apr 15, 2016 at 7:21 PM, Apache Jenkins Server <
jenkins@builds.apache.org> wrote:

> See <
> https://builds.apache.org/job/Zest(JavaEdition)-develop-java8-checkDists/63/changes
> >
>
> Changes:
>
> [niclas] Remove unnecessary "public static" Added a null check, that
> probably
>
> [niclas] A Create Rest Application code generator.
>
> [niclas] Exclude "Did you mean @Service injection scope?" when Service
> injection
>
> [niclas] Debugging message snuck in. Removing
>
> [niclas] Renamed EntityTypeNotFoundException to NoSuchEntityTypeException,
> to
>
> [niclas] Added a little bit of documentation about Objects. Removed
> Copyright
>
> [niclas] Massive update of source file headers, removing author names in
> line
>
> [niclas] In the haste of renaming and unifying the type not found
> exception (so
>
> [niclas] Renamed uowf to unitOfWorkFactory in AbstractZestTestcase
>
> [niclas] ZEST-142 : Fixed the problem with Enums in Property in
> EntityComposites.
>
> ------------------------------------------
> [...truncated 1832 lines...]
> :org.apache.zest.tools:org.apache.zest.tool.shell:honkerGenNotice
> :org.apache.zest.tools:org.apache.zest.tool.shell:processResources
> :org.apache.zest.tools:org.apache.zest.tool.shell:classes
> :org.apache.zest.tools:org.apache.zest.tool.shell:compileTestJava
> UP-TO-DATE
> :org.apache.zest.tools:org.apache.zest.tool.shell:processTestResources
> UP-TO-DATE
> :org.apache.zest.tools:org.apache.zest.tool.shell:testClasses UP-TO-DATE
> :org.apache.zest.tools:org.apache.zest.tool.shell:test UP-TO-DATE
> :org.apache.zest.tutorials:org.apache.zest.tutorial.cargo:makeVersionClass
>
> :org.apache.zest.tutorials:org.apache.zest.tutorial.cargo:compileVersionJava
> :org.apache.zest.tutorials:org.apache.zest.tutorial.cargo:compileJava
>
> :org.apache.zest.tutorials:org.apache.zest.tutorial.cargo:honkerGenDependencies
> :org.apache.zest.tutorials:org.apache.zest.tutorial.cargo:honkerGenLicense
> :org.apache.zest.tutorials:org.apache.zest.tutorial.cargo:honkerGenNotice
> :org.apache.zest.tutorials:org.apache.zest.tutorial.cargo:processResources
> UP-TO-DATE
> :org.apache.zest.tutorials:org.apache.zest.tutorial.cargo:classes
> :org.apache.zest.tutorials:org.apache.zest.tutorial.cargo:compileTestJavaNote:
> <
> https://builds.apache.org/job/Zest(JavaEdition)-develop-java8-checkDists/ws/tutorials/cargo/src/test/java/org/apache/zest/tutorials/cargo/step2/SequencingConcernTest.java>
> uses unchecked or unsafe operations.
> Note: Recompile with -Xlint:unchecked for details.
>
> :org.apache.zest.tutorials:org.apache.zest.tutorial.cargo:processTestResources
> UP-TO-DATE
> :org.apache.zest.tutorials:org.apache.zest.tutorial.cargo:testClasses
> :org.apache.zest.tutorials:org.apache.zest.tutorial.cargo:test
>
> :org.apache.zest.tutorials:org.apache.zest.tutorial.composites:makeVersionClass
>
> :org.apache.zest.tutorials:org.apache.zest.tutorial.composites:compileVersionJava
> :org.apache.zest.tutorials:org.apache.zest.tutorial.composites:compileJava
>
> :org.apache.zest.tutorials:org.apache.zest.tutorial.composites:honkerGenDependencies
>
> :org.apache.zest.tutorials:org.apache.zest.tutorial.composites:honkerGenLicense
>
> :org.apache.zest.tutorials:org.apache.zest.tutorial.composites:honkerGenNotice
> :org.apache.zest.tutorials:org.apache.zest.tutorial.composites:processResources
> UP-TO-DATE
> :org.apache.zest.tutorials:org.apache.zest.tutorial.composites:classes
>
> :org.apache.zest.tutorials:org.apache.zest.tutorial.composites:compileTestJava
> :org.apache.zest.tutorials:org.apache.zest.tutorial.composites:processTestResources
> UP-TO-DATE
> :org.apache.zest.tutorials:org.apache.zest.tutorial.composites:testClasses
> :org.apache.zest.tutorials:org.apache.zest.tutorial.composites:test
> :org.apache.zest.tutorials:org.apache.zest.tutorial.hello:makeVersionClass
>
> :org.apache.zest.tutorials:org.apache.zest.tutorial.hello:compileVersionJava
> :org.apache.zest.tutorials:org.apache.zest.tutorial.hello:compileJava
>
> :org.apache.zest.tutorials:org.apache.zest.tutorial.hello:honkerGenDependencies
> :org.apache.zest.tutorials:org.apache.zest.tutorial.hello:honkerGenLicense
> :org.apache.zest.tutorials:org.apache.zest.tutorial.hello:honkerGenNotice
> :org.apache.zest.tutorials:org.apache.zest.tutorial.hello:processResources
> UP-TO-DATE
> :org.apache.zest.tutorials:org.apache.zest.tutorial.hello:classes
> :org.apache.zest.tutorials:org.apache.zest.tutorial.hello:compileTestJava
> :org.apache.zest.tutorials:org.apache.zest.tutorial.hello:processTestResources
> UP-TO-DATE
> :org.apache.zest.tutorials:org.apache.zest.tutorial.hello:testClasses
> :org.apache.zest.tutorials:org.apache.zest.tutorial.hello:test
>
> :org.apache.zest.tutorials:org.apache.zest.tutorial.introduction:makeVersionClass
>
> :org.apache.zest.tutorials:org.apache.zest.tutorial.introduction:compileVersionJava
>
> :org.apache.zest.tutorials:org.apache.zest.tutorial.introduction:compileJava
>
> :org.apache.zest.tutorials:org.apache.zest.tutorial.introduction:honkerGenDependencies
>
> :org.apache.zest.tutorials:org.apache.zest.tutorial.introduction:honkerGenLicense
>
> :org.apache.zest.tutorials:org.apache.zest.tutorial.introduction:honkerGenNotice
> :org.apache.zest.tutorials:org.apache.zest.tutorial.introduction:processResources
> UP-TO-DATE
> :org.apache.zest.tutorials:org.apache.zest.tutorial.introduction:classes
> :org.apache.zest.tutorials:org.apache.zest.tutorial.introduction:compileTestJava
> UP-TO-DATE
> :org.apache.zest.tutorials:org.apache.zest.tutorial.introduction:processTestResources
> UP-TO-DATE
> :org.apache.zest.tutorials:org.apache.zest.tutorial.introduction:testClasses
> UP-TO-DATE
> :org.apache.zest.tutorials:org.apache.zest.tutorial.introduction:test
> UP-TO-DATE
>
> :org.apache.zest.tutorials:org.apache.zest.tutorial.services:makeVersionClass
>
> :org.apache.zest.tutorials:org.apache.zest.tutorial.services:compileVersionJava
> :org.apache.zest.tutorials:org.apache.zest.tutorial.services:compileJava
>
> :org.apache.zest.tutorials:org.apache.zest.tutorial.services:honkerGenDependencies
>
> :org.apache.zest.tutorials:org.apache.zest.tutorial.services:honkerGenLicense
>
> :org.apache.zest.tutorials:org.apache.zest.tutorial.services:honkerGenNotice
>
> :org.apache.zest.tutorials:org.apache.zest.tutorial.services:processResources
> :org.apache.zest.tutorials:org.apache.zest.tutorial.services:classes
>
> :org.apache.zest.tutorials:org.apache.zest.tutorial.services:compileTestJava
> :org.apache.zest.tutorials:org.apache.zest.tutorial.services:processTestResources
> UP-TO-DATE
> :org.apache.zest.tutorials:org.apache.zest.tutorial.services:testClasses
> :org.apache.zest.tutorials:org.apache.zest.tutorial.services:test
> :org.apache.zest.tools:org.apache.zest.tool.envisage:processVersionResources
> UP-TO-DATE
> :org.apache.zest.tools:org.apache.zest.tool.envisage:versionClasses
> :org.apache.zest.tools:org.apache.zest.tool.envisage:jar
>
> :org.apache.zest.samples:org.apache.zest.sample.dci-cargo:org.apache.zest.sample.dci-cargo.dcisample_a:makeVersionClass
>
> :org.apache.zest.samples:org.apache.zest.sample.dci-cargo:org.apache.zest.sample.dci-cargo.dcisample_a:compileVersionJava
>
> :org.apache.zest.samples:org.apache.zest.sample.dci-cargo:org.apache.zest.sample.dci-cargo.dcisample_a:compileJava<
> https://builds.apache.org/job/Zest(JavaEdition)-develop-java8-checkDists/ws/samples/dci-cargo/dcisample_a/src/main/java/org/apache/zest/sample/dcicargo/sample_a/context/shipping/booking/BookNewCargo.java>:24:
> warning: [deprecation] DateMidnight in org.joda.time has been deprecated
> import org.joda.time.DateMidnight;
>                     ^
> <
> https://builds.apache.org/job/Zest(JavaEdition)-develop-java8-checkDists/ws/samples/dci-cargo/dcisample_a/src/main/java/org/apache/zest/sample/dcicargo/sample_a/context/shipping/booking/BookNewCargo.java>:244:
> warning: [deprecation] DateMidnight in org.joda.time has been deprecated
>         Date endOfToday = new DateMidnight().plusDays( 1 ).toDate();
>                               ^
> 2 warnings
>
>
> :org.apache.zest.samples:org.apache.zest.sample.dci-cargo:org.apache.zest.sample.dci-cargo.dcisample_a:honkerGenDependencies
>
> :org.apache.zest.samples:org.apache.zest.sample.dci-cargo:org.apache.zest.sample.dci-cargo.dcisample_a:honkerGenLicense
>
> :org.apache.zest.samples:org.apache.zest.sample.dci-cargo:org.apache.zest.sample.dci-cargo.dcisample_a:honkerGenNotice
>
> :org.apache.zest.samples:org.apache.zest.sample.dci-cargo:org.apache.zest.sample.dci-cargo.dcisample_a:processResources
>
> :org.apache.zest.samples:org.apache.zest.sample.dci-cargo:org.apache.zest.sample.dci-cargo.dcisample_a:classes
>
> :org.apache.zest.samples:org.apache.zest.sample.dci-cargo:org.apache.zest.sample.dci-cargo.dcisample_a:compileTestJava
> :org.apache.zest.samples:org.apache.zest.sample.dci-cargo:org.apache.zest.sample.dci-cargo.dcisample_a:processTestResources
> UP-TO-DATE
>
> :org.apache.zest.samples:org.apache.zest.sample.dci-cargo:org.apache.zest.sample.dci-cargo.dcisample_a:testClasses
>
> :org.apache.zest.samples:org.apache.zest.sample.dci-cargo:org.apache.zest.sample.dci-cargo.dcisample_a:test
>
> :org.apache.zest.samples:org.apache.zest.sample.dci-cargo:org.apache.zest.sample.dci-cargo.dcisample_b:makeVersionClass
>
> :org.apache.zest.samples:org.apache.zest.sample.dci-cargo:org.apache.zest.sample.dci-cargo.dcisample_b:compileVersionJava
>
> :org.apache.zest.samples:org.apache.zest.sample.dci-cargo:org.apache.zest.sample.dci-cargo.dcisample_b:compileJava<
> https://builds.apache.org/job/Zest(JavaEdition)-develop-java8-checkDists/ws/samples/dci-cargo/dcisample_b/src/main/java/org/apache/zest/sample/dcicargo/sample_b/data/factory/RouteSpecificationFactoryService.java>:23:
> warning: [deprecation] DateMidnight in org.joda.time has been deprecated
> import org.joda.time.DateMidnight;
>                     ^
> <
> https://builds.apache.org/job/Zest(JavaEdition)-develop-java8-checkDists/ws/samples/dci-cargo/dcisample_b/src/main/java/org/apache/zest/sample/dcicargo/sample_b/data/factory/RouteSpecificationFactoryService.java>:64:
> warning: [deprecation] DateMidnight in org.joda.time has been deprecated
>             Date endOfToday = new DateMidnight().plusDays( 1 ).toDate();
>                                   ^
> 2 warnings
>
>
> :org.apache.zest.samples:org.apache.zest.sample.dci-cargo:org.apache.zest.sample.dci-cargo.dcisample_b:honkerGenDependencies
>
> :org.apache.zest.samples:org.apache.zest.sample.dci-cargo:org.apache.zest.sample.dci-cargo.dcisample_b:honkerGenLicense
>
> :org.apache.zest.samples:org.apache.zest.sample.dci-cargo:org.apache.zest.sample.dci-cargo.dcisample_b:honkerGenNotice
>
> :org.apache.zest.samples:org.apache.zest.sample.dci-cargo:org.apache.zest.sample.dci-cargo.dcisample_b:processResources
>
> :org.apache.zest.samples:org.apache.zest.sample.dci-cargo:org.apache.zest.sample.dci-cargo.dcisample_b:classes
>
> :org.apache.zest.samples:org.apache.zest.sample.dci-cargo:org.apache.zest.sample.dci-cargo.dcisample_b:compileTestJava
> :org.apache.zest.samples:org.apache.zest.sample.dci-cargo:org.apache.zest.sample.dci-cargo.dcisample_b:processTestResources
> UP-TO-DATE
>
> :org.apache.zest.samples:org.apache.zest.sample.dci-cargo:org.apache.zest.sample.dci-cargo.dcisample_b:testClasses
>
> :org.apache.zest.samples:org.apache.zest.sample.dci-cargo:org.apache.zest.sample.dci-cargo.dcisample_b:test
>
> :org.apache.zest.tutorials:org.apache.zest.tutorial.introduction:org.apache.zest.tutorial.introduction.tenminutes:makeVersionClass
>
> :org.apache.zest.tutorials:org.apache.zest.tutorial.introduction:org.apache.zest.tutorial.introduction.tenminutes:compileVersionJava
>
> :org.apache.zest.tutorials:org.apache.zest.tutorial.introduction:org.apache.zest.tutorial.introduction.tenminutes:compileJava
>
> :org.apache.zest.tutorials:org.apache.zest.tutorial.introduction:org.apache.zest.tutorial.introduction.tenminutes:honkerGenDependencies
>
> :org.apache.zest.tutorials:org.apache.zest.tutorial.introduction:org.apache.zest.tutorial.introduction.tenminutes:honkerGenLicense
>
> :org.apache.zest.tutorials:org.apache.zest.tutorial.introduction:org.apache.zest.tutorial.introduction.tenminutes:honkerGenNotice
> :org.apache.zest.tutorials:org.apache.zest.tutorial.introduction:org.apache.zest.tutorial.introduction.tenminutes:processResources
> UP-TO-DATE
>
> :org.apache.zest.tutorials:org.apache.zest.tutorial.introduction:org.apache.zest.tutorial.introduction.tenminutes:classes
> :org.apache.zest.tutorials:org.apache.zest.tutorial.introduction:org.apache.zest.tutorial.introduction.tenminutes:compileTestJava
> UP-TO-DATE
> :org.apache.zest.tutorials:org.apache.zest.tutorial.introduction:org.apache.zest.tutorial.introduction.tenminutes:processTestResources
> UP-TO-DATE
> :org.apache.zest.tutorials:org.apache.zest.tutorial.introduction:org.apache.zest.tutorial.introduction.tenminutes:testClasses
> UP-TO-DATE
> :org.apache.zest.tutorials:org.apache.zest.tutorial.introduction:org.apache.zest.tutorial.introduction.tenminutes:test
> UP-TO-DATE
> :org.apache.zest.tutorials:org.apache.zest.tutorial.introduction:org.apache.zest.tutorial.introduction.tenminutes:processVersionResources
> UP-TO-DATE
>
> :org.apache.zest.tutorials:org.apache.zest.tutorial.introduction:org.apache.zest.tutorial.introduction.tenminutes:versionClasses
>
> :org.apache.zest.tutorials:org.apache.zest.tutorial.introduction:org.apache.zest.tutorial.introduction.tenminutes:jar
>
> :org.apache.zest.tutorials:org.apache.zest.tutorial.introduction:org.apache.zest.tutorial.introduction.thirtyminutes:makeVersionClass
>
> :org.apache.zest.tutorials:org.apache.zest.tutorial.introduction:org.apache.zest.tutorial.introduction.thirtyminutes:compileVersionJava
> :org.apache.zest.tutorials:org.apache.zest.tutorial.introduction:org.apache.zest.tutorial.introduction.thirtyminutes:compileJavaNote:
> <
> https://builds.apache.org/job/Zest(JavaEdition)-develop-java8-checkDists/ws/tutorials/introduction/thirtyminutes/src/main/java/org/apache/zest/demo/thirtyminutes/ThirtyMinutesDocs.java>
> uses unchecked or unsafe operations.
> Note: Recompile with -Xlint:unchecked for details.
>
>
> :org.apache.zest.tutorials:org.apache.zest.tutorial.introduction:org.apache.zest.tutorial.introduction.thirtyminutes:honkerGenDependencies
>
> :org.apache.zest.tutorials:org.apache.zest.tutorial.introduction:org.apache.zest.tutorial.introduction.thirtyminutes:honkerGenLicense
>
> :org.apache.zest.tutorials:org.apache.zest.tutorial.introduction:org.apache.zest.tutorial.introduction.thirtyminutes:honkerGenNotice
> :org.apache.zest.tutorials:org.apache.zest.tutorial.introduction:org.apache.zest.tutorial.introduction.thirtyminutes:processResources
> UP-TO-DATE
>
> :org.apache.zest.tutorials:org.apache.zest.tutorial.introduction:org.apache.zest.tutorial.introduction.thirtyminutes:classes
> :org.apache.zest.tutorials:org.apache.zest.tutorial.introduction:org.apache.zest.tutorial.introduction.thirtyminutes:compileTestJava
> UP-TO-DATE
> :org.apache.zest.tutorials:org.apache.zest.tutorial.introduction:org.apache.zest.tutorial.introduction.thirtyminutes:processTestResources
> UP-TO-DATE
> :org.apache.zest.tutorials:org.apache.zest.tutorial.introduction:org.apache.zest.tutorial.introduction.thirtyminutes:testClasses
> UP-TO-DATE
> :org.apache.zest.tutorials:org.apache.zest.tutorial.introduction:org.apache.zest.tutorial.introduction.thirtyminutes:test
> UP-TO-DATE
>
> :org.apache.zest.tutorials:org.apache.zest.tutorial.introduction:org.apache.zest.tutorial.introduction.twominutes:makeVersionClass
>
> :org.apache.zest.tutorials:org.apache.zest.tutorial.introduction:org.apache.zest.tutorial.introduction.twominutes:compileVersionJava
>
> :org.apache.zest.tutorials:org.apache.zest.tutorial.introduction:org.apache.zest.tutorial.introduction.twominutes:compileJava
>
> :org.apache.zest.tutorials:org.apache.zest.tutorial.introduction:org.apache.zest.tutorial.introduction.twominutes:honkerGenDependencies
>
> :org.apache.zest.tutorials:org.apache.zest.tutorial.introduction:org.apache.zest.tutorial.introduction.twominutes:honkerGenLicense
>
> :org.apache.zest.tutorials:org.apache.zest.tutorial.introduction:org.apache.zest.tutorial.introduction.twominutes:honkerGenNotice
> :org.apache.zest.tutorials:org.apache.zest.tutorial.introduction:org.apache.zest.tutorial.introduction.twominutes:processResources
> UP-TO-DATE
>
> :org.apache.zest.tutorials:org.apache.zest.tutorial.introduction:org.apache.zest.tutorial.introduction.twominutes:classes
> :org.apache.zest.tutorials:org.apache.zest.tutorial.introduction:org.apache.zest.tutorial.introduction.twominutes:compileTestJava
> UP-TO-DATE
> :org.apache.zest.tutorials:org.apache.zest.tutorial.introduction:org.apache.zest.tutorial.introduction.twominutes:processTestResources
> UP-TO-DATE
> :org.apache.zest.tutorials:org.apache.zest.tutorial.introduction:org.apache.zest.tutorial.introduction.twominutes:testClasses
> UP-TO-DATE
> :org.apache.zest.tutorials:org.apache.zest.tutorial.introduction:org.apache.zest.tutorial.introduction.twominutes:test
> UP-TO-DATE
> :coverageReport
> :honkerCheck
> :rat FAILED
>
> FAILURE: Build failed with an exception.
>
> * What went wrong:
> Execution failed for task ':rat'.
> > Found 19 files with unapproved/unknown licenses. See <
> https://builds.apache.org/job/Zest(JavaEdition)-develop-java8-checkDists/ws/build/reports/rat/index.html
> >
>
> * Try:
> Run with --info or --debug option to get more log output.
>
> * Exception is:
> org.gradle.api.tasks.TaskExecutionException: Execution failed for task
> ':rat'.
>         at
> org.gradle.api.internal.tasks.execution.ExecuteActionsTaskExecuter.executeActions(ExecuteActionsTaskExecuter.java:69)
>         at
> org.gradle.api.internal.tasks.execution.ExecuteActionsTaskExecuter.execute(ExecuteActionsTaskExecuter.java:46)
>         at
> org.gradle.api.internal.tasks.execution.PostExecutionAnalysisTaskExecuter.execute(PostExecutionAnalysisTaskExecuter.java:35)
>         at
> org.gradle.api.internal.tasks.execution.SkipUpToDateTaskExecuter.execute(SkipUpToDateTaskExecuter.java:64)
>         at
> org.gradle.api.internal.tasks.execution.ValidatingTaskExecuter.execute(ValidatingTaskExecuter.java:58)
>         at
> org.gradle.api.internal.tasks.execution.SkipEmptySourceFilesTaskExecuter.execute(SkipEmptySourceFilesTaskExecuter.java:52)
>         at
> org.gradle.api.internal.tasks.execution.SkipTaskWithNoActionsExecuter.execute(SkipTaskWithNoActionsExecuter.java:52)
>         at
> org.gradle.api.internal.tasks.execution.SkipOnlyIfTaskExecuter.execute(SkipOnlyIfTaskExecuter.java:53)
>         at
> org.gradle.api.internal.tasks.execution.ExecuteAtMostOnceTaskExecuter.execute(ExecuteAtMostOnceTaskExecuter.java:43)
>         at
> org.gradle.execution.taskgraph.DefaultTaskGraphExecuter$EventFiringTaskWorker.execute(DefaultTaskGraphExecuter.java:203)
>         at
> org.gradle.execution.taskgraph.DefaultTaskGraphExecuter$EventFiringTaskWorker.execute(DefaultTaskGraphExecuter.java:185)
>         at
> org.gradle.execution.taskgraph.AbstractTaskPlanExecutor$TaskExecutorWorker.processTask(AbstractTaskPlanExecutor.java:66)
>         at
> org.gradle.execution.taskgraph.AbstractTaskPlanExecutor$TaskExecutorWorker.run(AbstractTaskPlanExecutor.java:50)
>         at
> org.gradle.execution.taskgraph.DefaultTaskPlanExecutor.process(DefaultTaskPlanExecutor.java:25)
>         at
> org.gradle.execution.taskgraph.DefaultTaskGraphExecuter.execute(DefaultTaskGraphExecuter.java:110)
>         at
> org.gradle.execution.SelectedTaskExecutionAction.execute(SelectedTaskExecutionAction.java:37)
>         at
> org.gradle.execution.DefaultBuildExecuter.execute(DefaultBuildExecuter.java:37)
>         at
> org.gradle.execution.DefaultBuildExecuter.access$000(DefaultBuildExecuter.java:23)
>         at
> org.gradle.execution.DefaultBuildExecuter$1.proceed(DefaultBuildExecuter.java:43)
>         at
> org.gradle.execution.DryRunBuildExecutionAction.execute(DryRunBuildExecutionAction.java:32)
>         at
> org.gradle.execution.DefaultBuildExecuter.execute(DefaultBuildExecuter.java:37)
>         at
> org.gradle.execution.DefaultBuildExecuter.execute(DefaultBuildExecuter.java:30)
>         at
> org.gradle.initialization.DefaultGradleLauncher$4.run(DefaultGradleLauncher.java:154)
>         at org.gradle.internal.Factories$1.create(Factories.java:22)
>         at
> org.gradle.internal.progress.DefaultBuildOperationExecutor.run(DefaultBuildOperationExecutor.java:90)
>         at
> org.gradle.internal.progress.DefaultBuildOperationExecutor.run(DefaultBuildOperationExecutor.java:52)
>         at
> org.gradle.initialization.DefaultGradleLauncher.doBuildStages(DefaultGradleLauncher.java:151)
>         at
> org.gradle.initialization.DefaultGradleLauncher.access$200(DefaultGradleLauncher.java:32)
>         at
> org.gradle.initialization.DefaultGradleLauncher$1.create(DefaultGradleLauncher.java:99)
>         at
> org.gradle.initialization.DefaultGradleLauncher$1.create(DefaultGradleLauncher.java:93)
>         at
> org.gradle.internal.progress.DefaultBuildOperationExecutor.run(DefaultBuildOperationExecutor.java:90)
>         at
> org.gradle.internal.progress.DefaultBuildOperationExecutor.run(DefaultBuildOperationExecutor.java:62)
>         at
> org.gradle.initialization.DefaultGradleLauncher.doBuild(DefaultGradleLauncher.java:93)
>         at
> org.gradle.initialization.DefaultGradleLauncher.run(DefaultGradleLauncher.java:82)
>         at
> org.gradle.launcher.exec.InProcessBuildActionExecuter$DefaultBuildController.run(InProcessBuildActionExecuter.java:94)
>         at
> org.gradle.tooling.internal.provider.ExecuteBuildActionRunner.run(ExecuteBuildActionRunner.java:28)
>         at
> org.gradle.launcher.exec.ChainingBuildActionRunner.run(ChainingBuildActionRunner.java:35)
>         at
> org.gradle.launcher.exec.InProcessBuildActionExecuter.execute(InProcessBuildActionExecuter.java:43)
>         at
> org.gradle.launcher.exec.InProcessBuildActionExecuter.execute(InProcessBuildActionExecuter.java:28)
>         at
> org.gradle.launcher.exec.ContinuousBuildActionExecuter.execute(ContinuousBuildActionExecuter.java:75)
>         at
> org.gradle.launcher.exec.ContinuousBuildActionExecuter.execute(ContinuousBuildActionExecuter.java:45)
>         at
> org.gradle.launcher.exec.DaemonUsageSuggestingBuildActionExecuter.execute(DaemonUsageSuggestingBuildActionExecuter.java:51)
>         at
> org.gradle.launcher.exec.DaemonUsageSuggestingBuildActionExecuter.execute(DaemonUsageSuggestingBuildActionExecuter.java:28)
>         at
> org.gradle.launcher.cli.RunBuildAction.run(RunBuildAction.java:43)
>         at
> org.gradle.internal.Actions$RunnableActionAdapter.execute(Actions.java:170)
>         at
> org.gradle.launcher.cli.CommandLineActionFactory$ParseAndBuildAction.execute(CommandLineActionFactory.java:237)
>         at
> org.gradle.launcher.cli.CommandLineActionFactory$ParseAndBuildAction.execute(CommandLineActionFactory.java:210)
>         at
> org.gradle.launcher.cli.JavaRuntimeValidationAction.execute(JavaRuntimeValidationAction.java:35)
>         at
> org.gradle.launcher.cli.JavaRuntimeValidationAction.execute(JavaRuntimeValidationAction.java:24)
>         at
> org.gradle.launcher.cli.CommandLineActionFactory$WithLogging.execute(CommandLineActionFactory.java:206)
>         at
> org.gradle.launcher.cli.CommandLineActionFactory$WithLogging.execute(CommandLineActionFactory.java:169)
>         at
> org.gradle.launcher.cli.ExceptionReportingAction.execute(ExceptionReportingAction.java:33)
>         at
> org.gradle.launcher.cli.ExceptionReportingAction.execute(ExceptionReportingAction.java:22)
>         at org.gradle.launcher.Main.doAction(Main.java:33)
>         at org.gradle.launcher.bootstrap.EntryPoint.run(EntryPoint.java:45)
>         at
> org.gradle.launcher.bootstrap.ProcessBootstrap.runNoExit(ProcessBootstrap.java:54)
>         at
> org.gradle.launcher.bootstrap.ProcessBootstrap.run(ProcessBootstrap.java:35)
>         at org.gradle.launcher.GradleMain.main(GradleMain.java:23)
>         at
> org.gradle.wrapper.BootstrapMainStarter.start(BootstrapMainStarter.java:30)
>         at
> org.gradle.wrapper.WrapperExecutor.execute(WrapperExecutor.java:127)
>         at
> org.gradle.wrapper.GradleWrapperMain.main(GradleWrapperMain.java:55)
> Caused by: org.gradle.api.GradleException: Found 19 files with
> unapproved/unknown licenses. See <
> https://builds.apache.org/job/Zest(JavaEdition)-develop-java8-checkDists/ws/build/reports/rat/index.html
> >
>         at org.apache.rat.gradle.RatTask.rat(RatTask.groovy:53)
>         at
> org.gradle.internal.reflect.JavaMethod.invoke(JavaMethod.java:75)
>         at
> org.gradle.api.internal.project.taskfactory.AnnotationProcessingTaskFactory$StandardTaskAction.doExecute(AnnotationProcessingTaskFactory.java:227)
>         at
> org.gradle.api.internal.project.taskfactory.AnnotationProcessingTaskFactory$StandardTaskAction.execute(AnnotationProcessingTaskFactory.java:220)
>         at
> org.gradle.api.internal.project.taskfactory.AnnotationProcessingTaskFactory$StandardTaskAction.execute(AnnotationProcessingTaskFactory.java:209)
>         at
> org.gradle.api.internal.AbstractTask$TaskActionWrapper.execute(AbstractTask.java:585)
>         at
> org.gradle.api.internal.AbstractTask$TaskActionWrapper.execute(AbstractTask.java:568)
>         at
> org.gradle.api.internal.tasks.execution.ExecuteActionsTaskExecuter.executeAction(ExecuteActionsTaskExecuter.java:80)
>         at
> org.gradle.api.internal.tasks.execution.ExecuteActionsTaskExecuter.executeActions(ExecuteActionsTaskExecuter.java:61)
>         ... 60 more
>
>
> BUILD FAILED
>
> Total time: 13 mins 54.709 secs
> Build step 'Invoke Gradle script' changed build result to FAILURE
> Build step 'Invoke Gradle script' marked build as failure
> Xvfb stopping
> Archiving artifacts
> Recording test results
> Publishing Javadoc
>



-- 
Niclas Hedhman, Software Developer
http://zest.apache.org - New Energy for Java

Mime
  • Unnamed multipart/alternative (inline, None, 0 bytes)
View raw message