polygene-dev mailing list archives

Site index · List index
Message view « Date » · « Thread »
Top « Date » · « Thread »
From Niclas Hedhman <nic...@hedhman.org>
Subject Re: Build failed in Jenkins: Zest(JavaEdition)-develop-java8-check #145
Date Sat, 16 Apr 2016 16:24:31 GMT
Argghhhh...

I know this problem... Mac OS X is not case-sensitive by default (and the
default drive can't be made case-sensitive), and if I just rename this to
proper case, GIT (at least used to) craps out completely on
case-insensitive file system...
Fix tomorrow.

On Sat, Apr 16, 2016 at 3:26 PM, Apache Jenkins Server <
jenkins@builds.apache.org> wrote:

> See <
> https://builds.apache.org/job/Zest(JavaEdition)-develop-java8-check/145/changes
> >
>
> Changes:
>
> [niclas] Forgotten to call the super.assemble() in other serialization
> tests.
>
> [niclas] Wrong sign for detecting something went wrong in the removal of
> test
>
> ------------------------------------------
> [...truncated 1820 lines...]
> :org.apache.zest.libraries:org.apache.zest.library.spring:classes
> :org.apache.zest.libraries:org.apache.zest.library.spring:compileTestJava
>
> :org.apache.zest.libraries:org.apache.zest.library.spring:processTestResources
> :org.apache.zest.libraries:org.apache.zest.library.spring:testClasses
> :org.apache.zest.libraries:org.apache.zest.library.spring:test
>
> org.apache.zest.library.spring.importer.ZestImportServiceTest >
> givenImportedSpringServicesWhenServicesAreInjectedThenCanIdentifyByName
> FAILED
>     org.apache.zest.api.unitofwork.UnitOfWorkException at
> ZestImportServiceTest.java:77
>
> org.apache.zest.library.spring.importer.ZestImportServiceTest >
> givenImportedSpringServicesWhenServiceIsInjectedThenUseSpringService FAILED
>     org.apache.zest.api.unitofwork.UnitOfWorkException at
> ZestImportServiceTest.java:55
>
> org.apache.zest.library.spring.importer.ZestImportServiceTest >
> givenImportedSpringServicesWhenServicesAreFoundThenCanIdentifyByName FAILED
>     org.apache.zest.api.unitofwork.UnitOfWorkException at
> ZestImportServiceTest.java:99
>
> 4 tests completed, 3 failed
> There were failing tests. See the report at: file://<
> https://builds.apache.org/job/Zest(JavaEdition)-develop-java8-check/ws/libraries/spring/build/reports/tests/index.html
> >
>
> :org.apache.zest.libraries:org.apache.zest.library.sql-bonecp:makeVersionClass
>
> :org.apache.zest.libraries:org.apache.zest.library.sql-bonecp:compileVersionJava
> :org.apache.zest.libraries:org.apache.zest.library.sql-bonecp:compileJava
>
> :org.apache.zest.libraries:org.apache.zest.library.sql-bonecp:honkerGenDependencies
>
> :org.apache.zest.libraries:org.apache.zest.library.sql-bonecp:honkerGenLicense
>
> :org.apache.zest.libraries:org.apache.zest.library.sql-bonecp:honkerGenNotice
> :org.apache.zest.libraries:org.apache.zest.library.sql-bonecp:processResources
> UP-TO-DATE
> :org.apache.zest.libraries:org.apache.zest.library.sql-bonecp:classes
> :org.apache.zest.libraries:org.apache.zest.library.sql-bonecp:processVersionResources
> UP-TO-DATE
>
> :org.apache.zest.libraries:org.apache.zest.library.sql-bonecp:versionClasses
> :org.apache.zest.libraries:org.apache.zest.library.sql-bonecp:jar
>
> :org.apache.zest.libraries:org.apache.zest.library.sql-liquibase:makeVersionClass
>
> :org.apache.zest.libraries:org.apache.zest.library.sql-liquibase:compileVersionJava
>
> :org.apache.zest.libraries:org.apache.zest.library.sql-liquibase:compileJava
>
> :org.apache.zest.libraries:org.apache.zest.library.sql-liquibase:honkerGenDependencies
>
> :org.apache.zest.libraries:org.apache.zest.library.sql-liquibase:honkerGenLicense
>
> :org.apache.zest.libraries:org.apache.zest.library.sql-liquibase:honkerGenNotice
> :org.apache.zest.libraries:org.apache.zest.library.sql-liquibase:processResources
> UP-TO-DATE
> :org.apache.zest.libraries:org.apache.zest.library.sql-liquibase:classes
> :org.apache.zest.libraries:org.apache.zest.library.sql-liquibase:processVersionResources
> UP-TO-DATE
>
> :org.apache.zest.libraries:org.apache.zest.library.sql-liquibase:versionClasses
> :org.apache.zest.libraries:org.apache.zest.library.sql-liquibase:jar
> :org.apache.zest.libraries:org.apache.zest.library.sql:compileTestJava
> :org.apache.zest.libraries:org.apache.zest.library.sql:processTestResources
> :org.apache.zest.libraries:org.apache.zest.library.sql:testClasses
> :org.apache.zest.libraries:org.apache.zest.library.sql:test
> :org.apache.zest.libraries:org.apache.zest.library.sql-bonecp:compileTestJava
> UP-TO-DATE
> :org.apache.zest.libraries:org.apache.zest.library.sql-bonecp:processTestResources
> UP-TO-DATE
> :org.apache.zest.libraries:org.apache.zest.library.sql-bonecp:testClasses
> UP-TO-DATE
> :org.apache.zest.libraries:org.apache.zest.library.sql-bonecp:test
> UP-TO-DATE
> :org.apache.zest.libraries:org.apache.zest.library.sql-dbcp:compileTestJava
> UP-TO-DATE
> :org.apache.zest.libraries:org.apache.zest.library.sql-dbcp:processTestResources
> UP-TO-DATE
> :org.apache.zest.libraries:org.apache.zest.library.sql-dbcp:testClasses
> UP-TO-DATE
> :org.apache.zest.libraries:org.apache.zest.library.sql-dbcp:test UP-TO-DATE
>
> :org.apache.zest.libraries:org.apache.zest.library.sql-liquibase:compileTestJava
>
> :org.apache.zest.libraries:org.apache.zest.library.sql-liquibase:processTestResources
>
> :org.apache.zest.libraries:org.apache.zest.library.sql-liquibase:testClasses
> :org.apache.zest.libraries:org.apache.zest.library.sql-liquibase:test
> :org.apache.zest.libraries:org.apache.zest.library.uid:makeVersionClass
> :org.apache.zest.libraries:org.apache.zest.library.uid:compileVersionJava
> :org.apache.zest.libraries:org.apache.zest.library.uid:compileJava
>
> :org.apache.zest.libraries:org.apache.zest.library.uid:honkerGenDependencies
> :org.apache.zest.libraries:org.apache.zest.library.uid:honkerGenLicense
> :org.apache.zest.libraries:org.apache.zest.library.uid:honkerGenNotice
> :org.apache.zest.libraries:org.apache.zest.library.uid:processResources
> UP-TO-DATE
> :org.apache.zest.libraries:org.apache.zest.library.uid:classes
> :org.apache.zest.libraries:org.apache.zest.library.uid:compileTestJava
> :org.apache.zest.libraries:org.apache.zest.library.uid:processTestResources
> UP-TO-DATE
> :org.apache.zest.libraries:org.apache.zest.library.uid:testClasses
> :org.apache.zest.libraries:org.apache.zest.library.uid:test
> :org.apache.zest.libraries:org.apache.zest.library.uowfile:makeVersionClass
>
> :org.apache.zest.libraries:org.apache.zest.library.uowfile:compileVersionJava
> :org.apache.zest.libraries:org.apache.zest.library.uowfile:compileJava
>
> :org.apache.zest.libraries:org.apache.zest.library.uowfile:honkerGenDependencies
> :org.apache.zest.libraries:org.apache.zest.library.uowfile:honkerGenLicense
> :org.apache.zest.libraries:org.apache.zest.library.uowfile:honkerGenNotice
> :org.apache.zest.libraries:org.apache.zest.library.uowfile:processResources
> UP-TO-DATE
> :org.apache.zest.libraries:org.apache.zest.library.uowfile:classes
> :org.apache.zest.libraries:org.apache.zest.library.uowfile:compileTestJava
>
> :org.apache.zest.libraries:org.apache.zest.library.uowfile:processTestResources
> :org.apache.zest.libraries:org.apache.zest.library.uowfile:testClasses
> :org.apache.zest.libraries:org.apache.zest.library.uowfile:test
> :org.apache.zest.samples:org.apache.zest.sample.dci:makeVersionClass
> :org.apache.zest.samples:org.apache.zest.sample.dci:compileVersionJava
> :org.apache.zest.samples:org.apache.zest.sample.dci:compileJavaNote: <
> https://builds.apache.org/job/Zest(JavaEdition)-develop-java8-check/ws/samples/dci/src/main/java/org/apache/zest/dci/moneytransfer/context/Role.java>
> uses unchecked or unsafe operations.
> Note: Recompile with -Xlint:unchecked for details.
>
> :org.apache.zest.samples:org.apache.zest.sample.dci:honkerGenDependencies
> :org.apache.zest.samples:org.apache.zest.sample.dci:honkerGenLicense
> :org.apache.zest.samples:org.apache.zest.sample.dci:honkerGenNotice
> :org.apache.zest.samples:org.apache.zest.sample.dci:processResources
> UP-TO-DATE
> :org.apache.zest.samples:org.apache.zest.sample.dci:classes
> :org.apache.zest.samples:org.apache.zest.sample.dci:compileTestJava
> :org.apache.zest.samples:org.apache.zest.sample.dci:processTestResources
> UP-TO-DATE
> :org.apache.zest.samples:org.apache.zest.sample.dci:testClasses
> :org.apache.zest.samples:org.apache.zest.sample.dci:test
> :org.apache.zest.samples:org.apache.zest.sample.dci-cargo:compileJava
> UP-TO-DATE
>
> :org.apache.zest.samples:org.apache.zest.sample.dci-cargo:honkerGenDependencies
> :org.apache.zest.samples:org.apache.zest.sample.dci-cargo:honkerGenLicense
> :org.apache.zest.samples:org.apache.zest.sample.dci-cargo:honkerGenNotice
> :org.apache.zest.samples:org.apache.zest.sample.dci-cargo:processResources
> UP-TO-DATE
> :org.apache.zest.samples:org.apache.zest.sample.dci-cargo:classes
> :org.apache.zest.samples:org.apache.zest.sample.dci-cargo:compileTestJava
> UP-TO-DATE
> :org.apache.zest.samples:org.apache.zest.sample.dci-cargo:processTestResources
> UP-TO-DATE
> :org.apache.zest.samples:org.apache.zest.sample.dci-cargo:testClasses
> UP-TO-DATE
> :org.apache.zest.samples:org.apache.zest.sample.dci-cargo:test UP-TO-DATE
> :org.apache.zest.extensions:org.apache.zest.extension.entitystore-memory:processVersionResources
> UP-TO-DATE
>
> :org.apache.zest.extensions:org.apache.zest.extension.entitystore-memory:versionClasses
>
> :org.apache.zest.extensions:org.apache.zest.extension.entitystore-memory:jar
> :org.apache.zest.samples:org.apache.zest.sample.forum:makeVersionClass
> :org.apache.zest.samples:org.apache.zest.sample.forum:compileVersionJava
> :org.apache.zest.samples:org.apache.zest.sample.forum:compileJava
> :org.apache.zest.samples:org.apache.zest.sample.forum:honkerGenDependencies
> :org.apache.zest.samples:org.apache.zest.sample.forum:honkerGenLicense
> :org.apache.zest.samples:org.apache.zest.sample.forum:honkerGenNotice
> :org.apache.zest.samples:org.apache.zest.sample.forum:processResources
> UP-TO-DATE
> :org.apache.zest.samples:org.apache.zest.sample.forum:classes
> :org.apache.zest.samples:org.apache.zest.sample.forum:compileTestJava
> :org.apache.zest.samples:org.apache.zest.sample.forum:processTestResources
> UP-TO-DATE
> :org.apache.zest.samples:org.apache.zest.sample.forum:testClasses
> :org.apache.zest.samples:org.apache.zest.sample.forum:test
> :org.apache.zest.samples:org.apache.zest.sample.rental:makeVersionClass
> :org.apache.zest.samples:org.apache.zest.sample.rental:compileVersionJava
> :org.apache.zest.samples:org.apache.zest.sample.rental:compileJavaNote: <
> https://builds.apache.org/job/Zest(JavaEdition)-develop-java8-check/ws/samples/rental/src/main/java/org/apache/zest/sample/rental/web/Page.java>
> uses unchecked or unsafe operations.
> Note: Recompile with -Xlint:unchecked for details.
>
>
> :org.apache.zest.samples:org.apache.zest.sample.rental:honkerGenDependencies
> :org.apache.zest.samples:org.apache.zest.sample.rental:honkerGenLicense
> :org.apache.zest.samples:org.apache.zest.sample.rental:honkerGenNotice
> :org.apache.zest.samples:org.apache.zest.sample.rental:processResources
> :org.apache.zest.samples:org.apache.zest.sample.rental:classes
> :org.apache.zest.samples:org.apache.zest.sample.rental:compileTestJava
> UP-TO-DATE
> :org.apache.zest.samples:org.apache.zest.sample.rental:processTestResources
> UP-TO-DATE
> :org.apache.zest.samples:org.apache.zest.sample.rental:testClasses
> UP-TO-DATE
> :org.apache.zest.samples:org.apache.zest.sample.rental:test UP-TO-DATE
> :org.apache.zest.extensions:org.apache.zest.extension.entitystore-sql:processVersionResources
> UP-TO-DATE
>
> :org.apache.zest.extensions:org.apache.zest.extension.entitystore-sql:versionClasses
> :org.apache.zest.extensions:org.apache.zest.extension.entitystore-sql:jar
> :org.apache.zest.extensions:org.apache.zest.extension.indexing-sql:processVersionResources
> UP-TO-DATE
>
> :org.apache.zest.extensions:org.apache.zest.extension.indexing-sql:versionClasses
> :org.apache.zest.extensions:org.apache.zest.extension.indexing-sql:jar
>
> :org.apache.zest.samples:org.apache.zest.sample.sql-support:makeVersionClass
>
> :org.apache.zest.samples:org.apache.zest.sample.sql-support:compileVersionJava
> :org.apache.zest.samples:org.apache.zest.sample.sql-support:compileJava
>
> :org.apache.zest.samples:org.apache.zest.sample.sql-support:honkerGenDependencies
>
> :org.apache.zest.samples:org.apache.zest.sample.sql-support:honkerGenLicense
> :org.apache.zest.samples:org.apache.zest.sample.sql-support:honkerGenNotice
>
> :org.apache.zest.samples:org.apache.zest.sample.sql-support:processResources
> :org.apache.zest.samples:org.apache.zest.sample.sql-support:classes
> :org.apache.zest.samples:org.apache.zest.sample.sql-support:compileTestJava
> UP-TO-DATE
> :org.apache.zest.samples:org.apache.zest.sample.sql-support:processTestResources
> UP-TO-DATE
> :org.apache.zest.samples:org.apache.zest.sample.sql-support:testClasses
> UP-TO-DATE
> :org.apache.zest.samples:org.apache.zest.sample.sql-support:test UP-TO-DATE
> :org.apache.zest.samples:org.apache.zest.sample.swing:makeVersionClass
> :org.apache.zest.samples:org.apache.zest.sample.swing:compileVersionJava
> :org.apache.zest.samples:org.apache.zest.sample.swing:compileJavaNote:
> Some input files use unchecked or unsafe operations.
> Note: Recompile with -Xlint:unchecked for details.
>
> :org.apache.zest.samples:org.apache.zest.sample.swing:honkerGenDependencies
> :org.apache.zest.samples:org.apache.zest.sample.swing:honkerGenLicense
> :org.apache.zest.samples:org.apache.zest.sample.swing:honkerGenNotice
> :org.apache.zest.samples:org.apache.zest.sample.swing:processResources
> UP-TO-DATE
> :org.apache.zest.samples:org.apache.zest.sample.swing:classes
> :org.apache.zest.samples:org.apache.zest.sample.swing:compileTestJava
> UP-TO-DATE
> :org.apache.zest.samples:org.apache.zest.sample.swing:processTestResources
> UP-TO-DATE
> :org.apache.zest.samples:org.apache.zest.sample.swing:testClasses
> UP-TO-DATE
> :org.apache.zest.samples:org.apache.zest.sample.swing:test UP-TO-DATE
> :org.apache.zest.tests:org.apache.zest.test.performance:makeVersionClass
> :org.apache.zest.tests:org.apache.zest.test.performance:compileVersionJava
> :org.apache.zest.tests:org.apache.zest.test.performance:compileJava
>
> :org.apache.zest.tests:org.apache.zest.test.performance:honkerGenDependencies
> :org.apache.zest.tests:org.apache.zest.test.performance:honkerGenLicense
> :org.apache.zest.tests:org.apache.zest.test.performance:honkerGenNotice
> :org.apache.zest.tests:org.apache.zest.test.performance:processResources
> UP-TO-DATE
> :org.apache.zest.tests:org.apache.zest.test.performance:classes
> :org.apache.zest.tests:org.apache.zest.test.performance:compileTestJava
> UP-TO-DATE
> :org.apache.zest.tests:org.apache.zest.test.performance:processTestResources
> UP-TO-DATE
> :org.apache.zest.tests:org.apache.zest.test.performance:testClasses
> UP-TO-DATE
> :org.apache.zest.tests:org.apache.zest.test.performance:test UP-TO-DATE
> :org.apache.zest.tests:org.apache.zest.test.regression:makeVersionClass
> :org.apache.zest.tests:org.apache.zest.test.regression:compileVersionJava
> :org.apache.zest.tests:org.apache.zest.test.regression:compileJava
>
> :org.apache.zest.tests:org.apache.zest.test.regression:honkerGenDependencies
> :org.apache.zest.tests:org.apache.zest.test.regression:honkerGenLicense
> :org.apache.zest.tests:org.apache.zest.test.regression:honkerGenNotice
> :org.apache.zest.tests:org.apache.zest.test.regression:processResources
> UP-TO-DATE
> :org.apache.zest.tests:org.apache.zest.test.regression:classes
> :org.apache.zest.tests:org.apache.zest.test.regression:compileTestJava
> UP-TO-DATE
> :org.apache.zest.tests:org.apache.zest.test.regression:processTestResources
> UP-TO-DATE
> :org.apache.zest.tests:org.apache.zest.test.regression:testClasses
> UP-TO-DATE
> :org.apache.zest.tests:org.apache.zest.test.regression:test UP-TO-DATE
> :org.apache.zest.tools:org.apache.zest.tool.envisage:makeVersionClass
> :org.apache.zest.tools:org.apache.zest.tool.envisage:compileVersionJava
> :org.apache.zest.tools:org.apache.zest.tool.model-detail:makeVersionClass
> :org.apache.zest.tools:org.apache.zest.tool.model-detail:compileVersionJava
> :org.apache.zest.tools:org.apache.zest.tool.model-detail:compileJava
>
> :org.apache.zest.tools:org.apache.zest.tool.model-detail:honkerGenDependencies
> :org.apache.zest.tools:org.apache.zest.tool.model-detail:honkerGenLicense
> :org.apache.zest.tools:org.apache.zest.tool.model-detail:honkerGenNotice
> :org.apache.zest.tools:org.apache.zest.tool.model-detail:processResources
> UP-TO-DATE
> :org.apache.zest.tools:org.apache.zest.tool.model-detail:classes
> :org.apache.zest.tools:org.apache.zest.tool.model-detail:processVersionResources
> UP-TO-DATE
> :org.apache.zest.tools:org.apache.zest.tool.model-detail:versionClasses
> :org.apache.zest.tools:org.apache.zest.tool.model-detail:jar
> :org.apache.zest.tools:org.apache.zest.tool.envisage:compileJavaNote: Some
> input files use unchecked or unsafe operations.
> Note: Recompile with -Xlint:unchecked for details.
>
> :org.apache.zest.tools:org.apache.zest.tool.envisage:honkerGenDependencies
> :org.apache.zest.tools:org.apache.zest.tool.envisage:honkerGenLicense
> :org.apache.zest.tools:org.apache.zest.tool.envisage:honkerGenNotice
> :org.apache.zest.tools:org.apache.zest.tool.envisage:processResources
> :org.apache.zest.tools:org.apache.zest.tool.envisage:classes
> :org.apache.zest.tools:org.apache.zest.tool.envisage:compileTestJava
> :org.apache.zest.tools:org.apache.zest.tool.envisage:processTestResources
> UP-TO-DATE
> :org.apache.zest.tools:org.apache.zest.tool.envisage:testClasses
> :org.apache.zest.tools:org.apache.zest.tool.envisage:test
> :org.apache.zest.tools:org.apache.zest.tool.model-detail:compileTestJavaNote:
> <
> https://builds.apache.org/job/Zest(JavaEdition)-develop-java8-check/ws/tools/model-detail/src/test/java/org/apache/zest/tools/model/VisitableDetailTest.java>
> uses unchecked or unsafe operations.
> Note: Recompile with -Xlint:unchecked for details.
>
> :org.apache.zest.tools:org.apache.zest.tool.model-detail:processTestResources
> UP-TO-DATE
> :org.apache.zest.tools:org.apache.zest.tool.model-detail:testClasses
> :org.apache.zest.tools:org.apache.zest.tool.model-detail:test
> :org.apache.zest.tools:org.apache.zest.tool.shell:makeVersionClass
> :org.apache.zest.tools:org.apache.zest.tool.shell:compileVersionJava
> :org.apache.zest.tools:org.apache.zest.tool.shell:compileJava
> :org.apache.zest.tools:org.apache.zest.tool.shell:honkerGenDependencies
> :org.apache.zest.tools:org.apache.zest.tool.shell:honkerGenLicense
> :org.apache.zest.tools:org.apache.zest.tool.shell:honkerGenNotice
> :org.apache.zest.tools:org.apache.zest.tool.shell:processResources
> :org.apache.zest.tools:org.apache.zest.tool.shell:classes
> :org.apache.zest.tools:org.apache.zest.tool.shell:compileTestJava<
> https://builds.apache.org/job/Zest(JavaEdition)-develop-java8-check/ws/tools/shell/src/test/java/org/apache/zest/tools/shell/create/project/RestappProjectCreatorTest.java>:34:
> error: class RestAppProjectCreatorTest is public, should be declared in a
> file named RestAppProjectCreatorTest.java
> public class RestAppProjectCreatorTest
>        ^
> 1 error
>  FAILED
>
> FAILURE: Build failed with an exception.
>
> * What went wrong:
> Execution failed for task
> ':org.apache.zest.tools:org.apache.zest.tool.shell:compileTestJava'.
> > Compilation failed; see the compiler error output for details.
>
> * Try:
> Run with --stacktrace option to get the stack trace. Run with --info or
> --debug option to get more log output.
>
> BUILD FAILED
>
> Total time: 56 mins 39.26 secs
> Build step 'Invoke Gradle script' changed build result to FAILURE
> Build step 'Invoke Gradle script' marked build as failure
> Xvfb stopping
> Recording test results
>



-- 
Niclas Hedhman, Software Developer
http://zest.apache.org - New Energy for Java

Mime
  • Unnamed multipart/alternative (inline, None, 0 bytes)
View raw message