polygene-dev mailing list archives

Site index · List index
Message view « Date » · « Thread »
Top « Date » · « Thread »
From Apache Jenkins Server <jenk...@builds.apache.org>
Subject Build failed in Jenkins: Zest(JavaEdition)-develop-java8-checkDists #65
Date Sun, 17 Apr 2016 11:22:10 GMT
See <https://builds.apache.org/job/Zest(JavaEdition)-develop-java8-checkDists/65/changes>

Changes:

[niclas] Fixed failing testcases, as a lot of previous lazy initialization was

[niclas] Cleaning up various small bits.

[niclas] Fixed testcase. Added "Zest Shell" to build

[niclas] Can't manage to get Shell included in build...

------------------------------------------
[...truncated 1671 lines...]
:org.apache.zest.samples:org.apache.zest.sample.dci:honkerGenNotice
:org.apache.zest.samples:org.apache.zest.sample.dci:processResources UP-TO-DATE
:org.apache.zest.samples:org.apache.zest.sample.dci:classes
:org.apache.zest.samples:org.apache.zest.sample.dci:compileTestJava
:org.apache.zest.samples:org.apache.zest.sample.dci:processTestResources UP-TO-DATE
:org.apache.zest.samples:org.apache.zest.sample.dci:testClasses
:org.apache.zest.samples:org.apache.zest.sample.dci:test
:org.apache.zest.samples:org.apache.zest.sample.dci-cargo:compileJava UP-TO-DATE
:org.apache.zest.samples:org.apache.zest.sample.dci-cargo:honkerGenDependencies
:org.apache.zest.samples:org.apache.zest.sample.dci-cargo:honkerGenLicense
:org.apache.zest.samples:org.apache.zest.sample.dci-cargo:honkerGenNotice
:org.apache.zest.samples:org.apache.zest.sample.dci-cargo:processResources UP-TO-DATE
:org.apache.zest.samples:org.apache.zest.sample.dci-cargo:classes
:org.apache.zest.samples:org.apache.zest.sample.dci-cargo:compileTestJava UP-TO-DATE
:org.apache.zest.samples:org.apache.zest.sample.dci-cargo:processTestResources UP-TO-DATE
:org.apache.zest.samples:org.apache.zest.sample.dci-cargo:testClasses UP-TO-DATE
:org.apache.zest.samples:org.apache.zest.sample.dci-cargo:test UP-TO-DATE
:org.apache.zest.extensions:org.apache.zest.extension.entitystore-memory:processVersionResources
UP-TO-DATE
:org.apache.zest.extensions:org.apache.zest.extension.entitystore-memory:versionClasses
:org.apache.zest.extensions:org.apache.zest.extension.entitystore-memory:jar
:org.apache.zest.samples:org.apache.zest.sample.forum:makeVersionClass
:org.apache.zest.samples:org.apache.zest.sample.forum:compileVersionJava
:org.apache.zest.samples:org.apache.zest.sample.forum:compileJava
:org.apache.zest.samples:org.apache.zest.sample.forum:honkerGenDependencies
:org.apache.zest.samples:org.apache.zest.sample.forum:honkerGenLicense
:org.apache.zest.samples:org.apache.zest.sample.forum:honkerGenNotice
:org.apache.zest.samples:org.apache.zest.sample.forum:processResources UP-TO-DATE
:org.apache.zest.samples:org.apache.zest.sample.forum:classes
:org.apache.zest.samples:org.apache.zest.sample.forum:compileTestJava
:org.apache.zest.samples:org.apache.zest.sample.forum:processTestResources UP-TO-DATE
:org.apache.zest.samples:org.apache.zest.sample.forum:testClasses
:org.apache.zest.samples:org.apache.zest.sample.forum:test
:org.apache.zest.samples:org.apache.zest.sample.rental:makeVersionClass
:org.apache.zest.samples:org.apache.zest.sample.rental:compileVersionJava
:org.apache.zest.samples:org.apache.zest.sample.rental:compileJavaNote: <https://builds.apache.org/job/Zest(JavaEdition)-develop-java8-checkDists/ws/samples/rental/src/main/java/org/apache/zest/sample/rental/web/Page.java>
uses unchecked or unsafe operations.
Note: Recompile with -Xlint:unchecked for details.

:org.apache.zest.samples:org.apache.zest.sample.rental:honkerGenDependencies
:org.apache.zest.samples:org.apache.zest.sample.rental:honkerGenLicense
:org.apache.zest.samples:org.apache.zest.sample.rental:honkerGenNotice
:org.apache.zest.samples:org.apache.zest.sample.rental:processResources
:org.apache.zest.samples:org.apache.zest.sample.rental:classes
:org.apache.zest.samples:org.apache.zest.sample.rental:compileTestJava UP-TO-DATE
:org.apache.zest.samples:org.apache.zest.sample.rental:processTestResources UP-TO-DATE
:org.apache.zest.samples:org.apache.zest.sample.rental:testClasses UP-TO-DATE
:org.apache.zest.samples:org.apache.zest.sample.rental:test UP-TO-DATE
:org.apache.zest.extensions:org.apache.zest.extension.entitystore-sql:processVersionResources
UP-TO-DATE
:org.apache.zest.extensions:org.apache.zest.extension.entitystore-sql:versionClasses
:org.apache.zest.extensions:org.apache.zest.extension.entitystore-sql:jar
:org.apache.zest.extensions:org.apache.zest.extension.indexing-sql:processVersionResources
UP-TO-DATE
:org.apache.zest.extensions:org.apache.zest.extension.indexing-sql:versionClasses
:org.apache.zest.extensions:org.apache.zest.extension.indexing-sql:jar
:org.apache.zest.samples:org.apache.zest.sample.sql-support:makeVersionClass
:org.apache.zest.samples:org.apache.zest.sample.sql-support:compileVersionJava
:org.apache.zest.samples:org.apache.zest.sample.sql-support:compileJava
:org.apache.zest.samples:org.apache.zest.sample.sql-support:honkerGenDependencies
:org.apache.zest.samples:org.apache.zest.sample.sql-support:honkerGenLicense
:org.apache.zest.samples:org.apache.zest.sample.sql-support:honkerGenNotice
:org.apache.zest.samples:org.apache.zest.sample.sql-support:processResources
:org.apache.zest.samples:org.apache.zest.sample.sql-support:classes
:org.apache.zest.samples:org.apache.zest.sample.sql-support:compileTestJava UP-TO-DATE
:org.apache.zest.samples:org.apache.zest.sample.sql-support:processTestResources UP-TO-DATE
:org.apache.zest.samples:org.apache.zest.sample.sql-support:testClasses UP-TO-DATE
:org.apache.zest.samples:org.apache.zest.sample.sql-support:test UP-TO-DATE
:org.apache.zest.samples:org.apache.zest.sample.swing:makeVersionClass
:org.apache.zest.samples:org.apache.zest.sample.swing:compileVersionJava
:org.apache.zest.samples:org.apache.zest.sample.swing:compileJavaNote: Some input files use
unchecked or unsafe operations.
Note: Recompile with -Xlint:unchecked for details.

:org.apache.zest.samples:org.apache.zest.sample.swing:honkerGenDependencies
:org.apache.zest.samples:org.apache.zest.sample.swing:honkerGenLicense
:org.apache.zest.samples:org.apache.zest.sample.swing:honkerGenNotice
:org.apache.zest.samples:org.apache.zest.sample.swing:processResources UP-TO-DATE
:org.apache.zest.samples:org.apache.zest.sample.swing:classes
:org.apache.zest.samples:org.apache.zest.sample.swing:compileTestJava UP-TO-DATE
:org.apache.zest.samples:org.apache.zest.sample.swing:processTestResources UP-TO-DATE
:org.apache.zest.samples:org.apache.zest.sample.swing:testClasses UP-TO-DATE
:org.apache.zest.samples:org.apache.zest.sample.swing:test UP-TO-DATE
:org.apache.zest.tests:org.apache.zest.test.performance:makeVersionClass
:org.apache.zest.tests:org.apache.zest.test.performance:compileVersionJava
:org.apache.zest.tests:org.apache.zest.test.performance:compileJava
:org.apache.zest.tests:org.apache.zest.test.performance:honkerGenDependencies
:org.apache.zest.tests:org.apache.zest.test.performance:honkerGenLicense
:org.apache.zest.tests:org.apache.zest.test.performance:honkerGenNotice
:org.apache.zest.tests:org.apache.zest.test.performance:processResources UP-TO-DATE
:org.apache.zest.tests:org.apache.zest.test.performance:classes
:org.apache.zest.tests:org.apache.zest.test.performance:compileTestJava UP-TO-DATE
:org.apache.zest.tests:org.apache.zest.test.performance:processTestResources UP-TO-DATE
:org.apache.zest.tests:org.apache.zest.test.performance:testClasses UP-TO-DATE
:org.apache.zest.tests:org.apache.zest.test.performance:test UP-TO-DATE
:org.apache.zest.tests:org.apache.zest.test.regression:makeVersionClass
:org.apache.zest.tests:org.apache.zest.test.regression:compileVersionJava
:org.apache.zest.tests:org.apache.zest.test.regression:compileJava
:org.apache.zest.tests:org.apache.zest.test.regression:honkerGenDependencies
:org.apache.zest.tests:org.apache.zest.test.regression:honkerGenLicense
:org.apache.zest.tests:org.apache.zest.test.regression:honkerGenNotice
:org.apache.zest.tests:org.apache.zest.test.regression:processResources UP-TO-DATE
:org.apache.zest.tests:org.apache.zest.test.regression:classes
:org.apache.zest.tests:org.apache.zest.test.regression:compileTestJava UP-TO-DATE
:org.apache.zest.tests:org.apache.zest.test.regression:processTestResources UP-TO-DATE
:org.apache.zest.tests:org.apache.zest.test.regression:testClasses UP-TO-DATE
:org.apache.zest.tests:org.apache.zest.test.regression:test UP-TO-DATE
:org.apache.zest.tools:org.apache.zest.tool.envisage:makeVersionClass
:org.apache.zest.tools:org.apache.zest.tool.envisage:compileVersionJava
:org.apache.zest.tools:org.apache.zest.tool.model-detail:makeVersionClass
:org.apache.zest.tools:org.apache.zest.tool.model-detail:compileVersionJava
:org.apache.zest.tools:org.apache.zest.tool.model-detail:compileJava
:org.apache.zest.tools:org.apache.zest.tool.model-detail:honkerGenDependencies
:org.apache.zest.tools:org.apache.zest.tool.model-detail:honkerGenLicense
:org.apache.zest.tools:org.apache.zest.tool.model-detail:honkerGenNotice
:org.apache.zest.tools:org.apache.zest.tool.model-detail:processResources UP-TO-DATE
:org.apache.zest.tools:org.apache.zest.tool.model-detail:classes
:org.apache.zest.tools:org.apache.zest.tool.model-detail:processVersionResources UP-TO-DATE
:org.apache.zest.tools:org.apache.zest.tool.model-detail:versionClasses
:org.apache.zest.tools:org.apache.zest.tool.model-detail:jar
:org.apache.zest.tools:org.apache.zest.tool.envisage:compileJavaNote: Some input files use
unchecked or unsafe operations.
Note: Recompile with -Xlint:unchecked for details.

:org.apache.zest.tools:org.apache.zest.tool.envisage:honkerGenDependencies
:org.apache.zest.tools:org.apache.zest.tool.envisage:honkerGenLicense
:org.apache.zest.tools:org.apache.zest.tool.envisage:honkerGenNotice
:org.apache.zest.tools:org.apache.zest.tool.envisage:processResources
:org.apache.zest.tools:org.apache.zest.tool.envisage:classes
:org.apache.zest.tools:org.apache.zest.tool.envisage:compileTestJava
:org.apache.zest.tools:org.apache.zest.tool.envisage:processTestResources UP-TO-DATE
:org.apache.zest.tools:org.apache.zest.tool.envisage:testClasses
:org.apache.zest.tools:org.apache.zest.tool.envisage:test
:org.apache.zest.tools:org.apache.zest.tool.model-detail:compileTestJavaNote: <https://builds.apache.org/job/Zest(JavaEdition)-develop-java8-checkDists/ws/tools/model-detail/src/test/java/org/apache/zest/tools/model/VisitableDetailTest.java>
uses unchecked or unsafe operations.
Note: Recompile with -Xlint:unchecked for details.

:org.apache.zest.tools:org.apache.zest.tool.model-detail:processTestResources UP-TO-DATE
:org.apache.zest.tools:org.apache.zest.tool.model-detail:testClasses
:org.apache.zest.tools:org.apache.zest.tool.model-detail:test
:org.apache.zest.tools:org.apache.zest.tool.shell:makeVersionClass
:org.apache.zest.tools:org.apache.zest.tool.shell:compileVersionJava
:org.apache.zest.tools:org.apache.zest.tool.shell:compileJava
:org.apache.zest.tools:org.apache.zest.tool.shell:honkerGenDependencies
:org.apache.zest.tools:org.apache.zest.tool.shell:honkerGenLicense
:org.apache.zest.tools:org.apache.zest.tool.shell:honkerGenNotice
:org.apache.zest.tools:org.apache.zest.tool.shell:processResources
:org.apache.zest.tools:org.apache.zest.tool.shell:classes
:org.apache.zest.tools:org.apache.zest.tool.shell:compileTestJava<https://builds.apache.org/job/Zest(JavaEdition)-develop-java8-checkDists/ws/tools/shell/src/test/java/org/apache/zest/tools/shell/create/project/RestappProjectCreatorTest.java>:34:
error: class RestAppProjectCreatorTest is public, should be declared in a file named RestAppProjectCreatorTest.java
public class RestAppProjectCreatorTest
       ^
1 error
 FAILED

FAILURE: Build failed with an exception.

* What went wrong:
Execution failed for task ':org.apache.zest.tools:org.apache.zest.tool.shell:compileTestJava'.
> Compilation failed; see the compiler error output for details.

* Try:
Run with --info or --debug option to get more log output.

* Exception is:
org.gradle.api.tasks.TaskExecutionException: Execution failed for task ':org.apache.zest.tools:org.apache.zest.tool.shell:compileTestJava'.
	at org.gradle.api.internal.tasks.execution.ExecuteActionsTaskExecuter.executeActions(ExecuteActionsTaskExecuter.java:69)
	at org.gradle.api.internal.tasks.execution.ExecuteActionsTaskExecuter.execute(ExecuteActionsTaskExecuter.java:46)
	at org.gradle.api.internal.tasks.execution.PostExecutionAnalysisTaskExecuter.execute(PostExecutionAnalysisTaskExecuter.java:35)
	at org.gradle.api.internal.tasks.execution.SkipUpToDateTaskExecuter.execute(SkipUpToDateTaskExecuter.java:64)
	at org.gradle.api.internal.tasks.execution.ValidatingTaskExecuter.execute(ValidatingTaskExecuter.java:58)
	at org.gradle.api.internal.tasks.execution.SkipEmptySourceFilesTaskExecuter.execute(SkipEmptySourceFilesTaskExecuter.java:52)
	at org.gradle.api.internal.tasks.execution.SkipTaskWithNoActionsExecuter.execute(SkipTaskWithNoActionsExecuter.java:52)
	at org.gradle.api.internal.tasks.execution.SkipOnlyIfTaskExecuter.execute(SkipOnlyIfTaskExecuter.java:53)
	at org.gradle.api.internal.tasks.execution.ExecuteAtMostOnceTaskExecuter.execute(ExecuteAtMostOnceTaskExecuter.java:43)
	at org.gradle.execution.taskgraph.DefaultTaskGraphExecuter$EventFiringTaskWorker.execute(DefaultTaskGraphExecuter.java:203)
	at org.gradle.execution.taskgraph.DefaultTaskGraphExecuter$EventFiringTaskWorker.execute(DefaultTaskGraphExecuter.java:185)
	at org.gradle.execution.taskgraph.AbstractTaskPlanExecutor$TaskExecutorWorker.processTask(AbstractTaskPlanExecutor.java:66)
	at org.gradle.execution.taskgraph.AbstractTaskPlanExecutor$TaskExecutorWorker.run(AbstractTaskPlanExecutor.java:50)
	at org.gradle.execution.taskgraph.DefaultTaskPlanExecutor.process(DefaultTaskPlanExecutor.java:25)
	at org.gradle.execution.taskgraph.DefaultTaskGraphExecuter.execute(DefaultTaskGraphExecuter.java:110)
	at org.gradle.execution.SelectedTaskExecutionAction.execute(SelectedTaskExecutionAction.java:37)
	at org.gradle.execution.DefaultBuildExecuter.execute(DefaultBuildExecuter.java:37)
	at org.gradle.execution.DefaultBuildExecuter.access$000(DefaultBuildExecuter.java:23)
	at org.gradle.execution.DefaultBuildExecuter$1.proceed(DefaultBuildExecuter.java:43)
	at org.gradle.execution.DryRunBuildExecutionAction.execute(DryRunBuildExecutionAction.java:32)
	at org.gradle.execution.DefaultBuildExecuter.execute(DefaultBuildExecuter.java:37)
	at org.gradle.execution.DefaultBuildExecuter.execute(DefaultBuildExecuter.java:30)
	at org.gradle.initialization.DefaultGradleLauncher$4.run(DefaultGradleLauncher.java:154)
	at org.gradle.internal.Factories$1.create(Factories.java:22)
	at org.gradle.internal.progress.DefaultBuildOperationExecutor.run(DefaultBuildOperationExecutor.java:90)
	at org.gradle.internal.progress.DefaultBuildOperationExecutor.run(DefaultBuildOperationExecutor.java:52)
	at org.gradle.initialization.DefaultGradleLauncher.doBuildStages(DefaultGradleLauncher.java:151)
	at org.gradle.initialization.DefaultGradleLauncher.access$200(DefaultGradleLauncher.java:32)
	at org.gradle.initialization.DefaultGradleLauncher$1.create(DefaultGradleLauncher.java:99)
	at org.gradle.initialization.DefaultGradleLauncher$1.create(DefaultGradleLauncher.java:93)
	at org.gradle.internal.progress.DefaultBuildOperationExecutor.run(DefaultBuildOperationExecutor.java:90)
	at org.gradle.internal.progress.DefaultBuildOperationExecutor.run(DefaultBuildOperationExecutor.java:62)
	at org.gradle.initialization.DefaultGradleLauncher.doBuild(DefaultGradleLauncher.java:93)
	at org.gradle.initialization.DefaultGradleLauncher.run(DefaultGradleLauncher.java:82)
	at org.gradle.launcher.exec.InProcessBuildActionExecuter$DefaultBuildController.run(InProcessBuildActionExecuter.java:94)
	at org.gradle.tooling.internal.provider.ExecuteBuildActionRunner.run(ExecuteBuildActionRunner.java:28)
	at org.gradle.launcher.exec.ChainingBuildActionRunner.run(ChainingBuildActionRunner.java:35)
	at org.gradle.launcher.exec.InProcessBuildActionExecuter.execute(InProcessBuildActionExecuter.java:43)
	at org.gradle.launcher.exec.InProcessBuildActionExecuter.execute(InProcessBuildActionExecuter.java:28)
	at org.gradle.launcher.exec.ContinuousBuildActionExecuter.execute(ContinuousBuildActionExecuter.java:75)
	at org.gradle.launcher.exec.ContinuousBuildActionExecuter.execute(ContinuousBuildActionExecuter.java:45)
	at org.gradle.launcher.exec.DaemonUsageSuggestingBuildActionExecuter.execute(DaemonUsageSuggestingBuildActionExecuter.java:51)
	at org.gradle.launcher.exec.DaemonUsageSuggestingBuildActionExecuter.execute(DaemonUsageSuggestingBuildActionExecuter.java:28)
	at org.gradle.launcher.cli.RunBuildAction.run(RunBuildAction.java:43)
	at org.gradle.internal.Actions$RunnableActionAdapter.execute(Actions.java:170)
	at org.gradle.launcher.cli.CommandLineActionFactory$ParseAndBuildAction.execute(CommandLineActionFactory.java:237)
	at org.gradle.launcher.cli.CommandLineActionFactory$ParseAndBuildAction.execute(CommandLineActionFactory.java:210)
	at org.gradle.launcher.cli.JavaRuntimeValidationAction.execute(JavaRuntimeValidationAction.java:35)
	at org.gradle.launcher.cli.JavaRuntimeValidationAction.execute(JavaRuntimeValidationAction.java:24)
	at org.gradle.launcher.cli.CommandLineActionFactory$WithLogging.execute(CommandLineActionFactory.java:206)
	at org.gradle.launcher.cli.CommandLineActionFactory$WithLogging.execute(CommandLineActionFactory.java:169)
	at org.gradle.launcher.cli.ExceptionReportingAction.execute(ExceptionReportingAction.java:33)
	at org.gradle.launcher.cli.ExceptionReportingAction.execute(ExceptionReportingAction.java:22)
	at org.gradle.launcher.Main.doAction(Main.java:33)
	at org.gradle.launcher.bootstrap.EntryPoint.run(EntryPoint.java:45)
	at org.gradle.launcher.bootstrap.ProcessBootstrap.runNoExit(ProcessBootstrap.java:54)
	at org.gradle.launcher.bootstrap.ProcessBootstrap.run(ProcessBootstrap.java:35)
	at org.gradle.launcher.GradleMain.main(GradleMain.java:23)
	at org.gradle.wrapper.BootstrapMainStarter.start(BootstrapMainStarter.java:30)
	at org.gradle.wrapper.WrapperExecutor.execute(WrapperExecutor.java:127)
	at org.gradle.wrapper.GradleWrapperMain.main(GradleWrapperMain.java:55)
Caused by: org.gradle.api.internal.tasks.compile.CompilationFailedException: Compilation failed;
see the compiler error output for details.
	at org.gradle.api.internal.tasks.compile.JdkJavaCompiler.execute(JdkJavaCompiler.java:47)
	at org.gradle.api.internal.tasks.compile.JdkJavaCompiler.execute(JdkJavaCompiler.java:33)
	at org.gradle.api.internal.tasks.compile.NormalizingJavaCompiler.delegateAndHandleErrors(NormalizingJavaCompiler.java:103)
	at org.gradle.api.internal.tasks.compile.NormalizingJavaCompiler.execute(NormalizingJavaCompiler.java:52)
	at org.gradle.api.internal.tasks.compile.NormalizingJavaCompiler.execute(NormalizingJavaCompiler.java:38)
	at org.gradle.api.internal.tasks.compile.CleaningJavaCompilerSupport.execute(CleaningJavaCompilerSupport.java:34)
	at org.gradle.api.internal.tasks.compile.CleaningJavaCompilerSupport.execute(CleaningJavaCompilerSupport.java:25)
	at org.gradle.api.tasks.compile.JavaCompile.performCompilation(JavaCompile.java:157)
	at org.gradle.api.tasks.compile.JavaCompile.compile(JavaCompile.java:139)
	at org.gradle.api.tasks.compile.JavaCompile.compile(JavaCompile.java:93)
	at org.gradle.internal.reflect.JavaMethod.invoke(JavaMethod.java:75)
	at org.gradle.api.internal.project.taskfactory.AnnotationProcessingTaskFactory$IncrementalTaskAction.doExecute(AnnotationProcessingTaskFactory.java:244)
	at org.gradle.api.internal.project.taskfactory.AnnotationProcessingTaskFactory$StandardTaskAction.execute(AnnotationProcessingTaskFactory.java:220)
	at org.gradle.api.internal.project.taskfactory.AnnotationProcessingTaskFactory$IncrementalTaskAction.execute(AnnotationProcessingTaskFactory.java:231)
	at org.gradle.api.internal.project.taskfactory.AnnotationProcessingTaskFactory$StandardTaskAction.execute(AnnotationProcessingTaskFactory.java:209)
	at org.gradle.api.internal.tasks.execution.ExecuteActionsTaskExecuter.executeAction(ExecuteActionsTaskExecuter.java:80)
	at org.gradle.api.internal.tasks.execution.ExecuteActionsTaskExecuter.executeActions(ExecuteActionsTaskExecuter.java:61)
	... 60 more


BUILD FAILED

Total time: 14 mins 12.498 secs
Build step 'Invoke Gradle script' changed build result to FAILURE
Build step 'Invoke Gradle script' marked build as failure
Xvfb stopping
Archiving artifacts
Recording test results
Publishing Javadoc

Mime
View raw message