polygene-dev mailing list archives

Site index · List index
Message view « Date » · « Thread »
Top « Date » · « Thread »
From Apache Jenkins Server <jenk...@builds.apache.org>
Subject Build failed in Jenkins: Zest(JavaEdition)-develop-java8-check #133
Date Wed, 10 Feb 2016 10:29:25 GMT
See <https://builds.apache.org/job/Zest(JavaEdition)-develop-java8-check/133/>

------------------------------------------
[...truncated 318 lines...]
:org.apache.zest.core:testClasses UP-TO-DATE
:org.apache.zest.core:test UP-TO-DATE
:org.apache.zest.extensions:compileJava UP-TO-DATE
:org.apache.zest.extensions:honkerGenDependencies
:org.apache.zest.extensions:honkerGenLicense
:org.apache.zest.extensions:honkerGenNotice
:org.apache.zest.extensions:processResources UP-TO-DATE
:org.apache.zest.extensions:classes
:org.apache.zest.extensions:compileTestJava UP-TO-DATE
:org.apache.zest.extensions:processTestResources UP-TO-DATE
:org.apache.zest.extensions:testClasses UP-TO-DATE
:org.apache.zest.extensions:test UP-TO-DATE
:org.apache.zest.libraries:compileJava UP-TO-DATE
:org.apache.zest.libraries:honkerGenDependencies
:org.apache.zest.libraries:honkerGenLicense
:org.apache.zest.libraries:honkerGenNotice
:org.apache.zest.libraries:processResources UP-TO-DATE
:org.apache.zest.libraries:classes
:org.apache.zest.libraries:compileTestJava UP-TO-DATE
:org.apache.zest.libraries:processTestResources UP-TO-DATE
:org.apache.zest.libraries:testClasses UP-TO-DATE
:org.apache.zest.libraries:test UP-TO-DATE
:org.apache.zest.manual:makeVersionClass
:org.apache.zest.manual:compileVersionJava
:org.apache.zest.core:org.apache.zest.core.api:makeVersionClass
:org.apache.zest.core:org.apache.zest.core.api:compileVersionJava
:org.apache.zest.core:org.apache.zest.core.functional:makeVersionClass
:org.apache.zest.core:org.apache.zest.core.functional:compileVersionJava
:org.apache.zest.core:org.apache.zest.core.functional:compileJava
:org.apache.zest.core:org.apache.zest.core.functional:honkerGenDependencies
:org.apache.zest.core:org.apache.zest.core.functional:honkerGenLicense
:org.apache.zest.core:org.apache.zest.core.functional:honkerGenNotice
:org.apache.zest.core:org.apache.zest.core.functional:processResources UP-TO-DATE
:org.apache.zest.core:org.apache.zest.core.functional:classes
:org.apache.zest.core:org.apache.zest.core.functional:processVersionResources UP-TO-DATE
:org.apache.zest.core:org.apache.zest.core.functional:versionClasses
:org.apache.zest.core:org.apache.zest.core.functional:jar
:org.apache.zest.core:org.apache.zest.core.io:makeVersionClass
:org.apache.zest.core:org.apache.zest.core.io:compileVersionJava
:org.apache.zest.core:org.apache.zest.core.io:compileJava
:org.apache.zest.core:org.apache.zest.core.io:honkerGenDependencies
:org.apache.zest.core:org.apache.zest.core.io:honkerGenLicense
:org.apache.zest.core:org.apache.zest.core.io:honkerGenNotice
:org.apache.zest.core:org.apache.zest.core.io:processResources UP-TO-DATE
:org.apache.zest.core:org.apache.zest.core.io:classes
:org.apache.zest.core:org.apache.zest.core.io:processVersionResources UP-TO-DATE
:org.apache.zest.core:org.apache.zest.core.io:versionClasses
:org.apache.zest.core:org.apache.zest.core.io:jar
:org.apache.zest.core:org.apache.zest.core.api:compileJavaNote: <https://builds.apache.org/job/Zest(JavaEdition)-develop-java8-check/ws/core/api/src/main/java/org/apache/zest/api/service/importer/InstanceImporter.java>
uses unchecked or unsafe operations.
Note: Recompile with -Xlint:unchecked for details.

:org.apache.zest.core:org.apache.zest.core.api:honkerGenDependencies
:org.apache.zest.core:org.apache.zest.core.api:honkerGenLicense
:org.apache.zest.core:org.apache.zest.core.api:honkerGenNotice
:org.apache.zest.core:org.apache.zest.core.api:processResources UP-TO-DATE
:org.apache.zest.core:org.apache.zest.core.api:classes
:org.apache.zest.core:org.apache.zest.core.api:processVersionResources UP-TO-DATE
:org.apache.zest.core:org.apache.zest.core.api:versionClasses
:org.apache.zest.core:org.apache.zest.core.api:jar
:org.apache.zest.core:org.apache.zest.core.bootstrap:makeVersionClass
:org.apache.zest.core:org.apache.zest.core.bootstrap:compileVersionJava
:org.apache.zest.core:org.apache.zest.core.spi:makeVersionClass
:org.apache.zest.core:org.apache.zest.core.spi:compileVersionJava
:org.apache.zest.core:org.apache.zest.core.spi:compileJavaNote: <https://builds.apache.org/job/Zest(JavaEdition)-develop-java8-check/ws/core/spi/src/main/java/org/apache/zest/spi/value/ValueDeserializerAdapter.java>
uses unchecked or unsafe operations.
Note: Recompile with -Xlint:unchecked for details.

:org.apache.zest.core:org.apache.zest.core.spi:honkerGenDependencies
:org.apache.zest.core:org.apache.zest.core.spi:honkerGenLicense
:org.apache.zest.core:org.apache.zest.core.spi:honkerGenNotice
:org.apache.zest.core:org.apache.zest.core.spi:processResources UP-TO-DATE
:org.apache.zest.core:org.apache.zest.core.spi:classes
:org.apache.zest.core:org.apache.zest.core.spi:processVersionResources UP-TO-DATE
:org.apache.zest.core:org.apache.zest.core.spi:versionClasses
:org.apache.zest.core:org.apache.zest.core.spi:jar
:org.apache.zest.core:org.apache.zest.core.bootstrap:compileJava
:org.apache.zest.core:org.apache.zest.core.bootstrap:honkerGenDependencies
:org.apache.zest.core:org.apache.zest.core.bootstrap:honkerGenLicense
:org.apache.zest.core:org.apache.zest.core.bootstrap:honkerGenNotice
:org.apache.zest.core:org.apache.zest.core.bootstrap:processResources UP-TO-DATE
:org.apache.zest.core:org.apache.zest.core.bootstrap:classes
:org.apache.zest.core:org.apache.zest.core.bootstrap:processVersionResources UP-TO-DATE
:org.apache.zest.core:org.apache.zest.core.bootstrap:versionClasses
:org.apache.zest.core:org.apache.zest.core.bootstrap:jar
:org.apache.zest.libraries:org.apache.zest.library.constraints:makeVersionClass
:org.apache.zest.libraries:org.apache.zest.library.constraints:compileVersionJava
:org.apache.zest.libraries:org.apache.zest.library.constraints:compileJava
:org.apache.zest.libraries:org.apache.zest.library.constraints:honkerGenDependencies
:org.apache.zest.libraries:org.apache.zest.library.constraints:honkerGenLicense
:org.apache.zest.libraries:org.apache.zest.library.constraints:honkerGenNotice
:org.apache.zest.libraries:org.apache.zest.library.constraints:processResources UP-TO-DATE
:org.apache.zest.libraries:org.apache.zest.library.constraints:classes
:org.apache.zest.libraries:org.apache.zest.library.constraints:processVersionResources UP-TO-DATE
:org.apache.zest.libraries:org.apache.zest.library.constraints:versionClasses
:org.apache.zest.libraries:org.apache.zest.library.constraints:jar
:org.apache.zest.libraries:org.apache.zest.library.logging:makeVersionClass
:org.apache.zest.libraries:org.apache.zest.library.logging:compileVersionJava
:org.apache.zest.libraries:org.apache.zest.library.logging:compileJava
:org.apache.zest.libraries:org.apache.zest.library.logging:honkerGenDependencies
:org.apache.zest.libraries:org.apache.zest.library.logging:honkerGenLicense
:org.apache.zest.libraries:org.apache.zest.library.logging:honkerGenNotice
:org.apache.zest.libraries:org.apache.zest.library.logging:processResources UP-TO-DATE
:org.apache.zest.libraries:org.apache.zest.library.logging:classes
:org.apache.zest.libraries:org.apache.zest.library.logging:processVersionResources UP-TO-DATE
:org.apache.zest.libraries:org.apache.zest.library.logging:versionClasses
:org.apache.zest.libraries:org.apache.zest.library.logging:jar
:org.apache.zest.manual:compileJava
:org.apache.zest.core:org.apache.zest.core.runtime:makeVersionClass
:org.apache.zest.core:org.apache.zest.core.runtime:compileVersionJava
:org.apache.zest.core:org.apache.zest.core.runtime:compileJavaNote: Some input files use unchecked
or unsafe operations.
Note: Recompile with -Xlint:unchecked for details.

:org.apache.zest.core:org.apache.zest.core.runtime:honkerGenDependencies
:org.apache.zest.core:org.apache.zest.core.runtime:honkerGenLicense
:org.apache.zest.core:org.apache.zest.core.runtime:honkerGenNotice
:org.apache.zest.core:org.apache.zest.core.runtime:processResources UP-TO-DATE
:org.apache.zest.core:org.apache.zest.core.runtime:classes
:org.apache.zest.core:org.apache.zest.core.runtime:processVersionResources UP-TO-DATE
:org.apache.zest.core:org.apache.zest.core.runtime:versionClasses
:org.apache.zest.core:org.apache.zest.core.runtime:jar
:org.apache.zest.manual:honkerGenDependencies
:org.apache.zest.manual:honkerGenLicense
:org.apache.zest.manual:honkerGenNotice
:org.apache.zest.manual:processResources UP-TO-DATE
:org.apache.zest.manual:classes
:org.apache.zest.manual:compileTestJava UP-TO-DATE
:org.apache.zest.manual:processTestResources UP-TO-DATE
:org.apache.zest.manual:testClasses UP-TO-DATE
:org.apache.zest.manual:test UP-TO-DATE
:org.apache.zest.samples:compileJava UP-TO-DATE
:org.apache.zest.samples:honkerGenDependencies
:org.apache.zest.samples:honkerGenLicense
:org.apache.zest.samples:honkerGenNotice
:org.apache.zest.samples:processResources UP-TO-DATE
:org.apache.zest.samples:classes
:org.apache.zest.samples:compileTestJava UP-TO-DATE
:org.apache.zest.samples:processTestResources UP-TO-DATE
:org.apache.zest.samples:testClasses UP-TO-DATE
:org.apache.zest.samples:test UP-TO-DATE
:org.apache.zest.tests:compileJava UP-TO-DATE
:org.apache.zest.tests:honkerGenDependencies
:org.apache.zest.tests:honkerGenLicense
:org.apache.zest.tests:honkerGenNotice
:org.apache.zest.tests:processResources UP-TO-DATE
:org.apache.zest.tests:classes
:org.apache.zest.tests:compileTestJava UP-TO-DATE
:org.apache.zest.tests:processTestResources UP-TO-DATE
:org.apache.zest.tests:testClasses UP-TO-DATE
:org.apache.zest.tests:test UP-TO-DATE
:org.apache.zest.tools:compileJava UP-TO-DATE
:org.apache.zest.tools:honkerGenDependencies
:org.apache.zest.tools:honkerGenLicense
:org.apache.zest.tools:honkerGenNotice
:org.apache.zest.tools:processResources UP-TO-DATE
:org.apache.zest.tools:classes
:org.apache.zest.tools:compileTestJava UP-TO-DATE
:org.apache.zest.tools:processTestResources UP-TO-DATE
:org.apache.zest.tools:testClasses UP-TO-DATE
:org.apache.zest.tools:test UP-TO-DATE
:org.apache.zest.tutorials:compileJava UP-TO-DATE
:org.apache.zest.tutorials:honkerGenDependencies
:org.apache.zest.tutorials:honkerGenLicense
:org.apache.zest.tutorials:honkerGenNotice
:org.apache.zest.tutorials:processResources UP-TO-DATE
:org.apache.zest.tutorials:classes
:org.apache.zest.tutorials:compileTestJava UP-TO-DATE
:org.apache.zest.tutorials:processTestResources UP-TO-DATE
:org.apache.zest.tutorials:testClasses UP-TO-DATE
:org.apache.zest.tutorials:test UP-TO-DATE
:org.apache.zest.core:org.apache.zest.core.testsupport:makeVersionClass
:org.apache.zest.core:org.apache.zest.core.testsupport:compileVersionJava
:org.apache.zest.core:org.apache.zest.core.testsupport:compileJavaNote: <https://builds.apache.org/job/Zest(JavaEdition)-develop-java8-check/ws/core/testsupport/src/main/java/org/apache/zest/test/cache/MemoryCachePoolMixin.java>
uses unchecked or unsafe operations.
Note: Recompile with -Xlint:unchecked for details.

:org.apache.zest.core:org.apache.zest.core.testsupport:honkerGenDependencies
:org.apache.zest.core:org.apache.zest.core.testsupport:honkerGenLicense
:org.apache.zest.core:org.apache.zest.core.testsupport:honkerGenNotice
:org.apache.zest.core:org.apache.zest.core.testsupport:processResources UP-TO-DATE
:org.apache.zest.core:org.apache.zest.core.testsupport:classes
:org.apache.zest.core:org.apache.zest.core.testsupport:processVersionResources UP-TO-DATE
:org.apache.zest.core:org.apache.zest.core.testsupport:versionClasses
:org.apache.zest.core:org.apache.zest.core.testsupport:jar
:org.apache.zest.extensions:org.apache.zest.extension.valueserialization-orgjson:makeVersionClass
:org.apache.zest.extensions:org.apache.zest.extension.valueserialization-orgjson:compileVersionJava
:org.apache.zest.extensions:org.apache.zest.extension.valueserialization-orgjson:compileJava
:org.apache.zest.extensions:org.apache.zest.extension.valueserialization-orgjson:honkerGenDependencies
:org.apache.zest.extensions:org.apache.zest.extension.valueserialization-orgjson:honkerGenLicense
:org.apache.zest.extensions:org.apache.zest.extension.valueserialization-orgjson:honkerGenNotice
:org.apache.zest.extensions:org.apache.zest.extension.valueserialization-orgjson:processResources
UP-TO-DATE
:org.apache.zest.extensions:org.apache.zest.extension.valueserialization-orgjson:classes
:org.apache.zest.extensions:org.apache.zest.extension.valueserialization-orgjson:processVersionResources
UP-TO-DATE
:org.apache.zest.extensions:org.apache.zest.extension.valueserialization-orgjson:versionClasses
:org.apache.zest.extensions:org.apache.zest.extension.valueserialization-orgjson:jar
:org.apache.zest.core:org.apache.zest.core.api:compileTestJavaNote: Some input files use unchecked
or unsafe operations.
Note: Recompile with -Xlint:unchecked for details.

:org.apache.zest.core:org.apache.zest.core.api:processTestResources
:org.apache.zest.core:org.apache.zest.core.api:testClasses
:org.apache.zest.core:org.apache.zest.core.api:test
:org.apache.zest.core:org.apache.zest.core.bootstrap:compileTestJava
:org.apache.zest.core:org.apache.zest.core.bootstrap:processTestResources UP-TO-DATE
:org.apache.zest.core:org.apache.zest.core.bootstrap:testClasses
:org.apache.zest.core:org.apache.zest.core.bootstrap:test
:org.apache.zest.core:org.apache.zest.core.functional:compileTestJava
:org.apache.zest.core:org.apache.zest.core.functional:processTestResources UP-TO-DATE
:org.apache.zest.core:org.apache.zest.core.functional:testClasses
:org.apache.zest.core:org.apache.zest.core.functional:test
:org.apache.zest.core:org.apache.zest.core.io:compileTestJava
:org.apache.zest.core:org.apache.zest.core.io:processTestResources
:org.apache.zest.core:org.apache.zest.core.io:testClasses
:org.apache.zest.core:org.apache.zest.core.io:test
:org.apache.zest.core:org.apache.zest.core.runtime:compileTestJavaNote: Some input files use
unchecked or unsafe operations.
Note: Recompile with -Xlint:unchecked for details.

:org.apache.zest.core:org.apache.zest.core.runtime:processTestResources
:org.apache.zest.core:org.apache.zest.core.runtime:testClasses
:org.apache.zest.core:org.apache.zest.core.runtime:test
:org.apache.zest.core:org.apache.zest.core.spi:compileTestJavaNote: <https://builds.apache.org/job/Zest(JavaEdition)-develop-java8-check/ws/core/spi/src/test/java/org/apache/zest/spi/property/DefaultValuesTest.java>
uses unchecked or unsafe operations.
Note: Recompile with -Xlint:unchecked for details.

:org.apache.zest.core:org.apache.zest.core.spi:processTestResources
:org.apache.zest.core:org.apache.zest.core.spi:testClasses
:org.apache.zest.core:org.apache.zest.core.spi:test
:org.apache.zest.core:org.apache.zest.core.testsupport:compileTestJava
:org.apache.zest.core:org.apache.zest.core.testsupport:processTestResources UP-TO-DATE
:org.apache.zest.core:org.apache.zest.core.testsupport:testClasses
:org.apache.zest.core:org.apache.zest.core.testsupport:test
:org.apache.zest.extensions:org.apache.zest.extension.cache-ehcache:makeVersionClass
:org.apache.zest.extensions:org.apache.zest.extension.cache-ehcache:compileVersionJava
:org.apache.zest.extensions:org.apache.zest.extension.cache-ehcache:compileJava
FAILURE: Build failed with an exception.

* What went wrong:
Could not resolve all dependencies for configuration ':org.apache.zest.extensions:org.apache.zest.extension.cache-ehcache:compile'.
> Could not download ehcache.jar (net.sf.ehcache:ehcache:2.10.0)
   > Could not get resource 'https://repo1.maven.org/maven2/net/sf/ehcache/ehcache/2.10.0/ehcache-2.10.0.jar'.
      > Could not HEAD 'https://repo1.maven.org/maven2/net/sf/ehcache/ehcache/2.10.0/ehcache-2.10.0.jar'.
         > repo1.maven.org:443 failed to respond

* Try:
Run with --stacktrace option to get the stack trace. Run with --info or --debug option to
get more log output.


BUILD FAILED

Total time: 4 mins 15.217 secs
Build step 'Invoke Gradle script' changed build result to FAILURE
Build step 'Invoke Gradle script' marked build as failure
Xvfb stopping
Recording test results

Mime
View raw message