polygene-dev mailing list archives

Site index · List index
Message view « Date » · « Thread »
Top « Date » · « Thread »
From Apache Jenkins Server <jenk...@builds.apache.org>
Subject Build failed in Jenkins: Zest(JavaEdition)-develop-java8-checkDists #58
Date Wed, 10 Feb 2016 11:15:27 GMT
See <https://builds.apache.org/job/Zest(JavaEdition)-develop-java8-checkDists/58/changes>

Changes:

[paulmerlin] Upgrade Gradle version from 2.5 to 2.11

------------------------------------------
[...truncated 696 lines...]
          ^
<https://builds.apache.org/job/Zest(JavaEdition)-develop-java8-checkDists/ws/extensions/entitystore-mongodb/src/main/java/org/apache/zest/entitystore/mongodb/MongoMapEntityStoreMixin.java>:286:
warning: [deprecation] requestDone() in DB has been deprecated
        db.requestDone();
          ^
<https://builds.apache.org/job/Zest(JavaEdition)-develop-java8-checkDists/ws/extensions/entitystore-mongodb/src/main/java/org/apache/zest/entitystore/mongodb/MongoMapEntityStoreMixin.java>:306:
warning: [deprecation] requestStart() in DB has been deprecated
                        db.requestStart();
                          ^
<https://builds.apache.org/job/Zest(JavaEdition)-develop-java8-checkDists/ws/extensions/entitystore-mongodb/src/main/java/org/apache/zest/entitystore/mongodb/MongoMapEntityStoreMixin.java>:317:
warning: [deprecation] requestDone() in DB has been deprecated
                        db.requestDone();
                          ^
8 warnings

:org.apache.zest.extensions:org.apache.zest.extension.entitystore-mongodb:honkerGenDependencies
:org.apache.zest.extensions:org.apache.zest.extension.entitystore-mongodb:honkerGenLicense
:org.apache.zest.extensions:org.apache.zest.extension.entitystore-mongodb:honkerGenNotice
:org.apache.zest.extensions:org.apache.zest.extension.entitystore-mongodb:processResources
UP-TO-DATE
:org.apache.zest.extensions:org.apache.zest.extension.entitystore-mongodb:classes
:org.apache.zest.extensions:org.apache.zest.extension.entitystore-mongodb:compileTestJava
:org.apache.zest.extensions:org.apache.zest.extension.entitystore-mongodb:processTestResources
UP-TO-DATE
:org.apache.zest.extensions:org.apache.zest.extension.entitystore-mongodb:testClasses
:org.apache.zest.extensions:org.apache.zest.extension.entitystore-mongodb:test
:org.apache.zest.extensions:org.apache.zest.extension.entitystore-preferences:makeVersionClass
:org.apache.zest.extensions:org.apache.zest.extension.entitystore-preferences:compileVersionJava
:org.apache.zest.extensions:org.apache.zest.extension.entitystore-preferences:compileJava
:org.apache.zest.extensions:org.apache.zest.extension.entitystore-preferences:honkerGenDependencies
:org.apache.zest.extensions:org.apache.zest.extension.entitystore-preferences:honkerGenLicense
:org.apache.zest.extensions:org.apache.zest.extension.entitystore-preferences:honkerGenNotice
:org.apache.zest.extensions:org.apache.zest.extension.entitystore-preferences:processResources
UP-TO-DATE
:org.apache.zest.extensions:org.apache.zest.extension.entitystore-preferences:classes
:org.apache.zest.extensions:org.apache.zest.extension.entitystore-preferences:compileTestJava
:org.apache.zest.extensions:org.apache.zest.extension.entitystore-preferences:processTestResources
UP-TO-DATE
:org.apache.zest.extensions:org.apache.zest.extension.entitystore-preferences:testClasses
:org.apache.zest.extensions:org.apache.zest.extension.entitystore-preferences:test
:org.apache.zest.extensions:org.apache.zest.extension.entitystore-redis:makeVersionClass
:org.apache.zest.extensions:org.apache.zest.extension.entitystore-redis:compileVersionJava
:org.apache.zest.extensions:org.apache.zest.extension.entitystore-redis:compileJava<https://builds.apache.org/job/Zest(JavaEdition)-develop-java8-checkDists/ws/extensions/entitystore-redis/src/main/java/org/apache/zest/entitystore/redis/RedisMapEntityStoreMixin.java>:102:
warning: [deprecation] returnResource(Jedis) in JedisPool has been deprecated
            pool.returnResource( jedis );
                ^
<https://builds.apache.org/job/Zest(JavaEdition)-develop-java8-checkDists/ws/extensions/entitystore-redis/src/main/java/org/apache/zest/entitystore/redis/RedisMapEntityStoreMixin.java>:170:
warning: [deprecation] returnResource(Jedis) in JedisPool has been deprecated
            pool.returnResource( jedis );
                ^
<https://builds.apache.org/job/Zest(JavaEdition)-develop-java8-checkDists/ws/extensions/entitystore-redis/src/main/java/org/apache/zest/entitystore/redis/RedisMapEntityStoreMixin.java>:201:
warning: [deprecation] returnResource(Jedis) in JedisPool has been deprecated
                            pool.returnResource( jedis );
                                ^
3 warnings

:org.apache.zest.extensions:org.apache.zest.extension.entitystore-redis:honkerGenDependencies
:org.apache.zest.extensions:org.apache.zest.extension.entitystore-redis:honkerGenLicense
:org.apache.zest.extensions:org.apache.zest.extension.entitystore-redis:honkerGenNotice
:org.apache.zest.extensions:org.apache.zest.extension.entitystore-redis:processResources UP-TO-DATE
:org.apache.zest.extensions:org.apache.zest.extension.entitystore-redis:classes
:org.apache.zest.extensions:org.apache.zest.extension.entitystore-redis:compileTestJava<https://builds.apache.org/job/Zest(JavaEdition)-develop-java8-checkDists/ws/extensions/entitystore-redis/src/test/java/org/apache/zest/entitystore/redis/RedisMapEntityStoreTest.java>:78:
warning: [deprecation] returnResource(Jedis) in JedisPool has been deprecated
            jedisPool.returnResource( jedis );
                     ^
<https://builds.apache.org/job/Zest(JavaEdition)-develop-java8-checkDists/ws/extensions/entitystore-redis/src/test/java/org/apache/zest/entitystore/redis/RedisMapEntityStoreWithCacheTest.java>:74:
warning: [deprecation] returnResource(Jedis) in JedisPool has been deprecated
            jedisPool.returnResource( jedis );
                     ^
2 warnings

:org.apache.zest.extensions:org.apache.zest.extension.entitystore-redis:processTestResources
UP-TO-DATE
:org.apache.zest.extensions:org.apache.zest.extension.entitystore-redis:testClasses
:org.apache.zest.extensions:org.apache.zest.extension.entitystore-redis:test
:org.apache.zest.extensions:org.apache.zest.extension.entitystore-riak:makeVersionClass
:org.apache.zest.extensions:org.apache.zest.extension.entitystore-riak:compileVersionJava
:org.apache.zest.extensions:org.apache.zest.extension.entitystore-riak:compileJava
FAILURE: Build failed with an exception.

* What went wrong:
Could not resolve all dependencies for configuration ':org.apache.zest.extensions:org.apache.zest.extension.entitystore-riak:compile'.
> Could not download riak-client.jar (com.basho.riak:riak-client:1.4.4)
   > Could not get resource 'https://repo1.maven.org/maven2/com/basho/riak/riak-client/1.4.4/riak-client-1.4.4.jar'.
      > Could not HEAD 'https://repo1.maven.org/maven2/com/basho/riak/riak-client/1.4.4/riak-client-1.4.4.jar'.
         > repo1.maven.org:443 failed to respond

* Try:
Run with --info or --debug option to get more log output.

* Exception is:
org.gradle.api.artifacts.ResolveException: Could not resolve all dependencies for configuration
':org.apache.zest.extensions:org.apache.zest.extension.entitystore-riak:compile'.
	at org.gradle.api.internal.artifacts.ivyservice.ErrorHandlingConfigurationResolver.wrapException(ErrorHandlingConfigurationResolver.java:70)
	at org.gradle.api.internal.artifacts.ivyservice.ErrorHandlingConfigurationResolver.access$000(ErrorHandlingConfigurationResolver.java:33)
	at org.gradle.api.internal.artifacts.ivyservice.ErrorHandlingConfigurationResolver$ErrorHandlingResolvedConfiguration.getFiles(ErrorHandlingConfigurationResolver.java:199)
	at org.gradle.api.internal.artifacts.configurations.DefaultConfiguration$ConfigurationFileCollection.getFiles(DefaultConfiguration.java:665)
	at org.gradle.api.internal.artifacts.configurations.DefaultConfiguration.getFiles(DefaultConfiguration.java:288)
	at org.gradle.api.internal.artifacts.configurations.DefaultConfiguration_Decorated.getFiles(Unknown
Source)
	at org.gradle.api.internal.file.collections.DefaultFileCollectionResolveContext$FileTreeConverter.convertInto(DefaultFileCollectionResolveContext.java:202)
	at org.gradle.api.internal.file.collections.DefaultFileCollectionResolveContext.doResolve(DefaultFileCollectionResolveContext.java:103)
	at org.gradle.api.internal.file.collections.DefaultFileCollectionResolveContext.resolveAsFileTrees(DefaultFileCollectionResolveContext.java:74)
	at org.gradle.api.internal.file.collections.DefaultFileCollectionResolveContext$FileTreeConverter.convertInto(DefaultFileCollectionResolveContext.java:188)
	at org.gradle.api.internal.file.collections.DefaultFileCollectionResolveContext.doResolve(DefaultFileCollectionResolveContext.java:98)
	at org.gradle.api.internal.file.collections.DefaultFileCollectionResolveContext.resolveAsFileTrees(DefaultFileCollectionResolveContext.java:74)
	at org.gradle.api.internal.changedetection.state.DefaultFileCollectionSnapshotter.visitFiles(DefaultFileCollectionSnapshotter.java:96)
	at org.gradle.api.internal.changedetection.state.DefaultFileCollectionSnapshotter.snapshot(DefaultFileCollectionSnapshotter.java:61)
	at org.gradle.api.internal.changedetection.rules.TaskUpToDateState.<init>(TaskUpToDateState.java:56)
	at org.gradle.api.internal.changedetection.changes.DefaultTaskArtifactStateRepository$TaskArtifactStateImpl.getStates(DefaultTaskArtifactStateRepository.java:135)
	at org.gradle.api.internal.changedetection.changes.DefaultTaskArtifactStateRepository$TaskArtifactStateImpl.isUpToDate(DefaultTaskArtifactStateRepository.java:73)
	at org.gradle.api.internal.tasks.execution.SkipUpToDateTaskExecuter.execute(SkipUpToDateTaskExecuter.java:52)
	at org.gradle.api.internal.tasks.execution.ValidatingTaskExecuter.execute(ValidatingTaskExecuter.java:58)
	at org.gradle.api.internal.tasks.execution.SkipEmptySourceFilesTaskExecuter.execute(SkipEmptySourceFilesTaskExecuter.java:52)
	at org.gradle.api.internal.tasks.execution.SkipTaskWithNoActionsExecuter.execute(SkipTaskWithNoActionsExecuter.java:52)
	at org.gradle.api.internal.tasks.execution.SkipOnlyIfTaskExecuter.execute(SkipOnlyIfTaskExecuter.java:53)
	at org.gradle.api.internal.tasks.execution.ExecuteAtMostOnceTaskExecuter.execute(ExecuteAtMostOnceTaskExecuter.java:43)
	at org.gradle.execution.taskgraph.DefaultTaskGraphExecuter$EventFiringTaskWorker.execute(DefaultTaskGraphExecuter.java:203)
	at org.gradle.execution.taskgraph.DefaultTaskGraphExecuter$EventFiringTaskWorker.execute(DefaultTaskGraphExecuter.java:185)
	at org.gradle.execution.taskgraph.AbstractTaskPlanExecutor$TaskExecutorWorker.processTask(AbstractTaskPlanExecutor.java:66)
	at org.gradle.execution.taskgraph.AbstractTaskPlanExecutor$TaskExecutorWorker.run(AbstractTaskPlanExecutor.java:50)
	at org.gradle.execution.taskgraph.DefaultTaskPlanExecutor.process(DefaultTaskPlanExecutor.java:25)
	at org.gradle.execution.taskgraph.DefaultTaskGraphExecuter.execute(DefaultTaskGraphExecuter.java:110)
	at org.gradle.execution.SelectedTaskExecutionAction.execute(SelectedTaskExecutionAction.java:37)
	at org.gradle.execution.DefaultBuildExecuter.execute(DefaultBuildExecuter.java:37)
	at org.gradle.execution.DefaultBuildExecuter.access$000(DefaultBuildExecuter.java:23)
	at org.gradle.execution.DefaultBuildExecuter$1.proceed(DefaultBuildExecuter.java:43)
	at org.gradle.execution.DryRunBuildExecutionAction.execute(DryRunBuildExecutionAction.java:32)
	at org.gradle.execution.DefaultBuildExecuter.execute(DefaultBuildExecuter.java:37)
	at org.gradle.execution.DefaultBuildExecuter.execute(DefaultBuildExecuter.java:30)
	at org.gradle.initialization.DefaultGradleLauncher$4.run(DefaultGradleLauncher.java:154)
	at org.gradle.internal.Factories$1.create(Factories.java:22)
	at org.gradle.internal.progress.DefaultBuildOperationExecutor.run(DefaultBuildOperationExecutor.java:90)
	at org.gradle.internal.progress.DefaultBuildOperationExecutor.run(DefaultBuildOperationExecutor.java:52)
	at org.gradle.initialization.DefaultGradleLauncher.doBuildStages(DefaultGradleLauncher.java:151)
	at org.gradle.initialization.DefaultGradleLauncher.access$200(DefaultGradleLauncher.java:32)
	at org.gradle.initialization.DefaultGradleLauncher$1.create(DefaultGradleLauncher.java:99)
	at org.gradle.initialization.DefaultGradleLauncher$1.create(DefaultGradleLauncher.java:93)
	at org.gradle.internal.progress.DefaultBuildOperationExecutor.run(DefaultBuildOperationExecutor.java:90)
	at org.gradle.internal.progress.DefaultBuildOperationExecutor.run(DefaultBuildOperationExecutor.java:62)
	at org.gradle.initialization.DefaultGradleLauncher.doBuild(DefaultGradleLauncher.java:93)
	at org.gradle.initialization.DefaultGradleLauncher.run(DefaultGradleLauncher.java:82)
	at org.gradle.launcher.exec.InProcessBuildActionExecuter$DefaultBuildController.run(InProcessBuildActionExecuter.java:94)
	at org.gradle.tooling.internal.provider.ExecuteBuildActionRunner.run(ExecuteBuildActionRunner.java:28)
	at org.gradle.launcher.exec.ChainingBuildActionRunner.run(ChainingBuildActionRunner.java:35)
	at org.gradle.launcher.exec.InProcessBuildActionExecuter.execute(InProcessBuildActionExecuter.java:43)
	at org.gradle.launcher.exec.InProcessBuildActionExecuter.execute(InProcessBuildActionExecuter.java:28)
	at org.gradle.launcher.exec.ContinuousBuildActionExecuter.execute(ContinuousBuildActionExecuter.java:75)
	at org.gradle.launcher.exec.ContinuousBuildActionExecuter.execute(ContinuousBuildActionExecuter.java:45)
	at org.gradle.launcher.exec.DaemonUsageSuggestingBuildActionExecuter.execute(DaemonUsageSuggestingBuildActionExecuter.java:51)
	at org.gradle.launcher.exec.DaemonUsageSuggestingBuildActionExecuter.execute(DaemonUsageSuggestingBuildActionExecuter.java:28)
	at org.gradle.launcher.cli.RunBuildAction.run(RunBuildAction.java:43)
	at org.gradle.internal.Actions$RunnableActionAdapter.execute(Actions.java:170)
	at org.gradle.launcher.cli.CommandLineActionFactory$ParseAndBuildAction.execute(CommandLineActionFactory.java:237)
	at org.gradle.launcher.cli.CommandLineActionFactory$ParseAndBuildAction.execute(CommandLineActionFactory.java:210)
	at org.gradle.launcher.cli.JavaRuntimeValidationAction.execute(JavaRuntimeValidationAction.java:35)
	at org.gradle.launcher.cli.JavaRuntimeValidationAction.execute(JavaRuntimeValidationAction.java:24)
	at org.gradle.launcher.cli.CommandLineActionFactory$WithLogging.execute(CommandLineActionFactory.java:206)
	at org.gradle.launcher.cli.CommandLineActionFactory$WithLogging.execute(CommandLineActionFactory.java:169)
	at org.gradle.launcher.cli.ExceptionReportingAction.execute(ExceptionReportingAction.java:33)
	at org.gradle.launcher.cli.ExceptionReportingAction.execute(ExceptionReportingAction.java:22)
	at org.gradle.launcher.Main.doAction(Main.java:33)
	at org.gradle.launcher.bootstrap.EntryPoint.run(EntryPoint.java:45)
	at org.gradle.launcher.bootstrap.ProcessBootstrap.runNoExit(ProcessBootstrap.java:54)
	at org.gradle.launcher.bootstrap.ProcessBootstrap.run(ProcessBootstrap.java:35)
	at org.gradle.launcher.GradleMain.main(GradleMain.java:23)
	at org.gradle.wrapper.BootstrapMainStarter.start(BootstrapMainStarter.java:30)
	at org.gradle.wrapper.WrapperExecutor.execute(WrapperExecutor.java:127)
	at org.gradle.wrapper.GradleWrapperMain.main(GradleWrapperMain.java:55)
Caused by: org.gradle.internal.resolve.ArtifactResolveException: Could not download riak-client.jar
(com.basho.riak:riak-client:1.4.4)
	at org.gradle.api.internal.artifacts.repositories.resolver.ExternalResourceResolver.resolveArtifact(ExternalResourceResolver.java:240)
	at org.gradle.api.internal.artifacts.repositories.resolver.ExternalResourceResolver$RemoteRepositoryAccess.resolveArtifact(ExternalResourceResolver.java:436)
	at org.gradle.api.internal.artifacts.ivyservice.ivyresolve.CacheLockReleasingModuleComponentsRepository$LockReleasingRepositoryAccess$5.run(CacheLockReleasingModuleComponentsRepository.java:96)
	at org.gradle.internal.Factories$1.create(Factories.java:22)
	at org.gradle.cache.internal.DefaultCacheAccess.longRunningOperation(DefaultCacheAccess.java:242)
	at org.gradle.cache.internal.DefaultCacheAccess.longRunningOperation(DefaultCacheAccess.java:313)
	at org.gradle.cache.internal.DefaultPersistentDirectoryStore.longRunningOperation(DefaultPersistentDirectoryStore.java:114)
	at org.gradle.cache.internal.DefaultCacheFactory$ReferenceTrackingCache.longRunningOperation(DefaultCacheFactory.java:179)
	at org.gradle.api.internal.artifacts.ivyservice.DefaultCacheLockingManager.longRunningOperation(DefaultCacheLockingManager.java:56)
	at org.gradle.api.internal.artifacts.ivyservice.ivyresolve.CacheLockReleasingModuleComponentsRepository$LockReleasingRepositoryAccess.resolveArtifact(CacheLockReleasingModuleComponentsRepository.java:94)
	at org.gradle.api.internal.artifacts.ivyservice.ivyresolve.CachingModuleComponentRepository$ResolveAndCacheRepositoryAccess.resolveArtifact(CachingModuleComponentRepository.java:342)
	at org.gradle.api.internal.artifacts.ivyservice.ivyresolve.BaseModuleComponentRepositoryAccess.resolveArtifact(BaseModuleComponentRepositoryAccess.java:54)
	at org.gradle.api.internal.artifacts.ivyservice.ivyresolve.memcache.InMemoryCachedModuleComponentRepository$CachedAccess.resolveArtifact(InMemoryCachedModuleComponentRepository.java:82)
	at org.gradle.api.internal.artifacts.ivyservice.ivyresolve.ErrorHandlingModuleComponentRepository$ErrorHandlingModuleComponentRepositoryAccess.resolveArtifact(ErrorHandlingModuleComponentRepository.java:116)
	at org.gradle.api.internal.artifacts.ivyservice.ivyresolve.RepositoryChainArtifactResolver.resolveArtifact(RepositoryChainArtifactResolver.java:65)
	at org.gradle.api.internal.artifacts.ivyservice.resolveengine.ComponentResolversChain$ArtifactResolverChain.resolveArtifact(ComponentResolversChain.java:98)
	at org.gradle.api.internal.artifacts.ivyservice.ContextualArtifactResolver$3.execute(ContextualArtifactResolver.java:61)
	at org.gradle.api.internal.artifacts.ivyservice.ContextualArtifactResolver$3.execute(ContextualArtifactResolver.java:59)
	at org.gradle.internal.Transformers$4.transform(Transformers.java:137)
	at org.gradle.api.internal.artifacts.ivyservice.DefaultIvyContextManager.withIvy(DefaultIvyContextManager.java:61)
	at org.gradle.api.internal.artifacts.ivyservice.DefaultIvyContextManager.withIvy(DefaultIvyContextManager.java:39)
	at org.gradle.api.internal.artifacts.ivyservice.ContextualArtifactResolver$4.run(ContextualArtifactResolver.java:69)
	at org.gradle.internal.Factories$1.create(Factories.java:22)
	at org.gradle.cache.internal.DefaultCacheAccess.useCache(DefaultCacheAccess.java:192)
	at org.gradle.cache.internal.DefaultCacheAccess.useCache(DefaultCacheAccess.java:175)
	at org.gradle.cache.internal.DefaultPersistentDirectoryStore.useCache(DefaultPersistentDirectoryStore.java:106)
	at org.gradle.cache.internal.DefaultCacheFactory$ReferenceTrackingCache.useCache(DefaultCacheFactory.java:187)
	at org.gradle.api.internal.artifacts.ivyservice.DefaultCacheLockingManager.useCache(DefaultCacheLockingManager.java:64)
	at org.gradle.api.internal.artifacts.ivyservice.ContextualArtifactResolver.executeInContext(ContextualArtifactResolver.java:67)
	at org.gradle.api.internal.artifacts.ivyservice.ContextualArtifactResolver.resolveArtifact(ContextualArtifactResolver.java:59)
	at org.gradle.api.internal.artifacts.ivyservice.ivyresolve.ErrorHandlingArtifactResolver.resolveArtifact(ErrorHandlingArtifactResolver.java:53)
	at org.gradle.api.internal.artifacts.ivyservice.resolveengine.artifact.DefaultArtifactSet$LazyArtifactSource.create(DefaultArtifactSet.java:93)
	at org.gradle.api.internal.artifacts.ivyservice.resolveengine.artifact.DefaultArtifactSet$LazyArtifactSource.create(DefaultArtifactSet.java:80)
	at org.gradle.api.internal.artifacts.DefaultResolvedArtifact.getFile(DefaultResolvedArtifact.java:90)
	at org.gradle.api.internal.artifacts.ivyservice.DefaultLenientConfiguration$2.run(DefaultLenientConfiguration.java:122)
	at org.gradle.internal.Factories$1.create(Factories.java:22)
	at org.gradle.cache.internal.DefaultCacheAccess.useCache(DefaultCacheAccess.java:192)
	at org.gradle.cache.internal.DefaultCacheAccess.useCache(DefaultCacheAccess.java:175)
	at org.gradle.cache.internal.DefaultPersistentDirectoryStore.useCache(DefaultPersistentDirectoryStore.java:106)
	at org.gradle.cache.internal.DefaultCacheFactory$ReferenceTrackingCache.useCache(DefaultCacheFactory.java:187)
	at org.gradle.api.internal.artifacts.ivyservice.DefaultCacheLockingManager.useCache(DefaultCacheLockingManager.java:64)
	at org.gradle.api.internal.artifacts.ivyservice.DefaultLenientConfiguration.getFiles(DefaultLenientConfiguration.java:119)
	at org.gradle.api.internal.artifacts.ivyservice.DefaultLenientConfiguration.getFilesStrict(DefaultLenientConfiguration.java:91)
	at org.gradle.api.internal.artifacts.ivyservice.DefaultResolvedConfiguration.getFiles(DefaultResolvedConfiguration.java:45)
	at org.gradle.api.internal.artifacts.ivyservice.SelfResolvingDependencyConfigurationResolver$FilesAggregatingResolvedConfiguration.getFiles(SelfResolvingDependencyConfigurationResolver.java:87)
	at org.gradle.api.internal.artifacts.ivyservice.ErrorHandlingConfigurationResolver$ErrorHandlingResolvedConfiguration.getFiles(ErrorHandlingConfigurationResolver.java:197)
	... 72 more
Caused by: org.gradle.internal.resource.ResourceException: Could not get resource 'https://repo1.maven.org/maven2/com/basho/riak/riak-client/1.4.4/riak-client-1.4.4.jar'.
	at org.gradle.internal.resource.ResourceException.failure(ResourceException.java:61)
	at org.gradle.api.internal.artifacts.repositories.resolver.DefaultExternalResourceArtifactResolver.downloadStaticResource(DefaultExternalResourceArtifactResolver.java:99)
	at org.gradle.api.internal.artifacts.repositories.resolver.DefaultExternalResourceArtifactResolver.resolveArtifact(DefaultExternalResourceArtifactResolver.java:60)
	at org.gradle.api.internal.artifacts.repositories.resolver.ExternalResourceResolver.download(ExternalResourceResolver.java:252)
	at org.gradle.api.internal.artifacts.repositories.resolver.ExternalResourceResolver.resolveArtifact(ExternalResourceResolver.java:238)
	... 117 more
Caused by: org.gradle.internal.resource.transport.http.HttpRequestException: Could not HEAD
'https://repo1.maven.org/maven2/com/basho/riak/riak-client/1.4.4/riak-client-1.4.4.jar'.
	at org.gradle.internal.resource.transport.http.HttpClientHelper.performRequest(HttpClientHelper.java:72)
	at org.gradle.internal.resource.transport.http.HttpClientHelper.performRawHead(HttpClientHelper.java:50)
	at org.gradle.internal.resource.transport.http.HttpClientHelper.performHead(HttpClientHelper.java:54)
	at org.gradle.internal.resource.transport.http.HttpResourceAccessor.getMetaData(HttpResourceAccessor.java:85)
	at org.gradle.internal.resource.transfer.DefaultExternalResourceConnector.getMetaData(DefaultExternalResourceConnector.java:47)
	at org.gradle.internal.resource.transport.DefaultExternalResourceRepository.getResourceMetaData(DefaultExternalResourceRepository.java:68)
	at org.gradle.internal.resource.transfer.DefaultCacheAwareExternalResourceAccessor.getResource(DefaultCacheAwareExternalResourceAccessor.java:84)
	at org.gradle.api.internal.artifacts.repositories.resolver.DefaultExternalResourceArtifactResolver.downloadStaticResource(DefaultExternalResourceArtifactResolver.java:90)
	... 120 more
Caused by: org.apache.http.NoHttpResponseException: repo1.maven.org:443 failed to respond
	at org.apache.http.impl.conn.DefaultHttpResponseParser.parseHead(DefaultHttpResponseParser.java:143)
	at org.apache.http.impl.conn.DefaultHttpResponseParser.parseHead(DefaultHttpResponseParser.java:57)
	at org.apache.http.impl.io.AbstractMessageParser.parse(AbstractMessageParser.java:261)
	at org.apache.http.impl.DefaultBHttpClientConnection.receiveResponseHeader(DefaultBHttpClientConnection.java:165)
	at org.apache.http.impl.conn.CPoolProxy.receiveResponseHeader(CPoolProxy.java:167)
	at org.apache.http.protocol.HttpRequestExecutor.doReceiveResponse(HttpRequestExecutor.java:272)
	at org.apache.http.protocol.HttpRequestExecutor.execute(HttpRequestExecutor.java:124)
	at org.apache.http.impl.execchain.MainClientExec.execute(MainClientExec.java:271)
	at org.apache.http.impl.execchain.ProtocolExec.execute(ProtocolExec.java:184)
	at org.apache.http.impl.execchain.RetryExec.execute(RetryExec.java:88)
	at org.apache.http.impl.execchain.RedirectExec.execute(RedirectExec.java:110)
	at org.apache.http.impl.client.InternalHttpClient.doExecute(InternalHttpClient.java:184)
	at org.apache.http.impl.client.CloseableHttpClient.execute(CloseableHttpClient.java:82)
	at org.gradle.internal.resource.transport.http.HttpClientHelper.performHttpRequest(HttpClientHelper.java:102)
	at org.gradle.internal.resource.transport.http.HttpClientHelper.executeGetOrHead(HttpClientHelper.java:79)
	at org.gradle.internal.resource.transport.http.HttpClientHelper.performRequest(HttpClientHelper.java:70)
	... 127 more



BUILD FAILED

Total time: 7 mins 16.77 secs
Build step 'Invoke Gradle script' changed build result to FAILURE
Build step 'Invoke Gradle script' marked build as failure
Xvfb stopping
Archiving artifacts
Recording test results
Publishing Javadoc

Mime
View raw message