polygene-dev mailing list archives

Site index · List index
Message view « Date » · « Thread »
Top « Date » · « Thread »
From Niclas Hedhman <nic...@hedhman.org>
Subject Re: Build failed in Jenkins: Zest(JavaEdition)-develop-java8-checkDists #55
Date Tue, 15 Dec 2015 02:29:04 GMT
Paul,
what is this part of the build trying to do? "offline" and "doclint" are
two things I am not aware of...

Cheers
Niclas

On Mon, Dec 14, 2015 at 7:51 PM, Apache Jenkins Server <
jenkins@builds.apache.org> wrote:

> See <
> https://builds.apache.org/job/Zest(JavaEdition)-develop-java8-checkDists/55/changes
> >
>
> Changes:
>
> [soelvsten] removed unused parameter from EntityModel#newEntityState
>
> [soelvsten] minor reformatting
>
> [niclas] ZEST-123 : Removed the Base64Encoder class and use the one in the
> JDK
>
> [niclas] Fixed a reference in documentation to the now gone Specification
> class.
>
> ------------------------------------------
> [...truncated 3813 lines...]
> Project: org.apache.zest.extension.indexing-sql
> Project: org.apache.zest.extension.metrics-yammer
> Project: org.apache.zest.extension.migration
> Project: org.apache.zest.extension.reindexer
> Project: org.apache.zest.extension.valueserialization-orgjson
> Project: org.apache.zest.extension.valueserialization-jackson
> Project: org.apache.zest.extension.valueserialization-stax
> Project: org.apache.zest.manual
> Project: org.apache.zest.samples
> Project: org.apache.zest.sample.dci
> Project: org.apache.zest.sample.dci-cargo
> Project: org.apache.zest.sample.dci-cargo.dcisample_a
> Project: org.apache.zest.sample.dci-cargo.dcisample_b
> Project: org.apache.zest.sample.forum
> Project: org.apache.zest.sample.rental
> Project: org.apache.zest.sample.sql-support
> Project: org.apache.zest.sample.swing
> Project: org.apache.zest.tools
> Project: org.apache.zest.tool.model-detail
> Project: org.apache.zest.tool.envisage
> Project: org.apache.zest.tool.shell
> Project: org.apache.zest.tutorials
> Project: org.apache.zest.tutorial.cargo
> Project: org.apache.zest.tutorial.composites
> Project: org.apache.zest.tutorial.hello
> Project: org.apache.zest.tutorial.introduction
> Project: org.apache.zest.tutorial.introduction.twominutes
> Project: org.apache.zest.tutorial.introduction.tenminutes
> Project: org.apache.zest.tutorial.introduction.thirtyminutes
> Project: org.apache.zest.tutorial.services
> Project: org.apache.zest.tests
> Project: org.apache.zest.test.regression
> Project: org.apache.zest.test.performance
> :apache-zest-java-3.0-SNAPSHOT-bin:download
> :checkBinDist_goOfflineMaven
> + Error stacktraces are turned on.
> [INFO] Scanning for projects...
> [INFO]
> ------------------------------------------------------------------------
> [INFO] Building Unnamed -
> org.apache.zest:go-offline-helper:pom:3.0-SNAPSHOT
> [INFO]    task-segment: [validate]
> [INFO]
> ------------------------------------------------------------------------
> [INFO]
> ------------------------------------------------------------------------
> [ERROR] BUILD ERROR
> [INFO]
> ------------------------------------------------------------------------
> [INFO] Failed to resolve artifact.
>
> Unable to get dependency information: Unable to read the metadata file for
> artifact 'com.google.code.gson:gson:jar': Invalid JDK version in profile
> 'doclint-java8-disable': Unbounded range: [1.8, for project
> com.google.code.gson:gson
>   com.google.code.gson:gson:jar:2.3
>
> from the specified remote repositories:
>   central (http://repo1.maven.org/maven2),
>   go-offline-repo-3 (http://maven.restlet.org/),
>   go-offline-repo-4 (http://clojars.org/repo/),
>   apache-snapshots (
> https://repository.apache.org/content/repositories/snapshots),
>   go-offline-repo-1 (http://repo1.maven.org/maven2/),
>   go-offline-repo-2 (http://repository.ops4j.org/maven2/),
>   apache.snapshots (http://repository.apache.org/snapshots)
>
> Path to dependency:
>         1) org.apache.zest:go-offline-helper:pom:3.0-SNAPSHOT
>         2) org.apache.jclouds:jclouds-core:jar:1.9.0
>
>
>
> [INFO]
> ------------------------------------------------------------------------
> [INFO] Trace
> org.apache.maven.lifecycle.LifecycleExecutionException: Unable to get
> dependency information: Unable to read the metadata file for artifact
> 'com.google.code.gson:gson:jar': Invalid JDK version in profile
> 'doclint-java8-disable': Unbounded range: [1.8, for project
> com.google.code.gson:gson
>   com.google.code.gson:gson:jar:2.3
>
> from the specified remote repositories:
>   central (http://repo1.maven.org/maven2),
>   go-offline-repo-3 (http://maven.restlet.org/),
>   go-offline-repo-4 (http://clojars.org/repo/),
>   apache-snapshots (
> https://repository.apache.org/content/repositories/snapshots),
>   go-offline-repo-1 (http://repo1.maven.org/maven2/),
>   go-offline-repo-2 (http://repository.ops4j.org/maven2/),
>   apache.snapshots (http://repository.apache.org/snapshots)
>
> Path to dependency:
>         1) org.apache.zest:go-offline-helper:pom:3.0-SNAPSHOT
>         2) org.apache.jclouds:jclouds-core:jar:1.9.0
>
>
>         at
> org.apache.maven.lifecycle.DefaultLifecycleExecutor.executeGoals(DefaultLifecycleExecutor.java:711)
>         at
> org.apache.maven.lifecycle.DefaultLifecycleExecutor.executeGoalWithLifecycle(DefaultLifecycleExecutor.java:556)
>         at
> org.apache.maven.lifecycle.DefaultLifecycleExecutor.executeGoal(DefaultLifecycleExecutor.java:535)
>         at
> org.apache.maven.lifecycle.DefaultLifecycleExecutor.executeGoalAndHandleFailures(DefaultLifecycleExecutor.java:387)
>         at
> org.apache.maven.lifecycle.DefaultLifecycleExecutor.executeTaskSegments(DefaultLifecycleExecutor.java:348)
>         at
> org.apache.maven.lifecycle.DefaultLifecycleExecutor.execute(DefaultLifecycleExecutor.java:180)
>         at org.apache.maven.DefaultMaven.doExecute(DefaultMaven.java:328)
>         at org.apache.maven.DefaultMaven.execute(DefaultMaven.java:138)
>         at org.apache.maven.cli.MavenCli.main(MavenCli.java:362)
>         at
> org.apache.maven.cli.compat.CompatibleMain.main(CompatibleMain.java:60)
>         at sun.reflect.NativeMethodAccessorImpl.invoke0(Native Method)
>         at
> sun.reflect.NativeMethodAccessorImpl.invoke(NativeMethodAccessorImpl.java:62)
>         at
> sun.reflect.DelegatingMethodAccessorImpl.invoke(DelegatingMethodAccessorImpl.java:43)
>         at java.lang.reflect.Method.invoke(Method.java:483)
>         at
> org.codehaus.classworlds.Launcher.launchEnhanced(Launcher.java:315)
>         at org.codehaus.classworlds.Launcher.launch(Launcher.java:255)
>         at
> org.codehaus.classworlds.Launcher.mainWithExitCode(Launcher.java:430)
>         at org.codehaus.classworlds.Launcher.main(Launcher.java:375)
> Caused by: org.apache.maven.artifact.resolver.ArtifactResolutionException:
> Unable to get dependency information: Unable to read the metadata file for
> artifact 'com.google.code.gson:gson:jar': Invalid JDK version in profile
> 'doclint-java8-disable': Unbounded range: [1.8, for project
> com.google.code.gson:gson
>   com.google.code.gson:gson:jar:2.3
>
> from the specified remote repositories:
>   central (http://repo1.maven.org/maven2),
>   go-offline-repo-3 (http://maven.restlet.org/),
>   go-offline-repo-4 (http://clojars.org/repo/),
>   apache-snapshots (
> https://repository.apache.org/content/repositories/snapshots),
>   go-offline-repo-1 (http://repo1.maven.org/maven2/),
>   go-offline-repo-2 (http://repository.ops4j.org/maven2/),
>   apache.snapshots (http://repository.apache.org/snapshots)
>
> Path to dependency:
>         1) org.apache.zest:go-offline-helper:pom:3.0-SNAPSHOT
>         2) org.apache.jclouds:jclouds-core:jar:1.9.0
>
>
>         at
> org.apache.maven.artifact.resolver.DefaultArtifactCollector.recurse(DefaultArtifactCollector.java:430)
>         at
> org.apache.maven.artifact.resolver.DefaultArtifactCollector.recurse(DefaultArtifactCollector.java:435)
>         at
> org.apache.maven.artifact.resolver.DefaultArtifactCollector.collect(DefaultArtifactCollector.java:74)
>         at
> org.apache.maven.artifact.resolver.DefaultArtifactResolver.resolveTransitively(DefaultArtifactResolver.java:316)
>         at
> org.apache.maven.artifact.resolver.DefaultArtifactResolver.resolveTransitively(DefaultArtifactResolver.java:304)
>         at
> org.apache.maven.plugin.DefaultPluginManager.resolveTransitiveDependencies(DefaultPluginManager.java:1499)
>         at
> org.apache.maven.plugin.DefaultPluginManager.executeMojo(DefaultPluginManager.java:442)
>         at
> org.apache.maven.lifecycle.DefaultLifecycleExecutor.executeGoals(DefaultLifecycleExecutor.java:694)
>         ... 17 more
> Caused by:
> org.apache.maven.artifact.metadata.ArtifactMetadataRetrievalException:
> Unable to read the metadata file for artifact
> 'com.google.code.gson:gson:jar': Invalid JDK version in profile
> 'doclint-java8-disable': Unbounded range: [1.8, for project
> com.google.code.gson:gson
>         at
> org.apache.maven.project.artifact.MavenMetadataSource.retrieveRelocatedProject(MavenMetadataSource.java:200)
>         at
> org.apache.maven.project.artifact.MavenMetadataSource.retrieveRelocatedArtifact(MavenMetadataSource.java:94)
>         at
> org.apache.maven.artifact.resolver.DefaultArtifactCollector.recurse(DefaultArtifactCollector.java:387)
>         ... 24 more
> Caused by: org.apache.maven.project.ProjectBuildingException: Invalid JDK
> version in profile 'doclint-java8-disable': Unbounded range: [1.8, for
> project com.google.code.gson:gson
>         at
> org.apache.maven.project.DefaultMavenProjectBuilder.injectActiveProfiles(DefaultMavenProjectBuilder.java:1502)
>         at
> org.apache.maven.project.DefaultMavenProjectBuilder.assembleLineage(DefaultMavenProjectBuilder.java:1194)
>         at
> org.apache.maven.project.DefaultMavenProjectBuilder.buildInternal(DefaultMavenProjectBuilder.java:823)
>         at
> org.apache.maven.project.DefaultMavenProjectBuilder.buildFromRepository(DefaultMavenProjectBuilder.java:255)
>         at
> org.apache.maven.project.artifact.MavenMetadataSource.retrieveRelocatedProject(MavenMetadataSource.java:163)
>         ... 26 more
> Caused by:
> org.apache.maven.profiles.activation.ProfileActivationException: Invalid
> JDK version in profile 'doclint-java8-disable': Unbounded range: [1.8,
>         at
> org.apache.maven.profiles.activation.JdkPrefixProfileActivator.isActive(JdkPrefixProfileActivator.java:57)
>         at
> org.apache.maven.profiles.DefaultProfileManager.isActive(DefaultProfileManager.java:273)
>         at
> org.apache.maven.profiles.DefaultProfileManager.getActiveProfiles(DefaultProfileManager.java:209)
>         at
> org.apache.maven.project.DefaultMavenProjectBuilder.injectActiveProfiles(DefaultMavenProjectBuilder.java:1496)
>         ... 30 more
> [INFO]
> ------------------------------------------------------------------------
> [INFO] Total time: < 1 second
> [INFO] Finished at: Mon Dec 14 11:28:57 UTC 2015
> [INFO] Final Memory: 7M/399M
> [INFO]
> ------------------------------------------------------------------------
> :checkBinDist_goOfflineMaven FAILED
>
> FAILURE: Build failed with an exception.
>
> * What went wrong:
> Execution failed for task ':checkBinDist_goOfflineMaven'.
> > Process 'command 'mvn'' finished with non-zero exit value 1
>
> * Try:
> Run with --info or --debug option to get more log output.
>
> * Exception is:
> org.gradle.api.tasks.TaskExecutionException: Execution failed for task
> ':checkBinDist_goOfflineMaven'.
>         at
> org.gradle.api.internal.tasks.execution.ExecuteActionsTaskExecuter.executeActions(ExecuteActionsTaskExecuter.java:69)
>         at
> org.gradle.api.internal.tasks.execution.ExecuteActionsTaskExecuter.execute(ExecuteActionsTaskExecuter.java:46)
>         at
> org.gradle.api.internal.tasks.execution.PostExecutionAnalysisTaskExecuter.execute(PostExecutionAnalysisTaskExecuter.java:35)
>         at
> org.gradle.api.internal.tasks.execution.SkipUpToDateTaskExecuter.execute(SkipUpToDateTaskExecuter.java:64)
>         at
> org.gradle.api.internal.tasks.execution.ValidatingTaskExecuter.execute(ValidatingTaskExecuter.java:58)
>         at
> org.gradle.api.internal.tasks.execution.SkipEmptySourceFilesTaskExecuter.execute(SkipEmptySourceFilesTaskExecuter.java:52)
>         at
> org.gradle.api.internal.tasks.execution.SkipTaskWithNoActionsExecuter.execute(SkipTaskWithNoActionsExecuter.java:52)
>         at
> org.gradle.api.internal.tasks.execution.SkipOnlyIfTaskExecuter.execute(SkipOnlyIfTaskExecuter.java:53)
>         at
> org.gradle.api.internal.tasks.execution.ExecuteAtMostOnceTaskExecuter.execute(ExecuteAtMostOnceTaskExecuter.java:43)
>         at
> org.gradle.execution.taskgraph.DefaultTaskGraphExecuter$EventFiringTaskWorker.execute(DefaultTaskGraphExecuter.java:208)
>         at
> org.gradle.execution.taskgraph.DefaultTaskGraphExecuter$EventFiringTaskWorker.execute(DefaultTaskGraphExecuter.java:186)
>         at
> org.gradle.execution.taskgraph.AbstractTaskPlanExecutor$TaskExecutorWorker.processTask(AbstractTaskPlanExecutor.java:62)
>         at
> org.gradle.execution.taskgraph.AbstractTaskPlanExecutor$TaskExecutorWorker.run(AbstractTaskPlanExecutor.java:50)
>         at
> org.gradle.execution.taskgraph.DefaultTaskPlanExecutor.process(DefaultTaskPlanExecutor.java:25)
>         at
> org.gradle.execution.taskgraph.DefaultTaskGraphExecuter.execute(DefaultTaskGraphExecuter.java:111)
>         at
> org.gradle.execution.SelectedTaskExecutionAction.execute(SelectedTaskExecutionAction.java:37)
>         at
> org.gradle.execution.DefaultBuildExecuter.execute(DefaultBuildExecuter.java:62)
>         at
> org.gradle.execution.DefaultBuildExecuter.access$200(DefaultBuildExecuter.java:23)
>         at
> org.gradle.execution.DefaultBuildExecuter$2.proceed(DefaultBuildExecuter.java:68)
>         at
> org.gradle.execution.DryRunBuildExecutionAction.execute(DryRunBuildExecutionAction.java:32)
>         at
> org.gradle.execution.DefaultBuildExecuter.execute(DefaultBuildExecuter.java:62)
>         at
> org.gradle.execution.DefaultBuildExecuter.execute(DefaultBuildExecuter.java:55)
>         at
> org.gradle.initialization.DefaultGradleLauncher$6.run(DefaultGradleLauncher.java:174)
>         at org.gradle.internal.Factories$1.create(Factories.java:22)
>         at
> org.gradle.internal.progress.DefaultBuildOperationExecutor.run(DefaultBuildOperationExecutor.java:62)
>         at
> org.gradle.internal.progress.DefaultBuildOperationExecutor.run(DefaultBuildOperationExecutor.java:47)
>         at
> org.gradle.initialization.DefaultGradleLauncher.runBuildOperation(DefaultGradleLauncher.java:189)
>         at
> org.gradle.initialization.DefaultGradleLauncher.doBuildStages(DefaultGradleLauncher.java:171)
>         at
> org.gradle.initialization.DefaultGradleLauncher.access$200(DefaultGradleLauncher.java:35)
>         at
> org.gradle.initialization.DefaultGradleLauncher$1.create(DefaultGradleLauncher.java:104)
>         at
> org.gradle.initialization.DefaultGradleLauncher$1.create(DefaultGradleLauncher.java:97)
>         at
> org.gradle.internal.progress.DefaultBuildOperationExecutor.run(DefaultBuildOperationExecutor.java:62)
>         at
> org.gradle.initialization.DefaultGradleLauncher.runRootBuildOperation(DefaultGradleLauncher.java:184)
>         at
> org.gradle.initialization.DefaultGradleLauncher.doBuild(DefaultGradleLauncher.java:97)
>         at
> org.gradle.initialization.DefaultGradleLauncher.run(DefaultGradleLauncher.java:86)
>         at
> org.gradle.launcher.exec.InProcessBuildActionExecuter$DefaultBuildController.run(InProcessBuildActionExecuter.java:93)
>         at
> org.gradle.tooling.internal.provider.ExecuteBuildActionRunner.run(ExecuteBuildActionRunner.java:28)
>         at
> org.gradle.launcher.exec.ChainingBuildActionRunner.run(ChainingBuildActionRunner.java:35)
>         at
> org.gradle.launcher.exec.InProcessBuildActionExecuter.execute(InProcessBuildActionExecuter.java:43)
>         at
> org.gradle.launcher.exec.InProcessBuildActionExecuter.execute(InProcessBuildActionExecuter.java:27)
>         at
> org.gradle.launcher.exec.ContinuousBuildActionExecuter.execute(ContinuousBuildActionExecuter.java:72)
>         at
> org.gradle.launcher.exec.ContinuousBuildActionExecuter.execute(ContinuousBuildActionExecuter.java:44)
>         at
> org.gradle.launcher.exec.DaemonUsageSuggestingBuildActionExecuter.execute(DaemonUsageSuggestingBuildActionExecuter.java:50)
>         at
> org.gradle.launcher.exec.DaemonUsageSuggestingBuildActionExecuter.execute(DaemonUsageSuggestingBuildActionExecuter.java:27)
>         at
> org.gradle.launcher.cli.RunBuildAction.run(RunBuildAction.java:40)
>         at
> org.gradle.internal.Actions$RunnableActionAdapter.execute(Actions.java:170)
>         at
> org.gradle.launcher.cli.CommandLineActionFactory$ParseAndBuildAction.execute(CommandLineActionFactory.java:237)
>         at
> org.gradle.launcher.cli.CommandLineActionFactory$ParseAndBuildAction.execute(CommandLineActionFactory.java:210)
>         at
> org.gradle.launcher.cli.JavaRuntimeValidationAction.execute(JavaRuntimeValidationAction.java:35)
>         at
> org.gradle.launcher.cli.JavaRuntimeValidationAction.execute(JavaRuntimeValidationAction.java:24)
>         at
> org.gradle.launcher.cli.CommandLineActionFactory$WithLogging.execute(CommandLineActionFactory.java:206)
>         at
> org.gradle.launcher.cli.CommandLineActionFactory$WithLogging.execute(CommandLineActionFactory.java:169)
>         at
> org.gradle.launcher.cli.ExceptionReportingAction.execute(ExceptionReportingAction.java:33)
>         at
> org.gradle.launcher.cli.ExceptionReportingAction.execute(ExceptionReportingAction.java:22)
>         at org.gradle.launcher.Main.doAction(Main.java:33)
>         at org.gradle.launcher.bootstrap.EntryPoint.run(EntryPoint.java:45)
>         at
> org.gradle.launcher.bootstrap.ProcessBootstrap.runNoExit(ProcessBootstrap.java:54)
>         at
> org.gradle.launcher.bootstrap.ProcessBootstrap.run(ProcessBootstrap.java:35)
>         at org.gradle.launcher.GradleMain.main(GradleMain.java:23)
>         at
> org.gradle.wrapper.BootstrapMainStarter.start(BootstrapMainStarter.java:30)
>         at
> org.gradle.wrapper.WrapperExecutor.execute(WrapperExecutor.java:127)
>         at
> org.gradle.wrapper.GradleWrapperMain.main(GradleWrapperMain.java:55)
> Caused by: org.gradle.process.internal.ExecException: Process 'command
> 'mvn'' finished with non-zero exit value 1
>         at
> org.gradle.process.internal.DefaultExecHandle$ExecResultImpl.assertNormalExitValue(DefaultExecHandle.java:366)
>         at
> org.gradle.process.internal.DefaultExecAction.execute(DefaultExecAction.java:31)
>         at
> org.gradle.api.tasks.AbstractExecTask.exec(AbstractExecTask.java:54)
>         at
> org.gradle.internal.reflect.JavaMethod.invoke(JavaMethod.java:75)
>         at
> org.gradle.api.internal.project.taskfactory.AnnotationProcessingTaskFactory$StandardTaskAction.doExecute(AnnotationProcessingTaskFactory.java:226)
>         at
> org.gradle.api.internal.project.taskfactory.AnnotationProcessingTaskFactory$StandardTaskAction.execute(AnnotationProcessingTaskFactory.java:219)
>         at
> org.gradle.api.internal.project.taskfactory.AnnotationProcessingTaskFactory$StandardTaskAction.execute(AnnotationProcessingTaskFactory.java:208)
>         at
> org.gradle.api.internal.AbstractTask$TaskActionWrapper.execute(AbstractTask.java:585)
>         at
> org.gradle.api.internal.AbstractTask$TaskActionWrapper.execute(AbstractTask.java:568)
>         at
> org.gradle.api.internal.tasks.execution.ExecuteActionsTaskExecuter.executeAction(ExecuteActionsTaskExecuter.java:80)
>         at
> org.gradle.api.internal.tasks.execution.ExecuteActionsTaskExecuter.executeActions(ExecuteActionsTaskExecuter.java:61)
>         ... 61 more
>
>
> BUILD FAILED
>
> Total time: 18 mins 5.679 secs
> Build step 'Invoke Gradle script' changed build result to FAILURE
> Build step 'Invoke Gradle script' marked build as failure
> Xvfb stopping
> Archiving artifacts
> Recording test results
> Publishing Javadoc
>



-- 
Niclas Hedhman, Software Developer
http://zest.apache.org - New Energy for Java

Mime
  • Unnamed multipart/alternative (inline, None, 0 bytes)
View raw message