polygene-dev mailing list archives

Site index · List index
Message view « Date » · « Thread »
Top « Date » · « Thread »
From Apache Jenkins Server <jenk...@builds.apache.org>
Subject Build failed in Jenkins: Zest(JavaEdition)-support-2.1-java7-check #2
Date Mon, 28 Sep 2015 13:47:06 GMT
See <https://builds.apache.org/job/Zest(JavaEdition)-support-2.1-java7-check/2/changes>

Changes:

[paul] ZEST-126 Fix forum sample assembly and gradle `runSample` task

------------------------------------------
[...truncated 4410 lines...]
:org.qi4j.libraries:org.qi4j.library.constraints:honkerCheck
:org.qi4j.libraries:org.qi4j.library.constraints:check
:org.qi4j.libraries:org.qi4j.library.conversion:honkerCheck
:org.qi4j.libraries:org.qi4j.library.conversion:check
:org.qi4j.libraries:org.qi4j.library.eventsourcing:honkerCheck
:org.qi4j.libraries:org.qi4j.library.eventsourcing:check
:org.qi4j.libraries:org.qi4j.library.eventsourcing-jdbm:honkerCheck
:org.qi4j.libraries:org.qi4j.library.eventsourcing-jdbm:check
:org.qi4j.libraries:org.qi4j.library.eventsourcing-rest:honkerCheck
:org.qi4j.libraries:org.qi4j.library.eventsourcing-rest:check
:org.qi4j.libraries:org.qi4j.library.fileconfig:honkerCheck
:org.qi4j.libraries:org.qi4j.library.fileconfig:check
:org.qi4j.libraries:org.qi4j.library.http:honkerCheck
:org.qi4j.libraries:org.qi4j.library.http:check
:org.qi4j.libraries:org.qi4j.library.invocation-cache:honkerCheck
:org.qi4j.libraries:org.qi4j.library.invocation-cache:check
:org.qi4j.libraries:org.qi4j.library.jmx:honkerCheck
:org.qi4j.libraries:org.qi4j.library.jmx:check
:org.qi4j.libraries:org.qi4j.library.lang-groovy:honkerCheck
:org.qi4j.libraries:org.qi4j.library.lang-groovy:check
:org.qi4j.libraries:org.qi4j.library.lang-javascript:honkerCheck
:org.qi4j.libraries:org.qi4j.library.lang-javascript:check
:org.qi4j.libraries:org.qi4j.library.lang-scala:honkerCheck
:org.qi4j.libraries:org.qi4j.library.lang-scala:check
:org.qi4j.libraries:org.qi4j.library.locking:honkerCheck
:org.qi4j.libraries:org.qi4j.library.locking:check
:org.qi4j.libraries:org.qi4j.library.logging:honkerCheck
:org.qi4j.libraries:org.qi4j.library.logging:check
:org.qi4j.libraries:org.qi4j.library.metrics:honkerCheck
:org.qi4j.libraries:org.qi4j.library.metrics:check
:org.qi4j.libraries:org.qi4j.library.osgi:honkerCheck
:org.qi4j.libraries:org.qi4j.library.osgi:check
:org.qi4j.libraries:org.qi4j.library.rdf:honkerCheck
:org.qi4j.libraries:org.qi4j.library.rdf:check
:org.qi4j.libraries:org.qi4j.library.rest:honkerCheck
Unresolveable artifacts spec: [group:com.fasterxml.jackson, name:jackson-parent, version:2.5.1,
ext:pom]
com.google.common.util.concurrent.UncheckedExecutionException: org.gradle.api.artifacts.ResolveException:
Could not resolve all dependencies for configuration ':org.qi4j.libraries:org.qi4j.library.rest:honkerPomLoader984'.
	at com.google.common.cache.LocalCache$Segment.get(LocalCache.java:2203)
	at com.google.common.cache.LocalCache.get(LocalCache.java:3937)
	at com.google.common.cache.LocalCache.getOrLoad(LocalCache.java:3941)
	at com.google.common.cache.LocalCache$LocalLoadingCache.get(LocalCache.java:4824)
	at com.google.common.cache.LocalCache$LocalLoadingCache.getUnchecked(LocalCache.java:4830)
	at com.google.common.cache.LoadingCache$getUnchecked.call(Unknown Source)
	at org.nosphere.honker.gradle.deptree.GradlePomLoader.resolveArtifacts(GradlePomLoader.groovy:207)
	at org.nosphere.honker.gradle.deptree.GradlePomLoader.this$2$resolveArtifacts(GradlePomLoader.groovy)
	at org.nosphere.honker.gradle.deptree.GradlePomLoader$this$2$resolveArtifacts$3.callCurrent(Unknown
Source)
	at org.nosphere.honker.gradle.deptree.GradlePomLoader.pomData(GradlePomLoader.groovy:183)
	at org.nosphere.honker.gradle.deptree.GradlePomLoader.this$2$pomData(GradlePomLoader.groovy)
	at org.nosphere.honker.gradle.deptree.GradlePomLoader$this$2$pomData$2.callCurrent(Unknown
Source)
	at org.nosphere.honker.gradle.deptree.GradlePomLoader.pomData(GradlePomLoader.groovy:165)
	at org.nosphere.honker.gradle.deptree.GradlePomLoader.this$2$pomData(GradlePomLoader.groovy)
	at org.nosphere.honker.gradle.deptree.GradlePomLoader$this$2$pomData$1.callCurrent(Unknown
Source)
	at org.nosphere.honker.gradle.deptree.GradlePomLoader.load(GradlePomLoader.groovy:75)
	at org.nosphere.honker.gradle.deptree.GradleDepTreeLoader.gatherExternalArtifactData(GradleDepTreeLoader.java:228)
	at org.nosphere.honker.gradle.deptree.GradleDepTreeLoader.gatherExternalDependencyData(GradleDepTreeLoader.java:216)
	at org.nosphere.honker.gradle.deptree.GradleDepTreeLoader.gatherDependencyData(GradleDepTreeLoader.java:176)
	at org.nosphere.honker.gradle.deptree.GradleDepTreeLoader.createNode(GradleDepTreeLoader.java:160)
	at org.nosphere.honker.gradle.deptree.GradleDepTreeLoader.createRootNode(GradleDepTreeLoader.java:147)
	at org.nosphere.honker.gradle.deptree.GradleDepTreeLoader.load(GradleDepTreeLoader.java:121)
	at org.nosphere.honker.deptree.DepTreeLoader$load.call(Unknown Source)
	at org.nosphere.honker.gradle.HonkerCheckTask.check(HonkerCheckTask.groovy:36)
	at sun.reflect.GeneratedMethodAccessor686.invoke(Unknown Source)
	at sun.reflect.DelegatingMethodAccessorImpl.invoke(DelegatingMethodAccessorImpl.java:43)
	at java.lang.reflect.Method.invoke(Method.java:606)
	at org.gradle.internal.reflect.JavaMethod.invoke(JavaMethod.java:75)
	at org.gradle.api.internal.project.taskfactory.AnnotationProcessingTaskFactory$StandardTaskAction.doExecute(AnnotationProcessingTaskFactory.java:226)
	at org.gradle.api.internal.project.taskfactory.AnnotationProcessingTaskFactory$StandardTaskAction.execute(AnnotationProcessingTaskFactory.java:219)
	at org.gradle.api.internal.project.taskfactory.AnnotationProcessingTaskFactory$StandardTaskAction.execute(AnnotationProcessingTaskFactory.java:208)
	at org.gradle.api.internal.AbstractTask$TaskActionWrapper.execute(AbstractTask.java:585)
	at org.gradle.api.internal.AbstractTask$TaskActionWrapper.execute(AbstractTask.java:568)
	at org.gradle.api.internal.tasks.execution.ExecuteActionsTaskExecuter.executeAction(ExecuteActionsTaskExecuter.java:80)
	at org.gradle.api.internal.tasks.execution.ExecuteActionsTaskExecuter.executeActions(ExecuteActionsTaskExecuter.java:61)
	at org.gradle.api.internal.tasks.execution.ExecuteActionsTaskExecuter.execute(ExecuteActionsTaskExecuter.java:46)
	at org.gradle.api.internal.tasks.execution.PostExecutionAnalysisTaskExecuter.execute(PostExecutionAnalysisTaskExecuter.java:35)
	at org.gradle.api.internal.tasks.execution.SkipUpToDateTaskExecuter.execute(SkipUpToDateTaskExecuter.java:64)
	at org.gradle.api.internal.tasks.execution.ValidatingTaskExecuter.execute(ValidatingTaskExecuter.java:58)
	at org.gradle.api.internal.tasks.execution.SkipEmptySourceFilesTaskExecuter.execute(SkipEmptySourceFilesTaskExecuter.java:52)
	at org.gradle.api.internal.tasks.execution.SkipTaskWithNoActionsExecuter.execute(SkipTaskWithNoActionsExecuter.java:52)
	at org.gradle.api.internal.tasks.execution.SkipOnlyIfTaskExecuter.execute(SkipOnlyIfTaskExecuter.java:53)
	at org.gradle.api.internal.tasks.execution.ExecuteAtMostOnceTaskExecuter.execute(ExecuteAtMostOnceTaskExecuter.java:43)
	at org.gradle.execution.taskgraph.DefaultTaskGraphExecuter$EventFiringTaskWorker.execute(DefaultTaskGraphExecuter.java:208)
	at org.gradle.execution.taskgraph.DefaultTaskGraphExecuter$EventFiringTaskWorker.execute(DefaultTaskGraphExecuter.java:186)
	at org.gradle.execution.taskgraph.AbstractTaskPlanExecutor$TaskExecutorWorker.processTask(AbstractTaskPlanExecutor.java:62)
	at org.gradle.execution.taskgraph.AbstractTaskPlanExecutor$TaskExecutorWorker.run(AbstractTaskPlanExecutor.java:50)
	at org.gradle.execution.taskgraph.DefaultTaskPlanExecutor.process(DefaultTaskPlanExecutor.java:25)
	at org.gradle.execution.taskgraph.DefaultTaskGraphExecuter.execute(DefaultTaskGraphExecuter.java:111)
	at org.gradle.execution.SelectedTaskExecutionAction.execute(SelectedTaskExecutionAction.java:37)
	at org.gradle.execution.DefaultBuildExecuter.execute(DefaultBuildExecuter.java:62)
	at org.gradle.execution.DefaultBuildExecuter.access$200(DefaultBuildExecuter.java:23)
	at org.gradle.execution.DefaultBuildExecuter$2.proceed(DefaultBuildExecuter.java:68)
	at org.gradle.execution.DryRunBuildExecutionAction.execute(DryRunBuildExecutionAction.java:32)
	at org.gradle.execution.DefaultBuildExecuter.execute(DefaultBuildExecuter.java:62)
	at org.gradle.execution.DefaultBuildExecuter.execute(DefaultBuildExecuter.java:55)
	at org.gradle.initialization.DefaultGradleLauncher$6.run(DefaultGradleLauncher.java:174)
	at org.gradle.internal.Factories$1.create(Factories.java:22)
	at org.gradle.internal.progress.DefaultBuildOperationExecutor.run(DefaultBuildOperationExecutor.java:62)
	at org.gradle.internal.progress.DefaultBuildOperationExecutor.run(DefaultBuildOperationExecutor.java:47)
	at org.gradle.initialization.DefaultGradleLauncher.runBuildOperation(DefaultGradleLauncher.java:189)
	at org.gradle.initialization.DefaultGradleLauncher.doBuildStages(DefaultGradleLauncher.java:171)
	at org.gradle.initialization.DefaultGradleLauncher.access$200(DefaultGradleLauncher.java:35)
	at org.gradle.initialization.DefaultGradleLauncher$1.create(DefaultGradleLauncher.java:104)
	at org.gradle.initialization.DefaultGradleLauncher$1.create(DefaultGradleLauncher.java:97)
	at org.gradle.internal.progress.DefaultBuildOperationExecutor.run(DefaultBuildOperationExecutor.java:62)
	at org.gradle.initialization.DefaultGradleLauncher.runRootBuildOperation(DefaultGradleLauncher.java:184)
	at org.gradle.initialization.DefaultGradleLauncher.doBuild(DefaultGradleLauncher.java:97)
	at org.gradle.initialization.DefaultGradleLauncher.run(DefaultGradleLauncher.java:86)
	at org.gradle.launcher.exec.InProcessBuildActionExecuter$DefaultBuildController.run(InProcessBuildActionExecuter.java:93)
	at org.gradle.tooling.internal.provider.ExecuteBuildActionRunner.run(ExecuteBuildActionRunner.java:28)
	at org.gradle.launcher.exec.ChainingBuildActionRunner.run(ChainingBuildActionRunner.java:35)
	at org.gradle.launcher.exec.InProcessBuildActionExecuter.execute(InProcessBuildActionExecuter.java:43)
	at org.gradle.launcher.exec.InProcessBuildActionExecuter.execute(InProcessBuildActionExecuter.java:27)
	at org.gradle.launcher.exec.ContinuousBuildActionExecuter.execute(ContinuousBuildActionExecuter.java:72)
	at org.gradle.launcher.exec.ContinuousBuildActionExecuter.execute(ContinuousBuildActionExecuter.java:44)
	at org.gradle.launcher.exec.DaemonUsageSuggestingBuildActionExecuter.execute(DaemonUsageSuggestingBuildActionExecuter.java:50)
	at org.gradle.launcher.exec.DaemonUsageSuggestingBuildActionExecuter.execute(DaemonUsageSuggestingBuildActionExecuter.java:27)
	at org.gradle.launcher.cli.RunBuildAction.run(RunBuildAction.java:40)
	at org.gradle.internal.Actions$RunnableActionAdapter.execute(Actions.java:170)
	at org.gradle.launcher.cli.CommandLineActionFactory$ParseAndBuildAction.execute(CommandLineActionFactory.java:237)
	at org.gradle.launcher.cli.CommandLineActionFactory$ParseAndBuildAction.execute(CommandLineActionFactory.java:210)
	at org.gradle.launcher.cli.JavaRuntimeValidationAction.execute(JavaRuntimeValidationAction.java:35)
	at org.gradle.launcher.cli.JavaRuntimeValidationAction.execute(JavaRuntimeValidationAction.java:24)
	at org.gradle.launcher.cli.CommandLineActionFactory$WithLogging.execute(CommandLineActionFactory.java:206)
	at org.gradle.launcher.cli.CommandLineActionFactory$WithLogging.execute(CommandLineActionFactory.java:169)
	at org.gradle.launcher.cli.ExceptionReportingAction.execute(ExceptionReportingAction.java:33)
	at org.gradle.launcher.cli.ExceptionReportingAction.execute(ExceptionReportingAction.java:22)
	at org.gradle.launcher.Main.doAction(Main.java:33)
	at org.gradle.launcher.bootstrap.EntryPoint.run(EntryPoint.java:45)
	at sun.reflect.NativeMethodAccessorImpl.invoke0(Native Method)
	at sun.reflect.NativeMethodAccessorImpl.invoke(NativeMethodAccessorImpl.java:57)
	at sun.reflect.DelegatingMethodAccessorImpl.invoke(DelegatingMethodAccessorImpl.java:43)
	at java.lang.reflect.Method.invoke(Method.java:606)
	at org.gradle.launcher.bootstrap.ProcessBootstrap.runNoExit(ProcessBootstrap.java:54)
	at org.gradle.launcher.bootstrap.ProcessBootstrap.run(ProcessBootstrap.java:35)
	at org.gradle.launcher.GradleMain.main(GradleMain.java:23)
	at sun.reflect.NativeMethodAccessorImpl.invoke0(Native Method)
	at sun.reflect.NativeMethodAccessorImpl.invoke(NativeMethodAccessorImpl.java:57)
	at sun.reflect.DelegatingMethodAccessorImpl.invoke(DelegatingMethodAccessorImpl.java:43)
	at java.lang.reflect.Method.invoke(Method.java:606)
	at org.gradle.wrapper.BootstrapMainStarter.start(BootstrapMainStarter.java:30)
	at org.gradle.wrapper.WrapperExecutor.execute(WrapperExecutor.java:127)
	at org.gradle.wrapper.GradleWrapperMain.main(GradleWrapperMain.java:55)
Caused by: org.gradle.api.artifacts.ResolveException: Could not resolve all dependencies for
configuration ':org.qi4j.libraries:org.qi4j.library.rest:honkerPomLoader984'.
	at org.gradle.api.internal.artifacts.ivyservice.DefaultLenientConfiguration.rethrowFailure(DefaultLenientConfiguration.java:63)
	at org.gradle.api.internal.artifacts.ivyservice.DefaultResolvedConfiguration.rethrowFailure(DefaultResolvedConfiguration.java:36)
	at org.gradle.api.internal.artifacts.ivyservice.DefaultResolvedConfiguration.getResolvedArtifacts(DefaultResolvedConfiguration.java:59)
	at org.gradle.api.internal.artifacts.ivyservice.SelfResolvingDependencyResolver$FilesAggregatingResolvedConfiguration.getResolvedArtifacts(SelfResolvingDependencyResolver.java:95)
	at org.gradle.api.internal.artifacts.ivyservice.ErrorHandlingArtifactDependencyResolver$ErrorHandlingResolvedConfiguration.getResolvedArtifacts(ErrorHandlingArtifactDependencyResolver.java:223)
	at org.gradle.api.artifacts.ResolvedConfiguration$getResolvedArtifacts.call(Unknown Source)
	at org.nosphere.honker.gradle.deptree.GradlePomLoader$1.load(GradlePomLoader.groovy:228)
	at org.nosphere.honker.gradle.deptree.GradlePomLoader$1.load(GradlePomLoader.groovy)
	at com.google.common.cache.LocalCache$LoadingValueReference.loadFuture(LocalCache.java:3527)
	at com.google.common.cache.LocalCache$Segment.loadSync(LocalCache.java:2319)
	at com.google.common.cache.LocalCache$Segment.lockedGetOrLoad(LocalCache.java:2282)
	at com.google.common.cache.LocalCache$Segment.get(LocalCache.java:2197)
	... 103 more
Caused by: org.gradle.internal.resolve.ModuleVersionNotFoundException: Could not find com.fasterxml.jackson:jackson-parent:2.5.4.
Required by:
    org.qi4j.library:org.qi4j.library.rest:0
	at org.gradle.internal.resolve.result.DefaultBuildableComponentResolveResult.notFound(DefaultBuildableComponentResolveResult.java:38)
	at org.gradle.api.internal.artifacts.ivyservice.ivyresolve.RepositoryChainComponentMetaDataResolver.resolveModule(RepositoryChainComponentMetaDataResolver.java:88)
	at org.gradle.api.internal.artifacts.ivyservice.ivyresolve.RepositoryChainComponentMetaDataResolver.resolve(RepositoryChainComponentMetaDataResolver.java:59)
	at org.gradle.api.internal.artifacts.ivyservice.clientmodule.ClientModuleResolver.resolve(ClientModuleResolver.java:44)
	at org.gradle.api.internal.artifacts.ivyservice.projectmodule.ProjectDependencyResolver.resolve(ProjectDependencyResolver.java:72)
	at org.gradle.api.internal.artifacts.ivyservice.resolveengine.graph.DependencyGraphBuilder$ModuleVersionResolveState.resolve(DependencyGraphBuilder.java:575)
	at org.gradle.api.internal.artifacts.ivyservice.resolveengine.graph.DependencyGraphBuilder$ModuleVersionResolveState.getMetaData(DependencyGraphBuilder.java:585)
	at org.gradle.api.internal.artifacts.ivyservice.resolveengine.graph.DependencyGraphBuilder$DependencyEdge.calculateTargetConfigurations(DependencyGraphBuilder.java:270)
	at org.gradle.api.internal.artifacts.ivyservice.resolveengine.graph.DependencyGraphBuilder$DependencyEdge.attachToTargetConfigurations(DependencyGraphBuilder.java:244)
	at org.gradle.api.internal.artifacts.ivyservice.resolveengine.graph.DependencyGraphBuilder.traverseGraph(DependencyGraphBuilder.java:156)
	at org.gradle.api.internal.artifacts.ivyservice.resolveengine.graph.DependencyGraphBuilder.resolveDependencyGraph(DependencyGraphBuilder.java:94)
	at org.gradle.api.internal.artifacts.ivyservice.resolveengine.graph.DependencyGraphBuilder.resolve(DependencyGraphBuilder.java:84)
	at org.gradle.api.internal.artifacts.ivyservice.resolveengine.DefaultDependencyResolver$1.execute(DefaultDependencyResolver.java:142)
	at org.gradle.api.internal.artifacts.ivyservice.resolveengine.DefaultDependencyResolver$1.execute(DefaultDependencyResolver.java:96)
	at org.gradle.internal.Transformers$4.transform(Transformers.java:137)
	at org.gradle.api.internal.artifacts.ivyservice.DefaultIvyContextManager.withIvy(DefaultIvyContextManager.java:61)
	at org.gradle.api.internal.artifacts.ivyservice.DefaultIvyContextManager.withIvy(DefaultIvyContextManager.java:39)
	at org.gradle.api.internal.artifacts.ivyservice.resolveengine.DefaultDependencyResolver.resolve(DefaultDependencyResolver.java:96)
	at org.gradle.api.internal.artifacts.ivyservice.CacheLockingArtifactDependencyResolver$1.run(CacheLockingArtifactDependencyResolver.java:42)
	at org.gradle.internal.Factories$1.create(Factories.java:22)
	at org.gradle.cache.internal.DefaultCacheAccess.useCache(DefaultCacheAccess.java:192)
	at org.gradle.cache.internal.DefaultCacheAccess.useCache(DefaultCacheAccess.java:175)
	at org.gradle.cache.internal.DefaultPersistentDirectoryStore.useCache(DefaultPersistentDirectoryStore.java:106)
	at org.gradle.cache.internal.DefaultCacheFactory$ReferenceTrackingCache.useCache(DefaultCacheFactory.java:187)
	at org.gradle.api.internal.artifacts.ivyservice.DefaultCacheLockingManager.useCache(DefaultCacheLockingManager.java:64)
	at org.gradle.api.internal.artifacts.ivyservice.CacheLockingArtifactDependencyResolver.resolve(CacheLockingArtifactDependencyResolver.java:40)
	at org.gradle.api.internal.artifacts.ivyservice.SelfResolvingDependencyResolver.resolve(SelfResolvingDependencyResolver.java:41)
	at org.gradle.api.internal.artifacts.ivyservice.ShortcircuitEmptyConfigsArtifactDependencyResolver.resolve(ShortcircuitEmptyConfigsArtifactDependencyResolver.java:56)
	at org.gradle.api.internal.artifacts.ivyservice.ErrorHandlingArtifactDependencyResolver.resolve(ErrorHandlingArtifactDependencyResolver.java:46)
	at org.gradle.api.internal.artifacts.ivyservice.DefaultConfigurationResolver.resolve(DefaultConfigurationResolver.java:45)
	at org.gradle.api.internal.artifacts.configurations.DefaultConfiguration.resolveGraphIfRequired(DefaultConfiguration.java:363)
	at org.gradle.api.internal.artifacts.configurations.DefaultConfiguration.resolveNow(DefaultConfiguration.java:338)
	at org.gradle.api.internal.artifacts.configurations.DefaultConfiguration.getResolvedConfiguration(DefaultConfiguration.java:331)
	at org.gradle.api.internal.artifacts.configurations.DefaultConfiguration_Decorated.getResolvedConfiguration(Unknown
Source)
	at org.gradle.api.artifacts.Configuration$getResolvedConfiguration$1.call(Unknown Source)
	... 109 more
:org.qi4j.libraries:org.qi4j.library.rest:check
:org.qi4j.libraries:org.qi4j.library.rest-client:honkerCheck
:org.qi4j.libraries:org.qi4j.library.rest-client:check
:org.qi4j.libraries:org.qi4j.library.rest-common:honkerCheck
:org.qi4j.libraries:org.qi4j.library.rest-common:check
:org.qi4j.libraries:org.qi4j.library.rest-server:honkerCheck
:org.qi4j.libraries:org.qi4j.library.rest-server:check
:org.qi4j.libraries:org.qi4j.library.scheduler:honkerCheck
:org.qi4j.libraries:org.qi4j.library.scheduler:check
:org.qi4j.libraries:org.qi4j.library.scripting:honkerCheck
:org.qi4j.libraries:org.qi4j.library.scripting:check
:org.qi4j.libraries:org.qi4j.library.servlet:honkerCheck
:org.qi4j.libraries:org.qi4j.library.servlet:check
:org.qi4j.libraries:org.qi4j.library.shiro-core:honkerCheck
:org.qi4j.libraries:org.qi4j.library.shiro-core:check
:org.qi4j.libraries:org.qi4j.library.shiro-web:honkerCheck
:org.qi4j.libraries:org.qi4j.library.shiro-web:check
:org.qi4j.libraries:org.qi4j.library.spring:honkerCheck
:org.qi4j.libraries:org.qi4j.library.spring:check
:org.qi4j.libraries:org.qi4j.library.sql:honkerCheck
:org.qi4j.libraries:org.qi4j.library.sql:check
:org.qi4j.libraries:org.qi4j.library.sql-bonecp:honkerCheck
:org.qi4j.libraries:org.qi4j.library.sql-bonecp:check
:org.qi4j.libraries:org.qi4j.library.sql-dbcp:honkerCheck
:org.qi4j.libraries:org.qi4j.library.sql-dbcp:check
:org.qi4j.libraries:org.qi4j.library.sql-liquibase:honkerCheck
:org.qi4j.libraries:org.qi4j.library.sql-liquibase:check
:org.qi4j.libraries:org.qi4j.library.uid:honkerCheck
:org.qi4j.libraries:org.qi4j.library.uid:check
:org.qi4j.libraries:org.qi4j.library.uowfile:honkerCheck
:org.qi4j.libraries:org.qi4j.library.uowfile:check
:org.qi4j.samples:org.qi4j.sample.dci:honkerCheck
:org.qi4j.samples:org.qi4j.sample.dci:check
:org.qi4j.samples:org.qi4j.sample.dci-cargo:honkerCheck
:org.qi4j.samples:org.qi4j.sample.dci-cargo:check
:org.qi4j.samples:org.qi4j.sample.forum:honkerCheck FAILED

FAILURE: Build failed with an exception.

* What went wrong:
Execution failed for task ':org.qi4j.samples:org.qi4j.sample.forum:honkerCheck'.
> License check failures: 2
    ch.qos.logback:logback-classic:1.1.3:jar Eclipse Public License (EPL) / GNU Lesser General
Public License conflicts with The Apache Software License, Version 2.0
    ch.qos.logback:logback-core:1.1.3:jar Eclipse Public License (EPL) / GNU Lesser General
Public License conflicts with The Apache Software License, Version 2.0

* Try:
Run with --stacktrace option to get the stack trace. Run with --info or --debug option to
get more log output.

BUILD FAILED

Total time: 9 mins 2.134 secs
Build step 'Invoke Gradle script' changed build result to FAILURE
Build step 'Invoke Gradle script' marked build as failure
Xvfb stopping
Recording test results

Mime
View raw message