polygene-dev mailing list archives

Site index · List index
Message view « Date » · « Thread »
Top « Date » · « Thread »
From Niclas Hedhman <nic...@hedhman.org>
Subject Re: Build failed in Jenkins: Zest(JavaEdition)-develop-java8-check #83
Date Sun, 02 Aug 2015 11:16:41 GMT
Ahhh... Forgot dependencies. I am out for a beer now... :-(
On Aug 2, 2015 19:04, "Apache Jenkins Server" <jenkins@builds.apache.org>
wrote:

> See <
> https://builds.apache.org/job/Zest(JavaEdition)-develop-java8-check/83/changes
> >
>
> Changes:
>
> [niclas] ZEST-111; First commit to the Restful Library.
>
> [paulmerlin] Build: fix Jacoco based global coverageReport task
>
> ------------------------------------------
> [...truncated 1280 lines...]
>     private static final NameService nameService = new LocalManagedDns();
>                          ^
> <
> https://builds.apache.org/job/Zest(JavaEdition)-develop-java8-check/ws/libraries/http/src/test/java/org/apache/zest/library/http/dns/LocalManagedDnsDescriptor.java>:26:
> warning: NameService is internal proprietary API and may be removed in a
> future release
>     public NameService createNameService()
>            ^
> 10 warnings
>
>
> :org.apache.zest.libraries:org.apache.zest.library.http:processTestResources
> :org.apache.zest.libraries:org.apache.zest.library.http:testClasses
> :org.apache.zest.libraries:org.apache.zest.library.http:test
>
> :org.apache.zest.libraries:org.apache.zest.library.invocation-cache:makeVersionClass
>
> :org.apache.zest.libraries:org.apache.zest.library.invocation-cache:compileVersionJava
>
> :org.apache.zest.libraries:org.apache.zest.library.invocation-cache:compileJava
>
> :org.apache.zest.libraries:org.apache.zest.library.invocation-cache:honkerGenDependencies
>
> :org.apache.zest.libraries:org.apache.zest.library.invocation-cache:honkerGenLicense
>
> :org.apache.zest.libraries:org.apache.zest.library.invocation-cache:honkerGenNotice
> :org.apache.zest.libraries:org.apache.zest.library.invocation-cache:processResources
> UP-TO-DATE
> :org.apache.zest.libraries:org.apache.zest.library.invocation-cache:classes
>
> :org.apache.zest.libraries:org.apache.zest.library.invocation-cache:compileTestJava
> :org.apache.zest.libraries:org.apache.zest.library.invocation-cache:processTestResources
> UP-TO-DATE
>
> :org.apache.zest.libraries:org.apache.zest.library.invocation-cache:testClasses
> :org.apache.zest.libraries:org.apache.zest.library.invocation-cache:test
> :org.apache.zest.libraries:org.apache.zest.library.jmx:compileTestJava
> :org.apache.zest.libraries:org.apache.zest.library.jmx:processTestResources
> UP-TO-DATE
> :org.apache.zest.libraries:org.apache.zest.library.jmx:testClasses
> :org.apache.zest.libraries:org.apache.zest.library.jmx:test
>
> :org.apache.zest.libraries:org.apache.zest.library.lang-groovy:makeVersionClass
>
> :org.apache.zest.libraries:org.apache.zest.library.lang-groovy:compileVersionJava
> :org.apache.zest.libraries:org.apache.zest.library.lang-groovy:compileJava
> :org.apache.zest.libraries:org.apache.zest.library.lang-groovy:compileGroovy
> UP-TO-DATE
>
> :org.apache.zest.libraries:org.apache.zest.library.lang-groovy:honkerGenDependencies
>
> :org.apache.zest.libraries:org.apache.zest.library.lang-groovy:honkerGenLicense
>
> :org.apache.zest.libraries:org.apache.zest.library.lang-groovy:honkerGenNotice
> :org.apache.zest.libraries:org.apache.zest.library.lang-groovy:processResources
> UP-TO-DATE
> :org.apache.zest.libraries:org.apache.zest.library.lang-groovy:classes
> :org.apache.zest.libraries:org.apache.zest.library.lang-groovy:compileTestJava
> UP-TO-DATE
>
> :org.apache.zest.libraries:org.apache.zest.library.lang-groovy:compileTestGroovy
>
> :org.apache.zest.libraries:org.apache.zest.library.lang-groovy:processTestResources
> :org.apache.zest.libraries:org.apache.zest.library.lang-groovy:testClasses
> :org.apache.zest.libraries:org.apache.zest.library.lang-groovy:test
>
> :org.apache.zest.libraries:org.apache.zest.library.lang-javascript:makeVersionClass
>
> :org.apache.zest.libraries:org.apache.zest.library.lang-javascript:compileVersionJava
>
> :org.apache.zest.libraries:org.apache.zest.library.scripting:makeVersionClass
>
> :org.apache.zest.libraries:org.apache.zest.library.scripting:compileVersionJava
> :org.apache.zest.libraries:org.apache.zest.library.scripting:compileJava
>
> :org.apache.zest.libraries:org.apache.zest.library.scripting:honkerGenDependencies
>
> :org.apache.zest.libraries:org.apache.zest.library.scripting:honkerGenLicense
>
> :org.apache.zest.libraries:org.apache.zest.library.scripting:honkerGenNotice
> :org.apache.zest.libraries:org.apache.zest.library.scripting:processResources
> UP-TO-DATE
> :org.apache.zest.libraries:org.apache.zest.library.scripting:classes
> :org.apache.zest.libraries:org.apache.zest.library.scripting:processVersionResources
> UP-TO-DATE
> :org.apache.zest.libraries:org.apache.zest.library.scripting:versionClasses
> :org.apache.zest.libraries:org.apache.zest.library.scripting:jar
>
> :org.apache.zest.libraries:org.apache.zest.library.lang-javascript:compileJava
>
> :org.apache.zest.libraries:org.apache.zest.library.lang-javascript:honkerGenDependencies
>
> :org.apache.zest.libraries:org.apache.zest.library.lang-javascript:honkerGenLicense
>
> :org.apache.zest.libraries:org.apache.zest.library.lang-javascript:honkerGenNotice
> :org.apache.zest.libraries:org.apache.zest.library.lang-javascript:processResources
> UP-TO-DATE
> :org.apache.zest.libraries:org.apache.zest.library.lang-javascript:classes
>
> :org.apache.zest.libraries:org.apache.zest.library.lang-javascript:compileTestJava
>
> :org.apache.zest.libraries:org.apache.zest.library.lang-javascript:processTestResources
>
> :org.apache.zest.libraries:org.apache.zest.library.lang-javascript:testClasses
> :org.apache.zest.libraries:org.apache.zest.library.lang-javascript:test
>
> :org.apache.zest.libraries:org.apache.zest.library.lang-scala:makeVersionClass
>
> :org.apache.zest.libraries:org.apache.zest.library.lang-scala:compileVersionJava
> :org.apache.zest.libraries:org.apache.zest.library.lang-scala:compileJavaNote:
> <
> https://builds.apache.org/job/Zest(JavaEdition)-develop-java8-check/ws/libraries/lang-scala/src/main/java/org/apache/zest/library/scala/ScalaTraitMixin.java>
> uses unchecked or unsafe operations.
> Note: Recompile with -Xlint:unchecked for details.
>
> :org.apache.zest.libraries:org.apache.zest.library.lang-scala:compileScala
> UP-TO-DATE
>
> :org.apache.zest.libraries:org.apache.zest.library.lang-scala:honkerGenDependencies
>
> :org.apache.zest.libraries:org.apache.zest.library.lang-scala:honkerGenLicense
>
> :org.apache.zest.libraries:org.apache.zest.library.lang-scala:honkerGenNotice
> :org.apache.zest.libraries:org.apache.zest.library.lang-scala:processResources
> UP-TO-DATE
> :org.apache.zest.libraries:org.apache.zest.library.lang-scala:classes
> :org.apache.zest.libraries:org.apache.zest.library.lang-scala:compileTestJava
> UP-TO-DATE
>
> :org.apache.zest.libraries:org.apache.zest.library.lang-scala:compileTestScala
> [ant:scalac] Element '<
> https://builds.apache.org/job/Zest(JavaEdition)-develop-java8-check/ws/libraries/lang-scala/build/resources/main'>
> does not exist.
> :org.apache.zest.libraries:org.apache.zest.library.lang-scala:processTestResources
> UP-TO-DATE
> :org.apache.zest.libraries:org.apache.zest.library.lang-scala:testClasses
> :org.apache.zest.libraries:org.apache.zest.library.lang-scala:test
> :org.apache.zest.libraries:org.apache.zest.library.locking:compileTestJava
> :org.apache.zest.libraries:org.apache.zest.library.locking:processTestResources
> UP-TO-DATE
> :org.apache.zest.libraries:org.apache.zest.library.locking:testClasses
> :org.apache.zest.libraries:org.apache.zest.library.locking:test
> :org.apache.zest.libraries:org.apache.zest.library.logging:compileTestJava
>
> :org.apache.zest.libraries:org.apache.zest.library.logging:processTestResources
> :org.apache.zest.libraries:org.apache.zest.library.logging:testClasses
> :org.apache.zest.libraries:org.apache.zest.library.logging:test
> :org.apache.zest.extensions:org.apache.zest.extension.metrics-yammer:processVersionResources
> UP-TO-DATE
>
> :org.apache.zest.extensions:org.apache.zest.extension.metrics-yammer:versionClasses
> :org.apache.zest.extensions:org.apache.zest.extension.metrics-yammer:jar
> :org.apache.zest.libraries:org.apache.zest.library.metrics:makeVersionClass
>
> :org.apache.zest.libraries:org.apache.zest.library.metrics:compileVersionJava
> :org.apache.zest.libraries:org.apache.zest.library.metrics:compileJava
>
> :org.apache.zest.libraries:org.apache.zest.library.metrics:honkerGenDependencies
> :org.apache.zest.libraries:org.apache.zest.library.metrics:honkerGenLicense
> :org.apache.zest.libraries:org.apache.zest.library.metrics:honkerGenNotice
> :org.apache.zest.libraries:org.apache.zest.library.metrics:processResources
> UP-TO-DATE
> :org.apache.zest.libraries:org.apache.zest.library.metrics:classes
> :org.apache.zest.libraries:org.apache.zest.library.metrics:compileTestJava
> :org.apache.zest.libraries:org.apache.zest.library.metrics:processTestResources
> UP-TO-DATE
> :org.apache.zest.libraries:org.apache.zest.library.metrics:testClasses
> :org.apache.zest.libraries:org.apache.zest.library.metrics:test
> :org.apache.zest.libraries:org.apache.zest.library.osgi:makeVersionClass
> :org.apache.zest.libraries:org.apache.zest.library.osgi:compileVersionJava
> :org.apache.zest.libraries:org.apache.zest.library.osgi:compileJava
>
> :org.apache.zest.libraries:org.apache.zest.library.osgi:honkerGenDependencies
> :org.apache.zest.libraries:org.apache.zest.library.osgi:honkerGenLicense
> :org.apache.zest.libraries:org.apache.zest.library.osgi:honkerGenNotice
> :org.apache.zest.libraries:org.apache.zest.library.osgi:processResources
> UP-TO-DATE
> :org.apache.zest.libraries:org.apache.zest.library.osgi:classes
> :org.apache.zest.libraries:org.apache.zest.library.osgi:compileTestJava
> :org.apache.zest.libraries:org.apache.zest.library.osgi:processTestResources
> UP-TO-DATE
> :org.apache.zest.libraries:org.apache.zest.library.osgi:testClasses
> :org.apache.zest.libraries:org.apache.zest.library.osgi:test
> :org.apache.zest.libraries:org.apache.zest.library.rdf:compileTestJava
> :org.apache.zest.libraries:org.apache.zest.library.rdf:processTestResources
> :org.apache.zest.libraries:org.apache.zest.library.rdf:testClasses
> :org.apache.zest.libraries:org.apache.zest.library.rdf:test
> :org.apache.zest.libraries:org.apache.zest.library.http:processVersionResources
> UP-TO-DATE
> :org.apache.zest.libraries:org.apache.zest.library.http:versionClasses
> :org.apache.zest.libraries:org.apache.zest.library.http:jar
> :org.apache.zest.libraries:org.apache.zest.library.rest:makeVersionClass
> :org.apache.zest.libraries:org.apache.zest.library.rest:compileVersionJava
> :org.apache.zest.libraries:org.apache.zest.library.rest:compileJava<
> https://builds.apache.org/job/Zest(JavaEdition)-develop-java8-check/ws/libraries/rest/src/main/java/org/apache/zest/library/rest/admin/SPARQLResource.java>:139:
> warning: [deprecation] QueryResultUtil in org.openrdf.query has been
> deprecated
>                                 QueryResultUtil.report( queryResult,
> qrWriter );
>                                 ^
> <
> https://builds.apache.org/job/Zest(JavaEdition)-develop-java8-check/ws/libraries/rest/src/main/java/org/apache/zest/library/rest/admin/SPARQLResource.java>:170:
> warning: [deprecation] QueryResultUtil in org.openrdf.query has been
> deprecated
>                                 QueryResultUtil.report( queryResult,
> qrWriter );
>                                 ^
> <
> https://builds.apache.org/job/Zest(JavaEdition)-develop-java8-check/ws/libraries/rest/src/main/java/org/apache/zest/library/rest/admin/SPARQLResource.java>:201:
> warning: [deprecation] QueryResultUtil in org.openrdf.query has been
> deprecated
>                                 QueryResultUtil.report( queryResult,
> qrWriter );
>                                 ^
> 3 warnings
>
>
> :org.apache.zest.libraries:org.apache.zest.library.rest:honkerGenDependencies
> :org.apache.zest.libraries:org.apache.zest.library.rest:honkerGenLicense
> :org.apache.zest.libraries:org.apache.zest.library.rest:honkerGenNotice
> :org.apache.zest.libraries:org.apache.zest.library.rest:processResources
> :org.apache.zest.libraries:org.apache.zest.library.rest:classes
> :org.apache.zest.libraries:org.apache.zest.library.rest:compileTestJava
> :org.apache.zest.libraries:org.apache.zest.library.rest:processTestResources
> UP-TO-DATE
> :org.apache.zest.libraries:org.apache.zest.library.rest:testClasses
> :org.apache.zest.libraries:org.apache.zest.library.rest:test
>
> :org.apache.zest.libraries:org.apache.zest.library.rest-client:makeVersionClass
>
> :org.apache.zest.libraries:org.apache.zest.library.rest-client:compileVersionJava
>
> :org.apache.zest.libraries:org.apache.zest.library.rest-common:makeVersionClass
>
> :org.apache.zest.libraries:org.apache.zest.library.rest-common:compileVersionJava
> :org.apache.zest.libraries:org.apache.zest.library.rest-common:compileJavaNote:
> Some input files use unchecked or unsafe operations.
> Note: Recompile with -Xlint:unchecked for details.
>
>
> :org.apache.zest.libraries:org.apache.zest.library.rest-common:honkerGenDependencies
>
> :org.apache.zest.libraries:org.apache.zest.library.rest-common:honkerGenLicense
>
> :org.apache.zest.libraries:org.apache.zest.library.rest-common:honkerGenNotice
> :org.apache.zest.libraries:org.apache.zest.library.rest-common:processResources
> UP-TO-DATE
> :org.apache.zest.libraries:org.apache.zest.library.rest-common:classes
> :org.apache.zest.libraries:org.apache.zest.library.rest-common:processVersionResources
> UP-TO-DATE
>
> :org.apache.zest.libraries:org.apache.zest.library.rest-common:versionClasses
> :org.apache.zest.libraries:org.apache.zest.library.rest-common:jar
> :org.apache.zest.libraries:org.apache.zest.library.rest-client:compileJavaNote:
> Some input files use unchecked or unsafe operations.
> Note: Recompile with -Xlint:unchecked for details.
>
>
> :org.apache.zest.libraries:org.apache.zest.library.rest-client:honkerGenDependencies
>
> :org.apache.zest.libraries:org.apache.zest.library.rest-client:honkerGenLicense
>
> :org.apache.zest.libraries:org.apache.zest.library.rest-client:honkerGenNotice
>
> :org.apache.zest.libraries:org.apache.zest.library.rest-client:processResources
> :org.apache.zest.libraries:org.apache.zest.library.rest-client:classes
>
> :org.apache.zest.libraries:org.apache.zest.library.rest-server:makeVersionClass
>
> :org.apache.zest.libraries:org.apache.zest.library.rest-server:compileVersionJava
> :org.apache.zest.libraries:org.apache.zest.library.rest-server:compileJava<
> https://builds.apache.org/job/Zest(JavaEdition)-develop-java8-check/ws/libraries/rest-server/src/main/java/org/apache/zest/library/rest/server/restlet/freemarker/ValueCompositeObjectWrapper.java>:29:
> warning: [deprecation] DefaultObjectWrapper() in DefaultObjectWrapper has
> been deprecated
> public class ValueCompositeObjectWrapper
>        ^
> <
> https://builds.apache.org/job/Zest(JavaEdition)-develop-java8-check/ws/libraries/rest-server/src/main/java/org/apache/zest/library/rest/server/assembler/RestServerAssembler.java>:73:
> warning: [deprecation] Configuration() in Configuration has been deprecated
>         freemarker.template.Configuration cfg = new
> freemarker.template.Configuration();
>                                                 ^
> Note: Some input files use unchecked or unsafe operations.
> Note: Recompile with -Xlint:unchecked for details.
> 2 warnings
>
>
> :org.apache.zest.libraries:org.apache.zest.library.rest-server:honkerGenDependencies
>
> :org.apache.zest.libraries:org.apache.zest.library.rest-server:honkerGenLicense
>
> :org.apache.zest.libraries:org.apache.zest.library.rest-server:honkerGenNotice
>
> :org.apache.zest.libraries:org.apache.zest.library.rest-server:processResources
> :org.apache.zest.libraries:org.apache.zest.library.rest-server:classes
> :org.apache.zest.libraries:org.apache.zest.library.rest-server:processVersionResources
> UP-TO-DATE
>
> :org.apache.zest.libraries:org.apache.zest.library.rest-server:versionClasses
> :org.apache.zest.libraries:org.apache.zest.library.rest-server:jar
>
> :org.apache.zest.libraries:org.apache.zest.library.rest-client:compileTestJava
> :org.apache.zest.libraries:org.apache.zest.library.rest-client:processTestResources
> UP-TO-DATE
> :org.apache.zest.libraries:org.apache.zest.library.rest-client:testClasses
> :org.apache.zest.libraries:org.apache.zest.library.rest-client:test
> :org.apache.zest.libraries:org.apache.zest.library.rest-common:compileTestJava
> UP-TO-DATE
> :org.apache.zest.libraries:org.apache.zest.library.rest-common:processTestResources
> UP-TO-DATE
> :org.apache.zest.libraries:org.apache.zest.library.rest-common:testClasses
> UP-TO-DATE
> :org.apache.zest.libraries:org.apache.zest.library.rest-common:test
> UP-TO-DATE
>
> :org.apache.zest.libraries:org.apache.zest.library.rest-server:compileTestJava
> :org.apache.zest.libraries:org.apache.zest.library.rest-server:processTestResources
> UP-TO-DATE
> :org.apache.zest.libraries:org.apache.zest.library.rest-server:testClasses
> :org.apache.zest.libraries:org.apache.zest.library.rest-server:test
> :org.apache.zest.extensions:org.apache.zest.extension.valueserialization-jackson:processVersionResources
> UP-TO-DATE
>
> :org.apache.zest.extensions:org.apache.zest.extension.valueserialization-jackson:versionClasses
>
> :org.apache.zest.extensions:org.apache.zest.extension.valueserialization-jackson:jar
> :org.apache.zest.libraries:org.apache.zest.library.restlet:makeVersionClass
>
> :org.apache.zest.libraries:org.apache.zest.library.restlet:compileVersionJava
> :org.apache.zest.libraries:org.apache.zest.library.restlet:compileJava<
> https://builds.apache.org/job/Zest(JavaEdition)-develop-java8-check/ws/libraries/restlet/src/main/java/org/apache/zest/library/restlet/assembly/infrastructue/IndexingModule.java>:28:
> error: package org.apache.zest.index.rdf.assembly does not exist
> import org.apache.zest.index.rdf.assembly.RdfNativeSesameStoreAssembler;
>                                          ^
> <
> https://builds.apache.org/job/Zest(JavaEdition)-develop-java8-check/ws/libraries/restlet/src/main/java/org/apache/zest/library/restlet/assembly/infrastructue/IndexingModule.java>:29:
> error: package org.apache.zest.library.rdf.repository does not exist
> import org.apache.zest.library.rdf.repository.NativeConfiguration;
>                                              ^
> <
> https://builds.apache.org/job/Zest(JavaEdition)-develop-java8-check/ws/libraries/restlet/src/main/java/org/apache/zest/library/restlet/assembly/infrastructue/FileStorageModule.java>:24:
> error: package org.apache.zest.entitystore.file.assembly does not exist
> import org.apache.zest.entitystore.file.assembly.FileEntityStoreAssembler;
>                                                 ^
> <
> https://builds.apache.org/job/Zest(JavaEdition)-develop-java8-check/ws/libraries/restlet/src/main/java/org/apache/zest/library/restlet/assembly/infrastructue/IndexingModule.java>:52:
> error: cannot find symbol
>         configModule.entities( NativeConfiguration.class ).visibleIn(
> Visibility.application );
>                                ^
>   symbol:   class NativeConfiguration
>   location: class IndexingModule
> <
> https://builds.apache.org/job/Zest(JavaEdition)-develop-java8-check/ws/libraries/restlet/src/main/java/org/apache/zest/library/restlet/assembly/infrastructue/IndexingModule.java>:53:
> error: cannot find symbol
>         new RdfNativeSesameStoreAssembler(Visibility.application,
> Visibility.module).assemble( module );
>             ^
>   symbol:   class RdfNativeSesameStoreAssembler
>   location: class IndexingModule
> <
> https://builds.apache.org/job/Zest(JavaEdition)-develop-java8-check/ws/libraries/restlet/src/main/java/org/apache/zest/library/restlet/assembly/infrastructue/FileStorageModule.java>:46:
> error: cannot find symbol
>         new FileEntityStoreAssembler()
>             ^
>   symbol:   class FileEntityStoreAssembler
>   location: class FileStorageModule
> Note: Some input files use unchecked or unsafe operations.
> Note: Recompile with -Xlint:unchecked for details.
> 6 errors
>  FAILED
>
> FAILURE: Build failed with an exception.
>
> * What went wrong:
> Execution failed for task
> ':org.apache.zest.libraries:org.apache.zest.library.restlet:compileJava'.
> > Compilation failed; see the compiler error output for details.
>
> * Try:
> Run with --stacktrace option to get the stack trace. Run with --info or
> --debug option to get more log output.
>
> BUILD FAILED
>
> Total time: 5 mins 20.882 secs
> Build step 'Invoke Gradle script' changed build result to FAILURE
> Build step 'Invoke Gradle script' marked build as failure
> Xvfb stopping
> Recording test results
>

Mime
  • Unnamed multipart/alternative (inline, None, 0 bytes)
View raw message