polygene-dev mailing list archives

Site index · List index
Message view « Date » · « Thread »
Top « Date » · « Thread »
From Apache Jenkins Server <jenk...@builds.apache.org>
Subject Build failed in Jenkins: Zest(JavaEdition)-develop-java8-checkDists #33
Date Thu, 27 Aug 2015 11:14:35 GMT
See <https://builds.apache.org/job/Zest(JavaEdition)-develop-java8-checkDists/33/changes>

Changes:

[niclas] ZEST-112, Replaced org.apache.zest.functional.Function and org.apache.zest.functional.Function2
with java.util.functional.Function and java.util.functional.BiFunction

[niclas] ZEST-113; Removed the use of Specification and replaced with Java 8 Predicate.

[niclas] ZEST-118; Massive update of removing the Iterable<> use for type manipulation
in the runtime internals and all public APIs of that.

[soelvsten] Annotations#findAccessorAndTypeAnnotations now returns list to avoid reuse-of-stream
trap

[niclas] ZEST-118; Fixed that Classes.typesOf() also returns the inparameter.

[niclas] ZEST-118; Fixed compile error (missing method) that was only used by performance
test, and not normally run in builds, and not imported into IntelliJ.

[niclas] ZEST-118; Fixed some of the bugs that was introduced in the Iterable conversion to
Stream.

[niclas] ZEST-118; Missed a getName() call in Serialization.

------------------------------------------
[...truncated 3008 lines...]
:org.apache.zest.samples:org.apache.zest.sample.dci-cargo:org.apache.zest.sample.dci-cargo.dcisample_a:processResources
:org.apache.zest.samples:org.apache.zest.sample.dci-cargo:org.apache.zest.sample.dci-cargo.dcisample_a:classes
:org.apache.zest.samples:org.apache.zest.sample.dci-cargo:org.apache.zest.sample.dci-cargo.dcisample_a:compileTestJava
:org.apache.zest.samples:org.apache.zest.sample.dci-cargo:org.apache.zest.sample.dci-cargo.dcisample_a:processTestResources
UP-TO-DATE
:org.apache.zest.samples:org.apache.zest.sample.dci-cargo:org.apache.zest.sample.dci-cargo.dcisample_a:testClasses
:org.apache.zest.samples:org.apache.zest.sample.dci-cargo:org.apache.zest.sample.dci-cargo.dcisample_a:test

org.apache.zest.sample.dcicargo.sample_a.context.shipping.booking.BookNewCargoTest > step_3_CalculatePossibleRoutes
FAILED
    org.apache.zest.api.service.ServiceImporterException at BookNewCargoTest.java:170
        Caused by: org.apache.zest.api.object.NoSuchObjectException at BookNewCargoTest.java:170

org.apache.zest.sample.dcicargo.sample_a.context.shipping.booking.BookNewCargoTest > deviation_3a_NoRoutesCanBeThatFast
FAILED
    java.lang.Exception
        Caused by: org.apache.zest.api.service.ServiceImporterException at BookNewCargoTest.java:154
            Caused by: org.apache.zest.api.object.NoSuchObjectException at BookNewCargoTest.java:154

org.apache.zest.sample.dcicargo.sample_a.context.shipping.booking.BookNewCargoTest > step_5_AssignCargoToRoute
FAILED
    org.apache.zest.api.service.ServiceImporterException at BookNewCargoTest.java:200
        Caused by: org.apache.zest.api.object.NoSuchObjectException at BookNewCargoTest.java:200

48 tests completed, 3 failed
There were failing tests. See the report at: file://<https://builds.apache.org/job/Zest(JavaEdition)-develop-java8-checkDists/ws/samples/dci-cargo/dcisample_a/build/reports/tests/index.html>
:org.apache.zest.samples:org.apache.zest.sample.dci-cargo:org.apache.zest.sample.dci-cargo.dcisample_b:makeVersionClass
:org.apache.zest.samples:org.apache.zest.sample.dci-cargo:org.apache.zest.sample.dci-cargo.dcisample_b:compileVersionJava
:org.apache.zest.samples:org.apache.zest.sample.dci-cargo:org.apache.zest.sample.dci-cargo.dcisample_b:compileJava<https://builds.apache.org/job/Zest(JavaEdition)-develop-java8-checkDists/ws/samples/dci-cargo/dcisample_b/src/main/java/org/apache/zest/sample/dcicargo/sample_b/data/factory/RouteSpecificationFactoryService.java>:21:
warning: [deprecation] DateMidnight in org.joda.time has been deprecated
import org.joda.time.DateMidnight;
                    ^
<https://builds.apache.org/job/Zest(JavaEdition)-develop-java8-checkDists/ws/samples/dci-cargo/dcisample_b/src/main/java/org/apache/zest/sample/dcicargo/sample_b/data/factory/RouteSpecificationFactoryService.java>:62:
warning: [deprecation] DateMidnight in org.joda.time has been deprecated
            Date endOfToday = new DateMidnight().plusDays( 1 ).toDate();
                                  ^
2 warnings

:org.apache.zest.samples:org.apache.zest.sample.dci-cargo:org.apache.zest.sample.dci-cargo.dcisample_b:honkerGenDependencies
:org.apache.zest.samples:org.apache.zest.sample.dci-cargo:org.apache.zest.sample.dci-cargo.dcisample_b:honkerGenLicense
:org.apache.zest.samples:org.apache.zest.sample.dci-cargo:org.apache.zest.sample.dci-cargo.dcisample_b:honkerGenNotice
:org.apache.zest.samples:org.apache.zest.sample.dci-cargo:org.apache.zest.sample.dci-cargo.dcisample_b:processResources
:org.apache.zest.samples:org.apache.zest.sample.dci-cargo:org.apache.zest.sample.dci-cargo.dcisample_b:classes
:org.apache.zest.samples:org.apache.zest.sample.dci-cargo:org.apache.zest.sample.dci-cargo.dcisample_b:compileTestJava
:org.apache.zest.samples:org.apache.zest.sample.dci-cargo:org.apache.zest.sample.dci-cargo.dcisample_b:processTestResources
UP-TO-DATE
:org.apache.zest.samples:org.apache.zest.sample.dci-cargo:org.apache.zest.sample.dci-cargo.dcisample_b:testClasses
:org.apache.zest.samples:org.apache.zest.sample.dci-cargo:org.apache.zest.sample.dci-cargo.dcisample_b:test

org.apache.zest.sample.dcicargo.sample_b.context.test.booking.BookNewCargoTest > classMethod
FAILED
    org.apache.zest.api.activation.ActivationException
        Caused by: org.apache.zest.api.service.ServiceImporterException
            Caused by: org.apache.zest.api.object.NoSuchObjectException

org.apache.zest.sample.dcicargo.sample_b.context.test.booking.routing.AssignCargoToRouteTest
> classMethod FAILED
    org.apache.zest.api.activation.ActivationException
        Caused by: org.apache.zest.api.service.ServiceImporterException
            Caused by: org.apache.zest.api.object.NoSuchObjectException

org.apache.zest.sample.dcicargo.sample_b.context.test.booking.routing.RegisterNewDestinationTest
> classMethod FAILED
    org.apache.zest.api.activation.ActivationException
        Caused by: org.apache.zest.api.service.ServiceImporterException
            Caused by: org.apache.zest.api.object.NoSuchObjectException

org.apache.zest.sample.dcicargo.sample_b.context.test.booking.specification.DeriveUpdatedRouteSpecTest
> classMethod FAILED
    org.apache.zest.api.activation.ActivationException
        Caused by: org.apache.zest.api.service.ServiceImporterException
            Caused by: org.apache.zest.api.object.NoSuchObjectException

org.apache.zest.sample.dcicargo.sample_b.context.test.handling.inspection.event.InspectReceivedCargoTest
> classMethod FAILED
    org.apache.zest.api.activation.ActivationException
        Caused by: org.apache.zest.api.service.ServiceImporterException
            Caused by: org.apache.zest.api.object.NoSuchObjectException

org.apache.zest.sample.dcicargo.sample_b.context.test.handling.inspection.event.InspectUnloadedCargoTest
> classMethod FAILED
    org.apache.zest.api.activation.ActivationException
        Caused by: org.apache.zest.api.service.ServiceImporterException
            Caused by: org.apache.zest.api.object.NoSuchObjectException

org.apache.zest.sample.dcicargo.sample_b.context.test.handling.inspection.event.InspectLoadedCargoTest
> classMethod FAILED
    org.apache.zest.api.activation.ActivationException
        Caused by: org.apache.zest.api.service.ServiceImporterException
            Caused by: org.apache.zest.api.object.NoSuchObjectException

org.apache.zest.sample.dcicargo.sample_b.context.test.handling.inspection.event.InspectArrivedCargoTest
> classMethod FAILED
    org.apache.zest.api.activation.ActivationException
        Caused by: org.apache.zest.api.service.ServiceImporterException
            Caused by: org.apache.zest.api.object.NoSuchObjectException

org.apache.zest.sample.dcicargo.sample_b.context.test.handling.inspection.event.InspectClaimedCargoTest
> classMethod FAILED
    org.apache.zest.api.activation.ActivationException
        Caused by: org.apache.zest.api.service.ServiceImporterException
            Caused by: org.apache.zest.api.object.NoSuchObjectException

org.apache.zest.sample.dcicargo.sample_b.context.test.handling.inspection.event.InspectCargoInCustomsTest
> classMethod FAILED
    org.apache.zest.api.activation.ActivationException
        Caused by: org.apache.zest.api.service.ServiceImporterException
            Caused by: org.apache.zest.api.object.NoSuchObjectException

org.apache.zest.sample.dcicargo.sample_b.context.test.handling.inspection.event.InspectUnhandledCargoTest
> classMethod FAILED
    org.apache.zest.api.activation.ActivationException
        Caused by: org.apache.zest.api.service.ServiceImporterException
            Caused by: org.apache.zest.api.object.NoSuchObjectException

org.apache.zest.sample.dcicargo.sample_b.context.test.handling.parsing.ParseHandlingEventDataTest
> classMethod FAILED
    org.apache.zest.api.activation.ActivationException
        Caused by: org.apache.zest.api.service.ServiceImporterException
            Caused by: org.apache.zest.api.object.NoSuchObjectException

org.apache.zest.sample.dcicargo.sample_b.context.test.handling.registration.RegisterHandlingEventTest
> classMethod FAILED
    org.apache.zest.api.activation.ActivationException
        Caused by: org.apache.zest.api.service.ServiceImporterException
            Caused by: org.apache.zest.api.object.NoSuchObjectException

13 tests completed, 13 failed
There were failing tests. See the report at: file://<https://builds.apache.org/job/Zest(JavaEdition)-develop-java8-checkDists/ws/samples/dci-cargo/dcisample_b/build/reports/tests/index.html>
:org.apache.zest.tutorials:org.apache.zest.tutorial.introduction:org.apache.zest.tutorial.introduction.tenminutes:makeVersionClass
:org.apache.zest.tutorials:org.apache.zest.tutorial.introduction:org.apache.zest.tutorial.introduction.tenminutes:compileVersionJava
:org.apache.zest.tutorials:org.apache.zest.tutorial.introduction:org.apache.zest.tutorial.introduction.tenminutes:compileJava
:org.apache.zest.tutorials:org.apache.zest.tutorial.introduction:org.apache.zest.tutorial.introduction.tenminutes:honkerGenDependencies
:org.apache.zest.tutorials:org.apache.zest.tutorial.introduction:org.apache.zest.tutorial.introduction.tenminutes:honkerGenLicense
:org.apache.zest.tutorials:org.apache.zest.tutorial.introduction:org.apache.zest.tutorial.introduction.tenminutes:honkerGenNotice
:org.apache.zest.tutorials:org.apache.zest.tutorial.introduction:org.apache.zest.tutorial.introduction.tenminutes:processResources
UP-TO-DATE
:org.apache.zest.tutorials:org.apache.zest.tutorial.introduction:org.apache.zest.tutorial.introduction.tenminutes:classes
:org.apache.zest.tutorials:org.apache.zest.tutorial.introduction:org.apache.zest.tutorial.introduction.tenminutes:compileTestJava
UP-TO-DATE
:org.apache.zest.tutorials:org.apache.zest.tutorial.introduction:org.apache.zest.tutorial.introduction.tenminutes:processTestResources
UP-TO-DATE
:org.apache.zest.tutorials:org.apache.zest.tutorial.introduction:org.apache.zest.tutorial.introduction.tenminutes:testClasses
UP-TO-DATE
:org.apache.zest.tutorials:org.apache.zest.tutorial.introduction:org.apache.zest.tutorial.introduction.tenminutes:test
UP-TO-DATE
:org.apache.zest.tutorials:org.apache.zest.tutorial.introduction:org.apache.zest.tutorial.introduction.tenminutes:processVersionResources
UP-TO-DATE
:org.apache.zest.tutorials:org.apache.zest.tutorial.introduction:org.apache.zest.tutorial.introduction.tenminutes:versionClasses
:org.apache.zest.tutorials:org.apache.zest.tutorial.introduction:org.apache.zest.tutorial.introduction.tenminutes:jar
:org.apache.zest.tutorials:org.apache.zest.tutorial.introduction:org.apache.zest.tutorial.introduction.thirtyminutes:makeVersionClass
:org.apache.zest.tutorials:org.apache.zest.tutorial.introduction:org.apache.zest.tutorial.introduction.thirtyminutes:compileVersionJava
:org.apache.zest.tutorials:org.apache.zest.tutorial.introduction:org.apache.zest.tutorial.introduction.thirtyminutes:compileJavaNote:
<https://builds.apache.org/job/Zest(JavaEdition)-develop-java8-checkDists/ws/tutorials/introduction/thirtyminutes/src/main/java/org/apache/zest/demo/thirtyminutes/ThirtyMinutesDocs.java>
uses unchecked or unsafe operations.
Note: Recompile with -Xlint:unchecked for details.

:org.apache.zest.tutorials:org.apache.zest.tutorial.introduction:org.apache.zest.tutorial.introduction.thirtyminutes:honkerGenDependencies
:org.apache.zest.tutorials:org.apache.zest.tutorial.introduction:org.apache.zest.tutorial.introduction.thirtyminutes:honkerGenLicense
:org.apache.zest.tutorials:org.apache.zest.tutorial.introduction:org.apache.zest.tutorial.introduction.thirtyminutes:honkerGenNotice
:org.apache.zest.tutorials:org.apache.zest.tutorial.introduction:org.apache.zest.tutorial.introduction.thirtyminutes:processResources
UP-TO-DATE
:org.apache.zest.tutorials:org.apache.zest.tutorial.introduction:org.apache.zest.tutorial.introduction.thirtyminutes:classes
:org.apache.zest.tutorials:org.apache.zest.tutorial.introduction:org.apache.zest.tutorial.introduction.thirtyminutes:compileTestJava
UP-TO-DATE
:org.apache.zest.tutorials:org.apache.zest.tutorial.introduction:org.apache.zest.tutorial.introduction.thirtyminutes:processTestResources
UP-TO-DATE
:org.apache.zest.tutorials:org.apache.zest.tutorial.introduction:org.apache.zest.tutorial.introduction.thirtyminutes:testClasses
UP-TO-DATE
:org.apache.zest.tutorials:org.apache.zest.tutorial.introduction:org.apache.zest.tutorial.introduction.thirtyminutes:test
UP-TO-DATE
:org.apache.zest.tutorials:org.apache.zest.tutorial.introduction:org.apache.zest.tutorial.introduction.twominutes:makeVersionClass
:org.apache.zest.tutorials:org.apache.zest.tutorial.introduction:org.apache.zest.tutorial.introduction.twominutes:compileVersionJava
:org.apache.zest.tutorials:org.apache.zest.tutorial.introduction:org.apache.zest.tutorial.introduction.twominutes:compileJava
:org.apache.zest.tutorials:org.apache.zest.tutorial.introduction:org.apache.zest.tutorial.introduction.twominutes:honkerGenDependencies
:org.apache.zest.tutorials:org.apache.zest.tutorial.introduction:org.apache.zest.tutorial.introduction.twominutes:honkerGenLicense
:org.apache.zest.tutorials:org.apache.zest.tutorial.introduction:org.apache.zest.tutorial.introduction.twominutes:honkerGenNotice
:org.apache.zest.tutorials:org.apache.zest.tutorial.introduction:org.apache.zest.tutorial.introduction.twominutes:processResources
UP-TO-DATE
:org.apache.zest.tutorials:org.apache.zest.tutorial.introduction:org.apache.zest.tutorial.introduction.twominutes:classes
:org.apache.zest.tutorials:org.apache.zest.tutorial.introduction:org.apache.zest.tutorial.introduction.twominutes:compileTestJava
UP-TO-DATE
:org.apache.zest.tutorials:org.apache.zest.tutorial.introduction:org.apache.zest.tutorial.introduction.twominutes:processTestResources
UP-TO-DATE
:org.apache.zest.tutorials:org.apache.zest.tutorial.introduction:org.apache.zest.tutorial.introduction.twominutes:testClasses
UP-TO-DATE
:org.apache.zest.tutorials:org.apache.zest.tutorial.introduction:org.apache.zest.tutorial.introduction.twominutes:test
UP-TO-DATE
:coverageReport
:honkerCheck
:rat FAILED

FAILURE: Build failed with an exception.

* What went wrong:
Execution failed for task ':rat'.
> Found 1 files with unapproved/unknown licenses. See <https://builds.apache.org/job/Zest(JavaEdition)-develop-java8-checkDists/ws/build/reports/rat/index.html>

* Try:
Run with --info or --debug option to get more log output.

* Exception is:
org.gradle.api.tasks.TaskExecutionException: Execution failed for task ':rat'.
	at org.gradle.api.internal.tasks.execution.ExecuteActionsTaskExecuter.executeActions(ExecuteActionsTaskExecuter.java:69)
	at org.gradle.api.internal.tasks.execution.ExecuteActionsTaskExecuter.execute(ExecuteActionsTaskExecuter.java:46)
	at org.gradle.api.internal.tasks.execution.PostExecutionAnalysisTaskExecuter.execute(PostExecutionAnalysisTaskExecuter.java:35)
	at org.gradle.api.internal.tasks.execution.SkipUpToDateTaskExecuter.execute(SkipUpToDateTaskExecuter.java:64)
	at org.gradle.api.internal.tasks.execution.ValidatingTaskExecuter.execute(ValidatingTaskExecuter.java:58)
	at org.gradle.api.internal.tasks.execution.SkipEmptySourceFilesTaskExecuter.execute(SkipEmptySourceFilesTaskExecuter.java:52)
	at org.gradle.api.internal.tasks.execution.SkipTaskWithNoActionsExecuter.execute(SkipTaskWithNoActionsExecuter.java:52)
	at org.gradle.api.internal.tasks.execution.SkipOnlyIfTaskExecuter.execute(SkipOnlyIfTaskExecuter.java:53)
	at org.gradle.api.internal.tasks.execution.ExecuteAtMostOnceTaskExecuter.execute(ExecuteAtMostOnceTaskExecuter.java:43)
	at org.gradle.execution.taskgraph.DefaultTaskGraphExecuter$EventFiringTaskWorker.execute(DefaultTaskGraphExecuter.java:208)
	at org.gradle.execution.taskgraph.DefaultTaskGraphExecuter$EventFiringTaskWorker.execute(DefaultTaskGraphExecuter.java:186)
	at org.gradle.execution.taskgraph.AbstractTaskPlanExecutor$TaskExecutorWorker.processTask(AbstractTaskPlanExecutor.java:62)
	at org.gradle.execution.taskgraph.AbstractTaskPlanExecutor$TaskExecutorWorker.run(AbstractTaskPlanExecutor.java:50)
	at org.gradle.execution.taskgraph.DefaultTaskPlanExecutor.process(DefaultTaskPlanExecutor.java:25)
	at org.gradle.execution.taskgraph.DefaultTaskGraphExecuter.execute(DefaultTaskGraphExecuter.java:111)
	at org.gradle.execution.SelectedTaskExecutionAction.execute(SelectedTaskExecutionAction.java:37)
	at org.gradle.execution.DefaultBuildExecuter.execute(DefaultBuildExecuter.java:62)
	at org.gradle.execution.DefaultBuildExecuter.access$200(DefaultBuildExecuter.java:23)
	at org.gradle.execution.DefaultBuildExecuter$2.proceed(DefaultBuildExecuter.java:68)
	at org.gradle.execution.DryRunBuildExecutionAction.execute(DryRunBuildExecutionAction.java:32)
	at org.gradle.execution.DefaultBuildExecuter.execute(DefaultBuildExecuter.java:62)
	at org.gradle.execution.DefaultBuildExecuter.execute(DefaultBuildExecuter.java:55)
	at org.gradle.initialization.DefaultGradleLauncher$6.run(DefaultGradleLauncher.java:174)
	at org.gradle.internal.Factories$1.create(Factories.java:22)
	at org.gradle.internal.progress.DefaultBuildOperationExecutor.run(DefaultBuildOperationExecutor.java:62)
	at org.gradle.internal.progress.DefaultBuildOperationExecutor.run(DefaultBuildOperationExecutor.java:47)
	at org.gradle.initialization.DefaultGradleLauncher.runBuildOperation(DefaultGradleLauncher.java:189)
	at org.gradle.initialization.DefaultGradleLauncher.doBuildStages(DefaultGradleLauncher.java:171)
	at org.gradle.initialization.DefaultGradleLauncher.access$200(DefaultGradleLauncher.java:35)
	at org.gradle.initialization.DefaultGradleLauncher$1.create(DefaultGradleLauncher.java:104)
	at org.gradle.initialization.DefaultGradleLauncher$1.create(DefaultGradleLauncher.java:97)
	at org.gradle.internal.progress.DefaultBuildOperationExecutor.run(DefaultBuildOperationExecutor.java:62)
	at org.gradle.initialization.DefaultGradleLauncher.runRootBuildOperation(DefaultGradleLauncher.java:184)
	at org.gradle.initialization.DefaultGradleLauncher.doBuild(DefaultGradleLauncher.java:97)
	at org.gradle.initialization.DefaultGradleLauncher.run(DefaultGradleLauncher.java:86)
	at org.gradle.launcher.exec.InProcessBuildActionExecuter$DefaultBuildController.run(InProcessBuildActionExecuter.java:93)
	at org.gradle.tooling.internal.provider.ExecuteBuildActionRunner.run(ExecuteBuildActionRunner.java:28)
	at org.gradle.launcher.exec.ChainingBuildActionRunner.run(ChainingBuildActionRunner.java:35)
	at org.gradle.launcher.exec.InProcessBuildActionExecuter.execute(InProcessBuildActionExecuter.java:43)
	at org.gradle.launcher.exec.InProcessBuildActionExecuter.execute(InProcessBuildActionExecuter.java:27)
	at org.gradle.launcher.exec.ContinuousBuildActionExecuter.execute(ContinuousBuildActionExecuter.java:72)
	at org.gradle.launcher.exec.ContinuousBuildActionExecuter.execute(ContinuousBuildActionExecuter.java:44)
	at org.gradle.launcher.exec.DaemonUsageSuggestingBuildActionExecuter.execute(DaemonUsageSuggestingBuildActionExecuter.java:50)
	at org.gradle.launcher.exec.DaemonUsageSuggestingBuildActionExecuter.execute(DaemonUsageSuggestingBuildActionExecuter.java:27)
	at org.gradle.launcher.cli.RunBuildAction.run(RunBuildAction.java:40)
	at org.gradle.internal.Actions$RunnableActionAdapter.execute(Actions.java:170)
	at org.gradle.launcher.cli.CommandLineActionFactory$ParseAndBuildAction.execute(CommandLineActionFactory.java:237)
	at org.gradle.launcher.cli.CommandLineActionFactory$ParseAndBuildAction.execute(CommandLineActionFactory.java:210)
	at org.gradle.launcher.cli.JavaRuntimeValidationAction.execute(JavaRuntimeValidationAction.java:35)
	at org.gradle.launcher.cli.JavaRuntimeValidationAction.execute(JavaRuntimeValidationAction.java:24)
	at org.gradle.launcher.cli.CommandLineActionFactory$WithLogging.execute(CommandLineActionFactory.java:206)
	at org.gradle.launcher.cli.CommandLineActionFactory$WithLogging.execute(CommandLineActionFactory.java:169)
	at org.gradle.launcher.cli.ExceptionReportingAction.execute(ExceptionReportingAction.java:33)
	at org.gradle.launcher.cli.ExceptionReportingAction.execute(ExceptionReportingAction.java:22)
	at org.gradle.launcher.Main.doAction(Main.java:33)
	at org.gradle.launcher.bootstrap.EntryPoint.run(EntryPoint.java:45)
	at org.gradle.launcher.bootstrap.ProcessBootstrap.runNoExit(ProcessBootstrap.java:54)
	at org.gradle.launcher.bootstrap.ProcessBootstrap.run(ProcessBootstrap.java:35)
	at org.gradle.launcher.GradleMain.main(GradleMain.java:23)
	at org.gradle.wrapper.BootstrapMainStarter.start(BootstrapMainStarter.java:30)
	at org.gradle.wrapper.WrapperExecutor.execute(WrapperExecutor.java:127)
	at org.gradle.wrapper.GradleWrapperMain.main(GradleWrapperMain.java:55)
Caused by: org.gradle.api.GradleException: Found 1 files with unapproved/unknown licenses.
See <https://builds.apache.org/job/Zest(JavaEdition)-develop-java8-checkDists/ws/build/reports/rat/index.html>
	at org.apache.rat.gradle.RatTask.rat(RatTask.groovy:53)
	at org.gradle.internal.reflect.JavaMethod.invoke(JavaMethod.java:75)
	at org.gradle.api.internal.project.taskfactory.AnnotationProcessingTaskFactory$StandardTaskAction.doExecute(AnnotationProcessingTaskFactory.java:226)
	at org.gradle.api.internal.project.taskfactory.AnnotationProcessingTaskFactory$StandardTaskAction.execute(AnnotationProcessingTaskFactory.java:219)
	at org.gradle.api.internal.project.taskfactory.AnnotationProcessingTaskFactory$StandardTaskAction.execute(AnnotationProcessingTaskFactory.java:208)
	at org.gradle.api.internal.AbstractTask$TaskActionWrapper.execute(AbstractTask.java:585)
	at org.gradle.api.internal.AbstractTask$TaskActionWrapper.execute(AbstractTask.java:568)
	at org.gradle.api.internal.tasks.execution.ExecuteActionsTaskExecuter.executeAction(ExecuteActionsTaskExecuter.java:80)
	at org.gradle.api.internal.tasks.execution.ExecuteActionsTaskExecuter.executeActions(ExecuteActionsTaskExecuter.java:61)
	... 61 more


BUILD FAILED

Total time: 7 mins 12.771 secs
Build step 'Invoke Gradle script' changed build result to FAILURE
Build step 'Invoke Gradle script' marked build as failure
Xvfb stopping
Archiving artifacts
Recording test results
Publishing Javadoc

Mime
View raw message