polygene-dev mailing list archives

Site index · List index
Message view « Date » · « Thread »
Top « Date » · « Thread »
From Apache Jenkins Server <jenk...@builds.apache.org>
Subject Build failed in Jenkins: Zest(JavaEdition)-develop-java8-checkDists #29
Date Sun, 02 Aug 2015 09:31:41 GMT
See <https://builds.apache.org/job/Zest(JavaEdition)-develop-java8-checkDists/29/changes>

Changes:

[niclas] Java8 is very picky about the javadoc format.

------------------------------------------
[...truncated 7309 lines...]
^
<https://builds.apache.org/job/Zest(JavaEdition)-develop-java8-checkDists/ws/build/unpacked-distributions/src/apache-zest-java-3.0-SNAPSHOT-src/manual/build/tmp/docs/website/xdoc-temp.xml>:16382:
parser error : Premature end of data in tag section line 12061

^
<https://builds.apache.org/job/Zest(JavaEdition)-develop-java8-checkDists/ws/build/unpacked-distributions/src/apache-zest-java-3.0-SNAPSHOT-src/manual/build/tmp/docs/website/xdoc-temp.xml>:16382:
parser error : Premature end of data in tag section line 12025

^
<https://builds.apache.org/job/Zest(JavaEdition)-develop-java8-checkDists/ws/build/unpacked-distributions/src/apache-zest-java-3.0-SNAPSHOT-src/manual/build/tmp/docs/website/xdoc-temp.xml>:16382:
parser error : Premature end of data in tag section line 11989

^
<https://builds.apache.org/job/Zest(JavaEdition)-develop-java8-checkDists/ws/build/unpacked-distributions/src/apache-zest-java-3.0-SNAPSHOT-src/manual/build/tmp/docs/website/xdoc-temp.xml>:16382:
parser error : Premature end of data in tag section line 11634

^
<https://builds.apache.org/job/Zest(JavaEdition)-develop-java8-checkDists/ws/build/unpacked-distributions/src/apache-zest-java-3.0-SNAPSHOT-src/manual/build/tmp/docs/website/xdoc-temp.xml>:16382:
parser error : Premature end of data in tag section line 11598

^
<https://builds.apache.org/job/Zest(JavaEdition)-develop-java8-checkDists/ws/build/unpacked-distributions/src/apache-zest-java-3.0-SNAPSHOT-src/manual/build/tmp/docs/website/xdoc-temp.xml>:16382:
parser error : Premature end of data in tag section line 11525

^
<https://builds.apache.org/job/Zest(JavaEdition)-develop-java8-checkDists/ws/build/unpacked-distributions/src/apache-zest-java-3.0-SNAPSHOT-src/manual/build/tmp/docs/website/xdoc-temp.xml>:16382:
parser error : Premature end of data in tag section line 11234

^
<https://builds.apache.org/job/Zest(JavaEdition)-develop-java8-checkDists/ws/build/unpacked-distributions/src/apache-zest-java-3.0-SNAPSHOT-src/manual/build/tmp/docs/website/xdoc-temp.xml>:16382:
parser error : Premature end of data in tag section line 11162

^
<https://builds.apache.org/job/Zest(JavaEdition)-develop-java8-checkDists/ws/build/unpacked-distributions/src/apache-zest-java-3.0-SNAPSHOT-src/manual/build/tmp/docs/website/xdoc-temp.xml>:16382:
parser error : Premature end of data in tag section line 11101

^
<https://builds.apache.org/job/Zest(JavaEdition)-develop-java8-checkDists/ws/build/unpacked-distributions/src/apache-zest-java-3.0-SNAPSHOT-src/manual/build/tmp/docs/website/xdoc-temp.xml>:16382:
parser error : Premature end of data in tag section line 11000

^
<https://builds.apache.org/job/Zest(JavaEdition)-develop-java8-checkDists/ws/build/unpacked-distributions/src/apache-zest-java-3.0-SNAPSHOT-src/manual/build/tmp/docs/website/xdoc-temp.xml>:16382:
parser error : Premature end of data in tag section line 10850

^
<https://builds.apache.org/job/Zest(JavaEdition)-develop-java8-checkDists/ws/build/unpacked-distributions/src/apache-zest-java-3.0-SNAPSHOT-src/manual/build/tmp/docs/website/xdoc-temp.xml>:16382:
parser error : Premature end of data in tag section line 10777

^
<https://builds.apache.org/job/Zest(JavaEdition)-develop-java8-checkDists/ws/build/unpacked-distributions/src/apache-zest-java-3.0-SNAPSHOT-src/manual/build/tmp/docs/website/xdoc-temp.xml>:16382:
parser error : Premature end of data in tag module line 10652

^
<https://builds.apache.org/job/Zest(JavaEdition)-develop-java8-checkDists/ws/build/unpacked-distributions/src/apache-zest-java-3.0-SNAPSHOT-src/manual/build/tmp/docs/website/xdoc-temp.xml>:16382:
parser error : Premature end of data in tag module line 10609

^
<https://builds.apache.org/job/Zest(JavaEdition)-develop-java8-checkDists/ws/build/unpacked-distributions/src/apache-zest-java-3.0-SNAPSHOT-src/manual/build/tmp/docs/website/xdoc-temp.xml>:16382:
parser error : Premature end of data in tag section line 10606

^
<https://builds.apache.org/job/Zest(JavaEdition)-develop-java8-checkDists/ws/build/unpacked-distributions/src/apache-zest-java-3.0-SNAPSHOT-src/manual/build/tmp/docs/website/xdoc-temp.xml>:16382:
parser error : Premature end of data in tag section line 10457

^
<https://builds.apache.org/job/Zest(JavaEdition)-develop-java8-checkDists/ws/build/unpacked-distributions/src/apache-zest-java-3.0-SNAPSHOT-src/manual/build/tmp/docs/website/xdoc-temp.xml>:16382:
parser error : Premature end of data in tag section line 10378

^
<https://builds.apache.org/job/Zest(JavaEdition)-develop-java8-checkDists/ws/build/unpacked-distributions/src/apache-zest-java-3.0-SNAPSHOT-src/manual/build/tmp/docs/website/xdoc-temp.xml>:16382:
parser error : Premature end of data in tag section line 10201

^
<https://builds.apache.org/job/Zest(JavaEdition)-develop-java8-checkDists/ws/build/unpacked-distributions/src/apache-zest-java-3.0-SNAPSHOT-src/manual/build/tmp/docs/website/xdoc-temp.xml>:16382:
parser error : Premature end of data in tag section line 10060

^
<https://builds.apache.org/job/Zest(JavaEdition)-develop-java8-checkDists/ws/build/unpacked-distributions/src/apache-zest-java-3.0-SNAPSHOT-src/manual/build/tmp/docs/website/xdoc-temp.xml>:16382:
parser error : Premature end of data in tag section line 9916

^
<https://builds.apache.org/job/Zest(JavaEdition)-develop-java8-checkDists/ws/build/unpacked-distributions/src/apache-zest-java-3.0-SNAPSHOT-src/manual/build/tmp/docs/website/xdoc-temp.xml>:16382:
parser error : Premature end of data in tag section line 9860

^
<https://builds.apache.org/job/Zest(JavaEdition)-develop-java8-checkDists/ws/build/unpacked-distributions/src/apache-zest-java-3.0-SNAPSHOT-src/manual/build/tmp/docs/website/xdoc-temp.xml>:16382:
parser error : Premature end of data in tag section line 9738

^
<https://builds.apache.org/job/Zest(JavaEdition)-develop-java8-checkDists/ws/build/unpacked-distributions/src/apache-zest-java-3.0-SNAPSHOT-src/manual/build/tmp/docs/website/xdoc-temp.xml>:16382:
parser error : Premature end of data in tag section line 9729

^
<https://builds.apache.org/job/Zest(JavaEdition)-develop-java8-checkDists/ws/build/unpacked-distributions/src/apache-zest-java-3.0-SNAPSHOT-src/manual/build/tmp/docs/website/xdoc-temp.xml>:16382:
parser error : Premature end of data in tag section line 9510

^
<https://builds.apache.org/job/Zest(JavaEdition)-develop-java8-checkDists/ws/build/unpacked-distributions/src/apache-zest-java-3.0-SNAPSHOT-src/manual/build/tmp/docs/website/xdoc-temp.xml>:16382:
parser error : Premature end of data in tag section line 8935

^
<https://builds.apache.org/job/Zest(JavaEdition)-develop-java8-checkDists/ws/build/unpacked-distributions/src/apache-zest-java-3.0-SNAPSHOT-src/manual/build/tmp/docs/website/xdoc-temp.xml>:16382:
parser error : Premature end of data in tag section line 8825

^
<https://builds.apache.org/job/Zest(JavaEdition)-develop-java8-checkDists/ws/build/unpacked-distributions/src/apache-zest-java-3.0-SNAPSHOT-src/manual/build/tmp/docs/website/xdoc-temp.xml>:16382:
parser error : Premature end of data in tag section line 8708

^
<https://builds.apache.org/job/Zest(JavaEdition)-develop-java8-checkDists/ws/build/unpacked-distributions/src/apache-zest-java-3.0-SNAPSHOT-src/manual/build/tmp/docs/website/xdoc-temp.xml>:16382:
parser error : Premature end of data in tag section line 8223

^
<https://builds.apache.org/job/Zest(JavaEdition)-develop-java8-checkDists/ws/build/unpacked-distributions/src/apache-zest-java-3.0-SNAPSHOT-src/manual/build/tmp/docs/website/xdoc-temp.xml>:16382:
parser error : Premature end of data in tag section line 6593

^
<https://builds.apache.org/job/Zest(JavaEdition)-develop-java8-checkDists/ws/build/unpacked-distributions/src/apache-zest-java-3.0-SNAPSHOT-src/manual/build/tmp/docs/website/xdoc-temp.xml>:16382:
parser error : Premature end of data in tag section line 6526

^
<https://builds.apache.org/job/Zest(JavaEdition)-develop-java8-checkDists/ws/build/unpacked-distributions/src/apache-zest-java-3.0-SNAPSHOT-src/manual/build/tmp/docs/website/xdoc-temp.xml>:16382:
parser error : Premature end of data in tag article line 6

^
unable to parse <https://builds.apache.org/job/Zest(JavaEdition)-develop-java8-checkDists/ws/build/unpacked-distributions/src/apache-zest-java-3.0-SNAPSHOT-src/manual/build/tmp/docs/website/xdoc-temp.xml>
 FAILED
:checkSrcDist FAILED

FAILURE: Build failed with an exception.

* What went wrong:
Execution failed for task ':org.apache.zest.manual:website'.
> Process 'command 'xsltproc'' finished with non-zero exit value 6

* Try:
Run with --info or --debug option to get more log output.

* Exception is:
org.gradle.api.tasks.TaskExecutionException: Execution failed for task ':org.apache.zest.manual:website'.
	at org.gradle.api.internal.tasks.execution.ExecuteActionsTaskExecuter.executeActions(ExecuteActionsTaskExecuter.java:69)
	at org.gradle.api.internal.tasks.execution.ExecuteActionsTaskExecuter.execute(ExecuteActionsTaskExecuter.java:46)
	at org.gradle.api.internal.tasks.execution.PostExecutionAnalysisTaskExecuter.execute(PostExecutionAnalysisTaskExecuter.java:35)
	at org.gradle.api.internal.tasks.execution.SkipUpToDateTaskExecuter.execute(SkipUpToDateTaskExecuter.java:64)
	at org.gradle.api.internal.tasks.execution.ValidatingTaskExecuter.execute(ValidatingTaskExecuter.java:58)
	at org.gradle.api.internal.tasks.execution.SkipEmptySourceFilesTaskExecuter.execute(SkipEmptySourceFilesTaskExecuter.java:52)
	at org.gradle.api.internal.tasks.execution.SkipTaskWithNoActionsExecuter.execute(SkipTaskWithNoActionsExecuter.java:52)
	at org.gradle.api.internal.tasks.execution.SkipOnlyIfTaskExecuter.execute(SkipOnlyIfTaskExecuter.java:53)
	at org.gradle.api.internal.tasks.execution.ExecuteAtMostOnceTaskExecuter.execute(ExecuteAtMostOnceTaskExecuter.java:43)
	at org.gradle.execution.taskgraph.DefaultTaskGraphExecuter$EventFiringTaskWorker.execute(DefaultTaskGraphExecuter.java:208)
	at org.gradle.execution.taskgraph.DefaultTaskGraphExecuter$EventFiringTaskWorker.execute(DefaultTaskGraphExecuter.java:186)
	at org.gradle.execution.taskgraph.AbstractTaskPlanExecutor$TaskExecutorWorker.processTask(AbstractTaskPlanExecutor.java:62)
	at org.gradle.execution.taskgraph.AbstractTaskPlanExecutor$TaskExecutorWorker.run(AbstractTaskPlanExecutor.java:50)
	at org.gradle.execution.taskgraph.DefaultTaskPlanExecutor.process(DefaultTaskPlanExecutor.java:25)
	at org.gradle.execution.taskgraph.DefaultTaskGraphExecuter.execute(DefaultTaskGraphExecuter.java:111)
	at org.gradle.execution.SelectedTaskExecutionAction.execute(SelectedTaskExecutionAction.java:37)
	at org.gradle.execution.DefaultBuildExecuter.execute(DefaultBuildExecuter.java:62)
	at org.gradle.execution.DefaultBuildExecuter.access$200(DefaultBuildExecuter.java:23)
	at org.gradle.execution.DefaultBuildExecuter$2.proceed(DefaultBuildExecuter.java:68)
	at org.gradle.execution.DryRunBuildExecutionAction.execute(DryRunBuildExecutionAction.java:32)
	at org.gradle.execution.DefaultBuildExecuter.execute(DefaultBuildExecuter.java:62)
	at org.gradle.execution.DefaultBuildExecuter.execute(DefaultBuildExecuter.java:55)
	at org.gradle.initialization.DefaultGradleLauncher$6.run(DefaultGradleLauncher.java:174)
	at org.gradle.internal.Factories$1.create(Factories.java:22)
	at org.gradle.internal.progress.DefaultBuildOperationExecutor.run(DefaultBuildOperationExecutor.java:62)
	at org.gradle.internal.progress.DefaultBuildOperationExecutor.run(DefaultBuildOperationExecutor.java:47)
	at org.gradle.initialization.DefaultGradleLauncher.runBuildOperation(DefaultGradleLauncher.java:189)
	at org.gradle.initialization.DefaultGradleLauncher.doBuildStages(DefaultGradleLauncher.java:171)
	at org.gradle.initialization.DefaultGradleLauncher.access$200(DefaultGradleLauncher.java:35)
	at org.gradle.initialization.DefaultGradleLauncher$1.create(DefaultGradleLauncher.java:104)
	at org.gradle.initialization.DefaultGradleLauncher$1.create(DefaultGradleLauncher.java:97)
	at org.gradle.internal.progress.DefaultBuildOperationExecutor.run(DefaultBuildOperationExecutor.java:62)
	at org.gradle.initialization.DefaultGradleLauncher.runRootBuildOperation(DefaultGradleLauncher.java:184)
	at org.gradle.initialization.DefaultGradleLauncher.doBuild(DefaultGradleLauncher.java:97)
	at org.gradle.initialization.DefaultGradleLauncher.run(DefaultGradleLauncher.java:86)
	at org.gradle.api.tasks.GradleBuild.build(GradleBuild.java:117)
	at org.gradle.internal.reflect.JavaMethod.invoke(JavaMethod.java:75)
	at org.gradle.api.internal.project.taskfactory.AnnotationProcessingTaskFactory$StandardTaskAction.doExecute(AnnotationProcessingTaskFactory.java:226)
	at org.gradle.api.internal.project.taskfactory.AnnotationProcessingTaskFactory$StandardTaskAction.execute(AnnotationProcessingTaskFactory.java:219)
	at org.gradle.api.internal.project.taskfactory.AnnotationProcessingTaskFactory$StandardTaskAction.execute(AnnotationProcessingTaskFactory.java:208)
	at org.gradle.api.internal.AbstractTask$TaskActionWrapper.execute(AbstractTask.java:585)
	at org.gradle.api.internal.AbstractTask$TaskActionWrapper.execute(AbstractTask.java:568)
	at org.gradle.api.internal.tasks.execution.ExecuteActionsTaskExecuter.executeAction(ExecuteActionsTaskExecuter.java:80)
	at org.gradle.api.internal.tasks.execution.ExecuteActionsTaskExecuter.executeActions(ExecuteActionsTaskExecuter.java:61)
	at org.gradle.api.internal.tasks.execution.ExecuteActionsTaskExecuter.execute(ExecuteActionsTaskExecuter.java:46)
	at org.gradle.api.internal.tasks.execution.PostExecutionAnalysisTaskExecuter.execute(PostExecutionAnalysisTaskExecuter.java:35)
	at org.gradle.api.internal.tasks.execution.SkipUpToDateTaskExecuter.execute(SkipUpToDateTaskExecuter.java:64)
	at org.gradle.api.internal.tasks.execution.ValidatingTaskExecuter.execute(ValidatingTaskExecuter.java:58)
	at org.gradle.api.internal.tasks.execution.SkipEmptySourceFilesTaskExecuter.execute(SkipEmptySourceFilesTaskExecuter.java:52)
	at org.gradle.api.internal.tasks.execution.SkipTaskWithNoActionsExecuter.execute(SkipTaskWithNoActionsExecuter.java:52)
	at org.gradle.api.internal.tasks.execution.SkipOnlyIfTaskExecuter.execute(SkipOnlyIfTaskExecuter.java:53)
	at org.gradle.api.internal.tasks.execution.ExecuteAtMostOnceTaskExecuter.execute(ExecuteAtMostOnceTaskExecuter.java:43)
	at org.gradle.execution.taskgraph.DefaultTaskGraphExecuter$EventFiringTaskWorker.execute(DefaultTaskGraphExecuter.java:208)
	at org.gradle.execution.taskgraph.DefaultTaskGraphExecuter$EventFiringTaskWorker.execute(DefaultTaskGraphExecuter.java:186)
	at org.gradle.execution.taskgraph.AbstractTaskPlanExecutor$TaskExecutorWorker.processTask(AbstractTaskPlanExecutor.java:62)
	at org.gradle.execution.taskgraph.AbstractTaskPlanExecutor$TaskExecutorWorker.run(AbstractTaskPlanExecutor.java:50)
	at org.gradle.execution.taskgraph.DefaultTaskPlanExecutor.process(DefaultTaskPlanExecutor.java:25)
	at org.gradle.execution.taskgraph.DefaultTaskGraphExecuter.execute(DefaultTaskGraphExecuter.java:111)
	at org.gradle.execution.SelectedTaskExecutionAction.execute(SelectedTaskExecutionAction.java:37)
	at org.gradle.execution.DefaultBuildExecuter.execute(DefaultBuildExecuter.java:62)
	at org.gradle.execution.DefaultBuildExecuter.access$200(DefaultBuildExecuter.java:23)
	at org.gradle.execution.DefaultBuildExecuter$2.proceed(DefaultBuildExecuter.java:68)
	at org.gradle.execution.DryRunBuildExecutionAction.execute(DryRunBuildExecutionAction.java:32)
	at org.gradle.execution.DefaultBuildExecuter.execute(DefaultBuildExecuter.java:62)
	at org.gradle.execution.DefaultBuildExecuter.execute(DefaultBuildExecuter.java:55)
	at org.gradle.initialization.DefaultGradleLauncher$6.run(DefaultGradleLauncher.java:174)
	at org.gradle.internal.Factories$1.create(Factories.java:22)
	at org.gradle.internal.progress.DefaultBuildOperationExecutor.run(DefaultBuildOperationExecutor.java:62)
	at org.gradle.internal.progress.DefaultBuildOperationExecutor.run(DefaultBuildOperationExecutor.java:47)
	at org.gradle.initialization.DefaultGradleLauncher.runBuildOperation(DefaultGradleLauncher.java:189)
	at org.gradle.initialization.DefaultGradleLauncher.doBuildStages(DefaultGradleLauncher.java:171)
	at org.gradle.initialization.DefaultGradleLauncher.access$200(DefaultGradleLauncher.java:35)
	at org.gradle.initialization.DefaultGradleLauncher$1.create(DefaultGradleLauncher.java:104)
	at org.gradle.initialization.DefaultGradleLauncher$1.create(DefaultGradleLauncher.java:97)
	at org.gradle.internal.progress.DefaultBuildOperationExecutor.run(DefaultBuildOperationExecutor.java:62)
	at org.gradle.initialization.DefaultGradleLauncher.runRootBuildOperation(DefaultGradleLauncher.java:184)
	at org.gradle.initialization.DefaultGradleLauncher.doBuild(DefaultGradleLauncher.java:97)
	at org.gradle.initialization.DefaultGradleLauncher.run(DefaultGradleLauncher.java:86)
	at org.gradle.launcher.exec.InProcessBuildActionExecuter$DefaultBuildController.run(InProcessBuildActionExecuter.java:93)
	at org.gradle.tooling.internal.provider.ExecuteBuildActionRunner.run(ExecuteBuildActionRunner.java:28)
	at org.gradle.launcher.exec.ChainingBuildActionRunner.run(ChainingBuildActionRunner.java:35)
	at org.gradle.launcher.exec.InProcessBuildActionExecuter.execute(InProcessBuildActionExecuter.java:43)
	at org.gradle.launcher.exec.InProcessBuildActionExecuter.execute(InProcessBuildActionExecuter.java:27)
	at org.gradle.launcher.exec.ContinuousBuildActionExecuter.execute(ContinuousBuildActionExecuter.java:72)
	at org.gradle.launcher.exec.ContinuousBuildActionExecuter.execute(ContinuousBuildActionExecuter.java:44)
	at org.gradle.launcher.exec.DaemonUsageSuggestingBuildActionExecuter.execute(DaemonUsageSuggestingBuildActionExecuter.java:50)
	at org.gradle.launcher.exec.DaemonUsageSuggestingBuildActionExecuter.execute(DaemonUsageSuggestingBuildActionExecuter.java:27)
	at org.gradle.launcher.cli.RunBuildAction.run(RunBuildAction.java:40)
	at org.gradle.internal.Actions$RunnableActionAdapter.execute(Actions.java:170)
	at org.gradle.launcher.cli.CommandLineActionFactory$ParseAndBuildAction.execute(CommandLineActionFactory.java:237)
	at org.gradle.launcher.cli.CommandLineActionFactory$ParseAndBuildAction.execute(CommandLineActionFactory.java:210)
	at org.gradle.launcher.cli.JavaRuntimeValidationAction.execute(JavaRuntimeValidationAction.java:35)
	at org.gradle.launcher.cli.JavaRuntimeValidationAction.execute(JavaRuntimeValidationAction.java:24)
	at org.gradle.launcher.cli.CommandLineActionFactory$WithLogging.execute(CommandLineActionFactory.java:206)
	at org.gradle.launcher.cli.CommandLineActionFactory$WithLogging.execute(CommandLineActionFactory.java:169)
	at org.gradle.launcher.cli.ExceptionReportingAction.execute(ExceptionReportingAction.java:33)
	at org.gradle.launcher.cli.ExceptionReportingAction.execute(ExceptionReportingAction.java:22)
	at org.gradle.launcher.Main.doAction(Main.java:33)
	at org.gradle.launcher.bootstrap.EntryPoint.run(EntryPoint.java:45)
	at org.gradle.launcher.bootstrap.ProcessBootstrap.runNoExit(ProcessBootstrap.java:54)
	at org.gradle.launcher.bootstrap.ProcessBootstrap.run(ProcessBootstrap.java:35)
	at org.gradle.launcher.GradleMain.main(GradleMain.java:23)
	at org.gradle.wrapper.BootstrapMainStarter.start(BootstrapMainStarter.java:30)
	at org.gradle.wrapper.WrapperExecutor.execute(WrapperExecutor.java:127)
	at org.gradle.wrapper.GradleWrapperMain.main(GradleWrapperMain.java:55)
Caused by: org.gradle.process.internal.ExecException: Process 'command 'xsltproc'' finished
with non-zero exit value 6
	at org.gradle.process.internal.DefaultExecHandle$ExecResultImpl.assertNormalExitValue(DefaultExecHandle.java:366)
	at org.gradle.process.internal.DefaultExecAction.execute(DefaultExecAction.java:31)
	at org.gradle.api.internal.file.DefaultFileOperations.exec(DefaultFileOperations.java:165)
	at org.gradle.api.internal.project.AbstractProject.exec(AbstractProject.java:792)
	at org.gradle.api.internal.project.AbstractProject.exec(AbstractProject.java:788)
	at org.gradle.api.Project$exec$14.call(Unknown Source)
	at org.apache.zest.gradle.plugin.Documentation.generateChunkedHtml(Documentation.groovy:183)
	at org.apache.zest.gradle.plugin.Documentation.generate(Documentation.groovy:61)
	at org.gradle.internal.reflect.JavaMethod.invoke(JavaMethod.java:75)
	at org.gradle.api.internal.project.taskfactory.AnnotationProcessingTaskFactory$StandardTaskAction.doExecute(AnnotationProcessingTaskFactory.java:226)
	at org.gradle.api.internal.project.taskfactory.AnnotationProcessingTaskFactory$StandardTaskAction.execute(AnnotationProcessingTaskFactory.java:219)
	at org.gradle.api.internal.project.taskfactory.AnnotationProcessingTaskFactory$StandardTaskAction.execute(AnnotationProcessingTaskFactory.java:208)
	at org.gradle.api.internal.AbstractTask$TaskActionWrapper.execute(AbstractTask.java:585)
	at org.gradle.api.internal.AbstractTask$TaskActionWrapper.execute(AbstractTask.java:568)
	at org.gradle.api.internal.tasks.execution.ExecuteActionsTaskExecuter.executeAction(ExecuteActionsTaskExecuter.java:80)
	at org.gradle.api.internal.tasks.execution.ExecuteActionsTaskExecuter.executeActions(ExecuteActionsTaskExecuter.java:61)
	... 104 more


BUILD FAILED

Total time: 23 mins 15.242 secs
Build step 'Invoke Gradle script' changed build result to FAILURE
Build step 'Invoke Gradle script' marked build as failure
Xvfb stopping
Archiving artifacts
Sending artifact delta relative to Zest(JavaEdition)-develop-java8-checkDists #25
Archived 12 artifacts
Archive block size is 32768
Received 7 blocks and 38735170 bytes
Compression is 0.6%
Took 11 sec
Recording test results
Publishing Javadoc

Mime
View raw message