polygene-dev mailing list archives

Site index · List index
Message view « Date » · « Thread »
Top « Date » · « Thread »
From Apache Jenkins Server <jenk...@builds.apache.org>
Subject Build failed in Jenkins: Zest(JavaEdition)-develop-java8-checkDists #30
Date Sun, 02 Aug 2015 11:01:16 GMT
See <https://builds.apache.org/job/Zest(JavaEdition)-develop-java8-checkDists/30/changes>

Changes:

[paulmerlin] ZEST-108 Fix asciidoc filters setup

[niclas] ZEST-111; First commit to the Restful Library.

[paulmerlin] Build: fix Jacoco based global coverageReport task

------------------------------------------
[...truncated 1389 lines...]
:org.apache.zest.libraries:org.apache.zest.library.metrics:compileJava
:org.apache.zest.libraries:org.apache.zest.library.metrics:honkerGenDependencies
:org.apache.zest.libraries:org.apache.zest.library.metrics:honkerGenLicense
:org.apache.zest.libraries:org.apache.zest.library.metrics:honkerGenNotice
:org.apache.zest.libraries:org.apache.zest.library.metrics:processResources UP-TO-DATE
:org.apache.zest.libraries:org.apache.zest.library.metrics:classes
:org.apache.zest.libraries:org.apache.zest.library.metrics:compileTestJava
:org.apache.zest.libraries:org.apache.zest.library.metrics:processTestResources UP-TO-DATE
:org.apache.zest.libraries:org.apache.zest.library.metrics:testClasses
:org.apache.zest.libraries:org.apache.zest.library.metrics:test

org.apache.zest.library.metrics.MetricsTest > givenOneMethodAnnotatedWhenCallingUpdateNameExpectReportForThatMethodOnly
FAILED
    java.lang.AssertionError at MetricsTest.java:109

3 tests completed, 1 failed
There were failing tests. See the report at: file://<https://builds.apache.org/job/Zest(JavaEdition)-develop-java8-checkDists/ws/libraries/metrics/build/reports/tests/index.html>
:org.apache.zest.libraries:org.apache.zest.library.osgi:makeVersionClass
:org.apache.zest.libraries:org.apache.zest.library.osgi:compileVersionJava
:org.apache.zest.libraries:org.apache.zest.library.osgi:compileJava
:org.apache.zest.libraries:org.apache.zest.library.osgi:honkerGenDependencies
:org.apache.zest.libraries:org.apache.zest.library.osgi:honkerGenLicense
:org.apache.zest.libraries:org.apache.zest.library.osgi:honkerGenNotice
:org.apache.zest.libraries:org.apache.zest.library.osgi:processResources UP-TO-DATE
:org.apache.zest.libraries:org.apache.zest.library.osgi:classes
:org.apache.zest.libraries:org.apache.zest.library.osgi:compileTestJava
:org.apache.zest.libraries:org.apache.zest.library.osgi:processTestResources UP-TO-DATE
:org.apache.zest.libraries:org.apache.zest.library.osgi:testClasses
:org.apache.zest.libraries:org.apache.zest.library.osgi:test
:org.apache.zest.libraries:org.apache.zest.library.rdf:compileTestJava
:org.apache.zest.libraries:org.apache.zest.library.rdf:processTestResources
:org.apache.zest.libraries:org.apache.zest.library.rdf:testClasses
:org.apache.zest.libraries:org.apache.zest.library.rdf:test
:org.apache.zest.libraries:org.apache.zest.library.http:processVersionResources UP-TO-DATE
:org.apache.zest.libraries:org.apache.zest.library.http:versionClasses
:org.apache.zest.libraries:org.apache.zest.library.http:jar
:org.apache.zest.libraries:org.apache.zest.library.rest:makeVersionClass
:org.apache.zest.libraries:org.apache.zest.library.rest:compileVersionJava
:org.apache.zest.libraries:org.apache.zest.library.rest:compileJava<https://builds.apache.org/job/Zest(JavaEdition)-develop-java8-checkDists/ws/libraries/rest/src/main/java/org/apache/zest/library/rest/admin/SPARQLResource.java>:139:
warning: [deprecation] QueryResultUtil in org.openrdf.query has been deprecated
                                QueryResultUtil.report( queryResult, qrWriter );
                                ^
<https://builds.apache.org/job/Zest(JavaEdition)-develop-java8-checkDists/ws/libraries/rest/src/main/java/org/apache/zest/library/rest/admin/SPARQLResource.java>:170:
warning: [deprecation] QueryResultUtil in org.openrdf.query has been deprecated
                                QueryResultUtil.report( queryResult, qrWriter );
                                ^
<https://builds.apache.org/job/Zest(JavaEdition)-develop-java8-checkDists/ws/libraries/rest/src/main/java/org/apache/zest/library/rest/admin/SPARQLResource.java>:201:
warning: [deprecation] QueryResultUtil in org.openrdf.query has been deprecated
                                QueryResultUtil.report( queryResult, qrWriter );
                                ^
3 warnings

:org.apache.zest.libraries:org.apache.zest.library.rest:honkerGenDependencies
:org.apache.zest.libraries:org.apache.zest.library.rest:honkerGenLicense
:org.apache.zest.libraries:org.apache.zest.library.rest:honkerGenNotice
:org.apache.zest.libraries:org.apache.zest.library.rest:processResources
:org.apache.zest.libraries:org.apache.zest.library.rest:classes
:org.apache.zest.libraries:org.apache.zest.library.rest:compileTestJava
:org.apache.zest.libraries:org.apache.zest.library.rest:processTestResources UP-TO-DATE
:org.apache.zest.libraries:org.apache.zest.library.rest:testClasses
:org.apache.zest.libraries:org.apache.zest.library.rest:test
:org.apache.zest.libraries:org.apache.zest.library.rest-client:makeVersionClass
:org.apache.zest.libraries:org.apache.zest.library.rest-client:compileVersionJava
:org.apache.zest.libraries:org.apache.zest.library.rest-common:makeVersionClass
:org.apache.zest.libraries:org.apache.zest.library.rest-common:compileVersionJava
:org.apache.zest.libraries:org.apache.zest.library.rest-common:compileJavaNote: Some input
files use unchecked or unsafe operations.
Note: Recompile with -Xlint:unchecked for details.

:org.apache.zest.libraries:org.apache.zest.library.rest-common:honkerGenDependencies
:org.apache.zest.libraries:org.apache.zest.library.rest-common:honkerGenLicense
:org.apache.zest.libraries:org.apache.zest.library.rest-common:honkerGenNotice
:org.apache.zest.libraries:org.apache.zest.library.rest-common:processResources UP-TO-DATE
:org.apache.zest.libraries:org.apache.zest.library.rest-common:classes
:org.apache.zest.libraries:org.apache.zest.library.rest-common:processVersionResources UP-TO-DATE
:org.apache.zest.libraries:org.apache.zest.library.rest-common:versionClasses
:org.apache.zest.libraries:org.apache.zest.library.rest-common:jar
:org.apache.zest.libraries:org.apache.zest.library.rest-client:compileJavaNote: Some input
files use unchecked or unsafe operations.
Note: Recompile with -Xlint:unchecked for details.

:org.apache.zest.libraries:org.apache.zest.library.rest-client:honkerGenDependencies
:org.apache.zest.libraries:org.apache.zest.library.rest-client:honkerGenLicense
:org.apache.zest.libraries:org.apache.zest.library.rest-client:honkerGenNotice
:org.apache.zest.libraries:org.apache.zest.library.rest-client:processResources
:org.apache.zest.libraries:org.apache.zest.library.rest-client:classes
:org.apache.zest.libraries:org.apache.zest.library.rest-server:makeVersionClass
:org.apache.zest.libraries:org.apache.zest.library.rest-server:compileVersionJava
:org.apache.zest.libraries:org.apache.zest.library.rest-server:compileJava<https://builds.apache.org/job/Zest(JavaEdition)-develop-java8-checkDists/ws/libraries/rest-server/src/main/java/org/apache/zest/library/rest/server/assembler/RestServerAssembler.java>:73:
warning: [deprecation] Configuration() in Configuration has been deprecated
        freemarker.template.Configuration cfg = new freemarker.template.Configuration();
                                                ^
<https://builds.apache.org/job/Zest(JavaEdition)-develop-java8-checkDists/ws/libraries/rest-server/src/main/java/org/apache/zest/library/rest/server/restlet/freemarker/ValueCompositeObjectWrapper.java>:29:
warning: [deprecation] DefaultObjectWrapper() in DefaultObjectWrapper has been deprecated
public class ValueCompositeObjectWrapper
       ^
Note: Some input files use unchecked or unsafe operations.
Note: Recompile with -Xlint:unchecked for details.
2 warnings

:org.apache.zest.libraries:org.apache.zest.library.rest-server:honkerGenDependencies
:org.apache.zest.libraries:org.apache.zest.library.rest-server:honkerGenLicense
:org.apache.zest.libraries:org.apache.zest.library.rest-server:honkerGenNotice
:org.apache.zest.libraries:org.apache.zest.library.rest-server:processResources
:org.apache.zest.libraries:org.apache.zest.library.rest-server:classes
:org.apache.zest.libraries:org.apache.zest.library.rest-server:processVersionResources UP-TO-DATE
:org.apache.zest.libraries:org.apache.zest.library.rest-server:versionClasses
:org.apache.zest.libraries:org.apache.zest.library.rest-server:jar
:org.apache.zest.libraries:org.apache.zest.library.rest-client:compileTestJava
:org.apache.zest.libraries:org.apache.zest.library.rest-client:processTestResources UP-TO-DATE
:org.apache.zest.libraries:org.apache.zest.library.rest-client:testClasses
:org.apache.zest.libraries:org.apache.zest.library.rest-client:test
:org.apache.zest.libraries:org.apache.zest.library.rest-common:compileTestJava UP-TO-DATE
:org.apache.zest.libraries:org.apache.zest.library.rest-common:processTestResources UP-TO-DATE
:org.apache.zest.libraries:org.apache.zest.library.rest-common:testClasses UP-TO-DATE
:org.apache.zest.libraries:org.apache.zest.library.rest-common:test UP-TO-DATE
:org.apache.zest.libraries:org.apache.zest.library.rest-server:compileTestJava
:org.apache.zest.libraries:org.apache.zest.library.rest-server:processTestResources UP-TO-DATE
:org.apache.zest.libraries:org.apache.zest.library.rest-server:testClasses
:org.apache.zest.libraries:org.apache.zest.library.rest-server:test
:org.apache.zest.extensions:org.apache.zest.extension.valueserialization-jackson:processVersionResources
UP-TO-DATE
:org.apache.zest.extensions:org.apache.zest.extension.valueserialization-jackson:versionClasses
:org.apache.zest.extensions:org.apache.zest.extension.valueserialization-jackson:jar
:org.apache.zest.libraries:org.apache.zest.library.restlet:makeVersionClass
:org.apache.zest.libraries:org.apache.zest.library.restlet:compileVersionJava
:org.apache.zest.libraries:org.apache.zest.library.restlet:compileJava<https://builds.apache.org/job/Zest(JavaEdition)-develop-java8-checkDists/ws/libraries/restlet/src/main/java/org/apache/zest/library/restlet/assembly/infrastructue/IndexingModule.java>:28:
error: package org.apache.zest.index.rdf.assembly does not exist
import org.apache.zest.index.rdf.assembly.RdfNativeSesameStoreAssembler;
                                         ^
<https://builds.apache.org/job/Zest(JavaEdition)-develop-java8-checkDists/ws/libraries/restlet/src/main/java/org/apache/zest/library/restlet/assembly/infrastructue/IndexingModule.java>:29:
error: package org.apache.zest.library.rdf.repository does not exist
import org.apache.zest.library.rdf.repository.NativeConfiguration;
                                             ^
<https://builds.apache.org/job/Zest(JavaEdition)-develop-java8-checkDists/ws/libraries/restlet/src/main/java/org/apache/zest/library/restlet/assembly/infrastructue/FileStorageModule.java>:24:
error: package org.apache.zest.entitystore.file.assembly does not exist
import org.apache.zest.entitystore.file.assembly.FileEntityStoreAssembler;
                                                ^
<https://builds.apache.org/job/Zest(JavaEdition)-develop-java8-checkDists/ws/libraries/restlet/src/main/java/org/apache/zest/library/restlet/assembly/infrastructue/IndexingModule.java>:52:
error: cannot find symbol
        configModule.entities( NativeConfiguration.class ).visibleIn( Visibility.application
);
                               ^
  symbol:   class NativeConfiguration
  location: class IndexingModule
<https://builds.apache.org/job/Zest(JavaEdition)-develop-java8-checkDists/ws/libraries/restlet/src/main/java/org/apache/zest/library/restlet/assembly/infrastructue/IndexingModule.java>:53:
error: cannot find symbol
        new RdfNativeSesameStoreAssembler(Visibility.application, Visibility.module).assemble(
module );
            ^
  symbol:   class RdfNativeSesameStoreAssembler
  location: class IndexingModule
<https://builds.apache.org/job/Zest(JavaEdition)-develop-java8-checkDists/ws/libraries/restlet/src/main/java/org/apache/zest/library/restlet/assembly/infrastructue/FileStorageModule.java>:46:
error: cannot find symbol
        new FileEntityStoreAssembler()
            ^
  symbol:   class FileEntityStoreAssembler
  location: class FileStorageModule
Note: Some input files use unchecked or unsafe operations.
Note: Recompile with -Xlint:unchecked for details.
6 errors
 FAILED

FAILURE: Build failed with an exception.

* What went wrong:
Execution failed for task ':org.apache.zest.libraries:org.apache.zest.library.restlet:compileJava'.
> Compilation failed; see the compiler error output for details.

* Try:
Run with --info or --debug option to get more log output.

* Exception is:
org.gradle.api.tasks.TaskExecutionException: Execution failed for task ':org.apache.zest.libraries:org.apache.zest.library.restlet:compileJava'.
	at org.gradle.api.internal.tasks.execution.ExecuteActionsTaskExecuter.executeActions(ExecuteActionsTaskExecuter.java:69)
	at org.gradle.api.internal.tasks.execution.ExecuteActionsTaskExecuter.execute(ExecuteActionsTaskExecuter.java:46)
	at org.gradle.api.internal.tasks.execution.PostExecutionAnalysisTaskExecuter.execute(PostExecutionAnalysisTaskExecuter.java:35)
	at org.gradle.api.internal.tasks.execution.SkipUpToDateTaskExecuter.execute(SkipUpToDateTaskExecuter.java:64)
	at org.gradle.api.internal.tasks.execution.ValidatingTaskExecuter.execute(ValidatingTaskExecuter.java:58)
	at org.gradle.api.internal.tasks.execution.SkipEmptySourceFilesTaskExecuter.execute(SkipEmptySourceFilesTaskExecuter.java:52)
	at org.gradle.api.internal.tasks.execution.SkipTaskWithNoActionsExecuter.execute(SkipTaskWithNoActionsExecuter.java:52)
	at org.gradle.api.internal.tasks.execution.SkipOnlyIfTaskExecuter.execute(SkipOnlyIfTaskExecuter.java:53)
	at org.gradle.api.internal.tasks.execution.ExecuteAtMostOnceTaskExecuter.execute(ExecuteAtMostOnceTaskExecuter.java:43)
	at org.gradle.execution.taskgraph.DefaultTaskGraphExecuter$EventFiringTaskWorker.execute(DefaultTaskGraphExecuter.java:208)
	at org.gradle.execution.taskgraph.DefaultTaskGraphExecuter$EventFiringTaskWorker.execute(DefaultTaskGraphExecuter.java:186)
	at org.gradle.execution.taskgraph.AbstractTaskPlanExecutor$TaskExecutorWorker.processTask(AbstractTaskPlanExecutor.java:62)
	at org.gradle.execution.taskgraph.AbstractTaskPlanExecutor$TaskExecutorWorker.run(AbstractTaskPlanExecutor.java:50)
	at org.gradle.execution.taskgraph.DefaultTaskPlanExecutor.process(DefaultTaskPlanExecutor.java:25)
	at org.gradle.execution.taskgraph.DefaultTaskGraphExecuter.execute(DefaultTaskGraphExecuter.java:111)
	at org.gradle.execution.SelectedTaskExecutionAction.execute(SelectedTaskExecutionAction.java:37)
	at org.gradle.execution.DefaultBuildExecuter.execute(DefaultBuildExecuter.java:62)
	at org.gradle.execution.DefaultBuildExecuter.access$200(DefaultBuildExecuter.java:23)
	at org.gradle.execution.DefaultBuildExecuter$2.proceed(DefaultBuildExecuter.java:68)
	at org.gradle.execution.DryRunBuildExecutionAction.execute(DryRunBuildExecutionAction.java:32)
	at org.gradle.execution.DefaultBuildExecuter.execute(DefaultBuildExecuter.java:62)
	at org.gradle.execution.DefaultBuildExecuter.execute(DefaultBuildExecuter.java:55)
	at org.gradle.initialization.DefaultGradleLauncher$6.run(DefaultGradleLauncher.java:174)
	at org.gradle.internal.Factories$1.create(Factories.java:22)
	at org.gradle.internal.progress.DefaultBuildOperationExecutor.run(DefaultBuildOperationExecutor.java:62)
	at org.gradle.internal.progress.DefaultBuildOperationExecutor.run(DefaultBuildOperationExecutor.java:47)
	at org.gradle.initialization.DefaultGradleLauncher.runBuildOperation(DefaultGradleLauncher.java:189)
	at org.gradle.initialization.DefaultGradleLauncher.doBuildStages(DefaultGradleLauncher.java:171)
	at org.gradle.initialization.DefaultGradleLauncher.access$200(DefaultGradleLauncher.java:35)
	at org.gradle.initialization.DefaultGradleLauncher$1.create(DefaultGradleLauncher.java:104)
	at org.gradle.initialization.DefaultGradleLauncher$1.create(DefaultGradleLauncher.java:97)
	at org.gradle.internal.progress.DefaultBuildOperationExecutor.run(DefaultBuildOperationExecutor.java:62)
	at org.gradle.initialization.DefaultGradleLauncher.runRootBuildOperation(DefaultGradleLauncher.java:184)
	at org.gradle.initialization.DefaultGradleLauncher.doBuild(DefaultGradleLauncher.java:97)
	at org.gradle.initialization.DefaultGradleLauncher.run(DefaultGradleLauncher.java:86)
	at org.gradle.launcher.exec.InProcessBuildActionExecuter$DefaultBuildController.run(InProcessBuildActionExecuter.java:93)
	at org.gradle.tooling.internal.provider.ExecuteBuildActionRunner.run(ExecuteBuildActionRunner.java:28)
	at org.gradle.launcher.exec.ChainingBuildActionRunner.run(ChainingBuildActionRunner.java:35)
	at org.gradle.launcher.exec.InProcessBuildActionExecuter.execute(InProcessBuildActionExecuter.java:43)
	at org.gradle.launcher.exec.InProcessBuildActionExecuter.execute(InProcessBuildActionExecuter.java:27)
	at org.gradle.launcher.exec.ContinuousBuildActionExecuter.execute(ContinuousBuildActionExecuter.java:72)
	at org.gradle.launcher.exec.ContinuousBuildActionExecuter.execute(ContinuousBuildActionExecuter.java:44)
	at org.gradle.launcher.exec.DaemonUsageSuggestingBuildActionExecuter.execute(DaemonUsageSuggestingBuildActionExecuter.java:50)
	at org.gradle.launcher.exec.DaemonUsageSuggestingBuildActionExecuter.execute(DaemonUsageSuggestingBuildActionExecuter.java:27)
	at org.gradle.launcher.cli.RunBuildAction.run(RunBuildAction.java:40)
	at org.gradle.internal.Actions$RunnableActionAdapter.execute(Actions.java:170)
	at org.gradle.launcher.cli.CommandLineActionFactory$ParseAndBuildAction.execute(CommandLineActionFactory.java:237)
	at org.gradle.launcher.cli.CommandLineActionFactory$ParseAndBuildAction.execute(CommandLineActionFactory.java:210)
	at org.gradle.launcher.cli.JavaRuntimeValidationAction.execute(JavaRuntimeValidationAction.java:35)
	at org.gradle.launcher.cli.JavaRuntimeValidationAction.execute(JavaRuntimeValidationAction.java:24)
	at org.gradle.launcher.cli.CommandLineActionFactory$WithLogging.execute(CommandLineActionFactory.java:206)
	at org.gradle.launcher.cli.CommandLineActionFactory$WithLogging.execute(CommandLineActionFactory.java:169)
	at org.gradle.launcher.cli.ExceptionReportingAction.execute(ExceptionReportingAction.java:33)
	at org.gradle.launcher.cli.ExceptionReportingAction.execute(ExceptionReportingAction.java:22)
	at org.gradle.launcher.Main.doAction(Main.java:33)
	at org.gradle.launcher.bootstrap.EntryPoint.run(EntryPoint.java:45)
	at org.gradle.launcher.bootstrap.ProcessBootstrap.runNoExit(ProcessBootstrap.java:54)
	at org.gradle.launcher.bootstrap.ProcessBootstrap.run(ProcessBootstrap.java:35)
	at org.gradle.launcher.GradleMain.main(GradleMain.java:23)
	at org.gradle.wrapper.BootstrapMainStarter.start(BootstrapMainStarter.java:30)
	at org.gradle.wrapper.WrapperExecutor.execute(WrapperExecutor.java:127)
	at org.gradle.wrapper.GradleWrapperMain.main(GradleWrapperMain.java:55)
Caused by: org.gradle.api.internal.tasks.compile.CompilationFailedException: Compilation failed;
see the compiler error output for details.
	at org.gradle.api.internal.tasks.compile.JdkJavaCompiler.execute(JdkJavaCompiler.java:47)
	at org.gradle.api.internal.tasks.compile.JdkJavaCompiler.execute(JdkJavaCompiler.java:33)
	at org.gradle.api.internal.tasks.compile.NormalizingJavaCompiler.delegateAndHandleErrors(NormalizingJavaCompiler.java:101)
	at org.gradle.api.internal.tasks.compile.NormalizingJavaCompiler.execute(NormalizingJavaCompiler.java:50)
	at org.gradle.api.internal.tasks.compile.NormalizingJavaCompiler.execute(NormalizingJavaCompiler.java:36)
	at org.gradle.api.internal.tasks.compile.CleaningJavaCompilerSupport.execute(CleaningJavaCompilerSupport.java:34)
	at org.gradle.api.internal.tasks.compile.CleaningJavaCompilerSupport.execute(CleaningJavaCompilerSupport.java:25)
	at org.gradle.api.tasks.compile.JavaCompile.performCompilation(JavaCompile.java:157)
	at org.gradle.api.tasks.compile.JavaCompile.compile(JavaCompile.java:137)
	at org.gradle.api.tasks.compile.JavaCompile.compile(JavaCompile.java:91)
	at org.gradle.internal.reflect.JavaMethod.invoke(JavaMethod.java:75)
	at org.gradle.api.internal.project.taskfactory.AnnotationProcessingTaskFactory$IncrementalTaskAction.doExecute(AnnotationProcessingTaskFactory.java:243)
	at org.gradle.api.internal.project.taskfactory.AnnotationProcessingTaskFactory$StandardTaskAction.execute(AnnotationProcessingTaskFactory.java:219)
	at org.gradle.api.internal.project.taskfactory.AnnotationProcessingTaskFactory$IncrementalTaskAction.execute(AnnotationProcessingTaskFactory.java:230)
	at org.gradle.api.internal.project.taskfactory.AnnotationProcessingTaskFactory$StandardTaskAction.execute(AnnotationProcessingTaskFactory.java:208)
	at org.gradle.api.internal.tasks.execution.ExecuteActionsTaskExecuter.executeAction(ExecuteActionsTaskExecuter.java:80)
	at org.gradle.api.internal.tasks.execution.ExecuteActionsTaskExecuter.executeActions(ExecuteActionsTaskExecuter.java:61)
	... 61 more


BUILD FAILED

Total time: 5 mins 29.874 secs
Build step 'Invoke Gradle script' changed build result to FAILURE
Build step 'Invoke Gradle script' marked build as failure
Xvfb stopping
Archiving artifacts
Recording test results
Publishing Javadoc

Mime
View raw message