polygene-dev mailing list archives

Site index · List index
Message view « Date » · « Thread »
Top « Date » · « Thread »
From Apache Jenkins Server <jenk...@builds.apache.org>
Subject Build failed in Jenkins: Zest(JavaEdition)-develop-java8-checkDists #28
Date Sun, 02 Aug 2015 08:34:38 GMT
See <https://builds.apache.org/job/Zest(JavaEdition)-develop-java8-checkDists/28/changes>

Changes:

[paulmerlin] tools/envisage: add missing headers in IDEA .form files

------------------------------------------
[...truncated 2121 lines...]
<https://builds.apache.org/job/Zest(JavaEdition)-develop-java8-checkDists/ws/core/api/src/main/java/org/apache/zest/api/query/QueryExpressions.java>:636:
warning: no @param for <T>
    public static <T> ContainsSpecification<T> contains( Property<? extends
Collection<T>> collectionProperty,
                                               ^
<https://builds.apache.org/job/Zest(JavaEdition)-develop-java8-checkDists/ws/core/api/src/main/java/org/apache/zest/api/query/QueryExpressions.java>:652:
warning: no @param for <T>
    public static <T> ContainsSpecification<T> contains( Property<? extends
Collection<T>> collectionProperty,
                                               ^
<https://builds.apache.org/job/Zest(JavaEdition)-develop-java8-checkDists/ws/core/api/src/main/java/org/apache/zest/api/query/QueryExpressions.java>:667:
warning: no @param for <T>
    public static <T> ManyAssociationContainsSpecification<T> contains( ManyAssociation<T>
manyAssoc, T value )
                                                              ^
<https://builds.apache.org/job/Zest(JavaEdition)-develop-java8-checkDists/ws/core/api/src/main/java/org/apache/zest/api/query/QueryExpressions.java>:680:
warning: no @param for <T>
    public static <T> NamedAssociationContainsSpecification<T> contains( NamedAssociation<T>
namedAssoc, T value )
                                                               ^
<https://builds.apache.org/job/Zest(JavaEdition)-develop-java8-checkDists/ws/core/api/src/main/java/org/apache/zest/api/query/QueryExpressions.java>:693:
warning: no @param for <T>
    public static <T> NamedAssociationContainsNameSpecification<T> containsName(
NamedAssociation<T> namedAssoc,
                                                                   ^
<https://builds.apache.org/job/Zest(JavaEdition)-develop-java8-checkDists/ws/libraries/http/src/main/java/org/apache/zest/library/http/JettyServiceAssembler.java>:41:
warning: no @return
    public JettyServiceAssembler withServer( ModuleAssembly serverModule, Visibility serverVisibility
)
                                 ^
<https://builds.apache.org/job/Zest(JavaEdition)-develop-java8-checkDists/ws/core/api/src/main/java/org/apache/zest/api/configuration/Configuration.java>:153:
warning: no description for @param
     * @param <T>
       ^
<https://builds.apache.org/job/Zest(JavaEdition)-develop-java8-checkDists/ws/core/api/src/main/java/org/apache/zest/api/unitofwork/concern/UnitOfWorkRetry.java>:71:
error: self-closing element not allowed
     * <p/>
       ^
<https://builds.apache.org/job/Zest(JavaEdition)-develop-java8-checkDists/ws/libraries/shiro-core/src/main/java/org/apache/zest/library/shiro/ini/ShiroIniConfiguration.java>:31:
warning: no @return
    Property<String> iniResourcePath();
                     ^
<https://builds.apache.org/job/Zest(JavaEdition)-develop-java8-checkDists/ws/core/api/src/main/java/org/apache/zest/api/structure/MetaInfoHolder.java>:34:
warning: no @param for <T>
    <T> T metaInfo( Class<T> infoType );
          ^
<https://builds.apache.org/job/Zest(JavaEdition)-develop-java8-checkDists/ws/core/api/src/main/java/org/apache/zest/api/association/AssociationStateHolder.java>:37:
warning: no @param for <T>
    <T> Association<T> associationFor( AccessibleObject associationMethod );
                       ^
<https://builds.apache.org/job/Zest(JavaEdition)-develop-java8-checkDists/ws/core/api/src/main/java/org/apache/zest/api/association/AssociationStateHolder.java>:53:
warning: no @param for <T>
    <T> ManyAssociation<T> manyAssociationFor( AccessibleObject manyassociationMethod
);
                           ^
<https://builds.apache.org/job/Zest(JavaEdition)-develop-java8-checkDists/ws/core/api/src/main/java/org/apache/zest/api/association/AssociationStateHolder.java>:69:
warning: no @param for <T>
    <T> NamedAssociation<T> namedAssociationFor( AccessibleObject namedassociationMethod
);
                            ^
<https://builds.apache.org/job/Zest(JavaEdition)-develop-java8-checkDists/ws/core/api/src/main/java/org/apache/zest/api/property/StateHolder.java>:33:
warning: no @param for <T>
    <T> Property<T> propertyFor( AccessibleObject accessor )
                    ^
<https://builds.apache.org/job/Zest(JavaEdition)-develop-java8-checkDists/ws/core/api/src/main/java/org/apache/zest/api/entity/EntityBuilder.java>:47:
warning: no @param for <K>
    <K> K instanceFor( Class<K> mixinType );
          ^
<https://builds.apache.org/job/Zest(JavaEdition)-develop-java8-checkDists/ws/core/api/src/main/java/org/apache/zest/api/metrics/MetricsTimer.java>:27:
warning: no @return
    Context start();
            ^
<https://builds.apache.org/job/Zest(JavaEdition)-develop-java8-checkDists/ws/extensions/indexing-elasticsearch/src/main/java/org/apache/zest/index/elasticsearch/ElasticSearchClusterConfiguration.java>:33:
warning: no @return
    @Optional Property<String> nodes();
                               ^
<https://builds.apache.org/job/Zest(JavaEdition)-develop-java8-checkDists/ws/extensions/indexing-elasticsearch/src/main/java/org/apache/zest/index/elasticsearch/ElasticSearchClusterConfiguration.java>:41:
warning: no @return
    @UseDefaults Property<Boolean> clusterSniff();
                                   ^
<https://builds.apache.org/job/Zest(JavaEdition)-develop-java8-checkDists/ws/extensions/indexing-elasticsearch/src/main/java/org/apache/zest/index/elasticsearch/ElasticSearchClusterConfiguration.java>:47:
warning: no @return
    @UseDefaults Property<Boolean> ignoreClusterName();
                                   ^
<https://builds.apache.org/job/Zest(JavaEdition)-develop-java8-checkDists/ws/extensions/indexing-elasticsearch/src/main/java/org/apache/zest/index/elasticsearch/ElasticSearchClusterConfiguration.java>:53:
warning: no @return
    @Optional Property<String> pingTimeout();
                               ^
<https://builds.apache.org/job/Zest(JavaEdition)-develop-java8-checkDists/ws/extensions/indexing-elasticsearch/src/main/java/org/apache/zest/index/elasticsearch/ElasticSearchClusterConfiguration.java>:59:
warning: no @return
    @Optional Property<String> samplerInterval();
                               ^
<https://builds.apache.org/job/Zest(JavaEdition)-develop-java8-checkDists/ws/extensions/indexing-elasticsearch/src/main/java/org/apache/zest/index/elasticsearch/ElasticSearchConfiguration.java>:34:
warning: no @return
    @Optional Property<String> clusterName();
                               ^
<https://builds.apache.org/job/Zest(JavaEdition)-develop-java8-checkDists/ws/extensions/indexing-elasticsearch/src/main/java/org/apache/zest/index/elasticsearch/ElasticSearchConfiguration.java>:40:
warning: no @return
    @Optional Property<String> index();
                               ^
<https://builds.apache.org/job/Zest(JavaEdition)-develop-java8-checkDists/ws/extensions/indexing-elasticsearch/src/main/java/org/apache/zest/index/elasticsearch/ElasticSearchConfiguration.java>:47:
warning: no @return
    @UseDefaults Property<Boolean> indexNonAggregatedAssociations();
                                   ^
<https://builds.apache.org/job/Zest(JavaEdition)-develop-java8-checkDists/ws/extensions/entitystore-jclouds/src/main/java/org/apache/zest/entitystore/jclouds/JCloudsMapEntityStoreConfiguration.java>:32:
warning: no @return
    @Optional Property<String> provider();
                               ^
<https://builds.apache.org/job/Zest(JavaEdition)-develop-java8-checkDists/ws/extensions/entitystore-jclouds/src/main/java/org/apache/zest/entitystore/jclouds/JCloudsMapEntityStoreConfiguration.java>:38:
warning: no @return
    @UseDefaults Property<Map<String, String>> properties();
                                               ^
<https://builds.apache.org/job/Zest(JavaEdition)-develop-java8-checkDists/ws/extensions/entitystore-jclouds/src/main/java/org/apache/zest/entitystore/jclouds/JCloudsMapEntityStoreConfiguration.java>:42:
warning: no @return
    @Optional Property<String> container();
                               ^
<https://builds.apache.org/job/Zest(JavaEdition)-develop-java8-checkDists/ws/core/spi/src/main/java/org/apache/zest/spi/cache/CachePool.java>:46:
warning: no description for @param
     * @param valueType
       ^
<https://builds.apache.org/job/Zest(JavaEdition)-develop-java8-checkDists/ws/core/spi/src/main/java/org/apache/zest/spi/cache/CachePool.java>:47:
warning: no description for @param
     * @param <T>
       ^
<https://builds.apache.org/job/Zest(JavaEdition)-develop-java8-checkDists/ws/core/spi/src/main/java/org/apache/zest/spi/entitystore/helpers/MapEntityStore.java>:55:
warning: no @param for changer
        void visitMap( MapChanger changer )
             ^
<https://builds.apache.org/job/Zest(JavaEdition)-develop-java8-checkDists/ws/core/spi/src/main/java/org/apache/zest/spi/entitystore/helpers/MapEntityStore.java>:55:
warning: no @throws for java.io.IOException
        void visitMap( MapChanger changer )
             ^
<https://builds.apache.org/job/Zest(JavaEdition)-develop-java8-checkDists/ws/libraries/sql/src/main/java/org/apache/zest/library/sql/common/Databases.java>:47:
warning: no @param for sql
    public int update( String sql )
               ^
<https://builds.apache.org/job/Zest(JavaEdition)-develop-java8-checkDists/ws/libraries/sql/src/main/java/org/apache/zest/library/sql/common/Databases.java>:47:
warning: no @return
    public int update( String sql )
               ^
<https://builds.apache.org/job/Zest(JavaEdition)-develop-java8-checkDists/ws/libraries/sql/src/main/java/org/apache/zest/library/sql/common/Databases.java>:47:
warning: no @throws for java.sql.SQLException
    public int update( String sql )
               ^
<https://builds.apache.org/job/Zest(JavaEdition)-develop-java8-checkDists/ws/libraries/sql/src/main/java/org/apache/zest/library/sql/common/Databases.java>:68:
warning: no @param for sql
    public int update( String sql, StatementVisitor visitor )
               ^
<https://builds.apache.org/job/Zest(JavaEdition)-develop-java8-checkDists/ws/libraries/sql/src/main/java/org/apache/zest/library/sql/common/Databases.java>:68:
warning: no @param for visitor
    public int update( String sql, StatementVisitor visitor )
               ^
<https://builds.apache.org/job/Zest(JavaEdition)-develop-java8-checkDists/ws/libraries/sql/src/main/java/org/apache/zest/library/sql/common/Databases.java>:68:
warning: no @return
    public int update( String sql, StatementVisitor visitor )
               ^
<https://builds.apache.org/job/Zest(JavaEdition)-develop-java8-checkDists/ws/libraries/sql/src/main/java/org/apache/zest/library/sql/common/Databases.java>:68:
warning: no @throws for java.sql.SQLException
    public int update( String sql, StatementVisitor visitor )
               ^
<https://builds.apache.org/job/Zest(JavaEdition)-develop-java8-checkDists/ws/libraries/sql/src/main/java/org/apache/zest/library/sql/common/Databases.java>:87:
warning: no @param for sql
    public void query( String sql, ResultSetVisitor visitor )
                ^
<https://builds.apache.org/job/Zest(JavaEdition)-develop-java8-checkDists/ws/libraries/sql/src/main/java/org/apache/zest/library/sql/common/Databases.java>:87:
warning: no @param for visitor
    public void query( String sql, ResultSetVisitor visitor )
                ^
<https://builds.apache.org/job/Zest(JavaEdition)-develop-java8-checkDists/ws/libraries/sql/src/main/java/org/apache/zest/library/sql/common/Databases.java>:87:
warning: no @throws for java.sql.SQLException
    public void query( String sql, ResultSetVisitor visitor )
                ^
<https://builds.apache.org/job/Zest(JavaEdition)-develop-java8-checkDists/ws/libraries/sql/src/main/java/org/apache/zest/library/sql/common/Databases.java>:99:
warning: no @param for sql
    public void query( String sql, StatementVisitor statement, ResultSetVisitor resultsetVisitor
)
                ^
<https://builds.apache.org/job/Zest(JavaEdition)-develop-java8-checkDists/ws/libraries/sql/src/main/java/org/apache/zest/library/sql/common/Databases.java>:99:
warning: no @param for statement
    public void query( String sql, StatementVisitor statement, ResultSetVisitor resultsetVisitor
)
                ^
<https://builds.apache.org/job/Zest(JavaEdition)-develop-java8-checkDists/ws/libraries/sql/src/main/java/org/apache/zest/library/sql/common/Databases.java>:99:
warning: no @param for resultsetVisitor
    public void query( String sql, StatementVisitor statement, ResultSetVisitor resultsetVisitor
)
                ^
<https://builds.apache.org/job/Zest(JavaEdition)-develop-java8-checkDists/ws/libraries/sql/src/main/java/org/apache/zest/library/sql/common/Databases.java>:99:
warning: no @throws for java.sql.SQLException
    public void query( String sql, StatementVisitor statement, ResultSetVisitor resultsetVisitor
)
                ^
<https://builds.apache.org/job/Zest(JavaEdition)-develop-java8-checkDists/ws/libraries/sql/src/main/java/org/apache/zest/library/sql/common/Databases.java>:130:
warning: no @param for sql
    public Input<ResultSet, SQLException> query( final String sql )
                                          ^
<https://builds.apache.org/job/Zest(JavaEdition)-develop-java8-checkDists/ws/libraries/sql/src/main/java/org/apache/zest/library/sql/common/Databases.java>:130:
warning: no @return
    public Input<ResultSet, SQLException> query( final String sql )
                                          ^

1 error
100 warnings
:javadocs FAILED

FAILURE: Build failed with an exception.

* What went wrong:
Execution failed for task ':javadocs'.
> Javadoc generation failed. Generated Javadoc options file (useful for troubleshooting):
'<https://builds.apache.org/job/Zest(JavaEdition)-develop-java8-checkDists/ws/build/tmp/javadocs/javadoc.options'>

* Try:
Run with --info or --debug option to get more log output.

* Exception is:
org.gradle.api.tasks.TaskExecutionException: Execution failed for task ':javadocs'.
	at org.gradle.api.internal.tasks.execution.ExecuteActionsTaskExecuter.executeActions(ExecuteActionsTaskExecuter.java:69)
	at org.gradle.api.internal.tasks.execution.ExecuteActionsTaskExecuter.execute(ExecuteActionsTaskExecuter.java:46)
	at org.gradle.api.internal.tasks.execution.PostExecutionAnalysisTaskExecuter.execute(PostExecutionAnalysisTaskExecuter.java:35)
	at org.gradle.api.internal.tasks.execution.SkipUpToDateTaskExecuter.execute(SkipUpToDateTaskExecuter.java:64)
	at org.gradle.api.internal.tasks.execution.ValidatingTaskExecuter.execute(ValidatingTaskExecuter.java:58)
	at org.gradle.api.internal.tasks.execution.SkipEmptySourceFilesTaskExecuter.execute(SkipEmptySourceFilesTaskExecuter.java:52)
	at org.gradle.api.internal.tasks.execution.SkipTaskWithNoActionsExecuter.execute(SkipTaskWithNoActionsExecuter.java:52)
	at org.gradle.api.internal.tasks.execution.SkipOnlyIfTaskExecuter.execute(SkipOnlyIfTaskExecuter.java:53)
	at org.gradle.api.internal.tasks.execution.ExecuteAtMostOnceTaskExecuter.execute(ExecuteAtMostOnceTaskExecuter.java:43)
	at org.gradle.execution.taskgraph.DefaultTaskGraphExecuter$EventFiringTaskWorker.execute(DefaultTaskGraphExecuter.java:208)
	at org.gradle.execution.taskgraph.DefaultTaskGraphExecuter$EventFiringTaskWorker.execute(DefaultTaskGraphExecuter.java:186)
	at org.gradle.execution.taskgraph.AbstractTaskPlanExecutor$TaskExecutorWorker.processTask(AbstractTaskPlanExecutor.java:62)
	at org.gradle.execution.taskgraph.AbstractTaskPlanExecutor$TaskExecutorWorker.run(AbstractTaskPlanExecutor.java:50)
	at org.gradle.execution.taskgraph.DefaultTaskPlanExecutor.process(DefaultTaskPlanExecutor.java:25)
	at org.gradle.execution.taskgraph.DefaultTaskGraphExecuter.execute(DefaultTaskGraphExecuter.java:111)
	at org.gradle.execution.SelectedTaskExecutionAction.execute(SelectedTaskExecutionAction.java:37)
	at org.gradle.execution.DefaultBuildExecuter.execute(DefaultBuildExecuter.java:62)
	at org.gradle.execution.DefaultBuildExecuter.access$200(DefaultBuildExecuter.java:23)
	at org.gradle.execution.DefaultBuildExecuter$2.proceed(DefaultBuildExecuter.java:68)
	at org.gradle.execution.DryRunBuildExecutionAction.execute(DryRunBuildExecutionAction.java:32)
	at org.gradle.execution.DefaultBuildExecuter.execute(DefaultBuildExecuter.java:62)
	at org.gradle.execution.DefaultBuildExecuter.execute(DefaultBuildExecuter.java:55)
	at org.gradle.initialization.DefaultGradleLauncher$6.run(DefaultGradleLauncher.java:174)
	at org.gradle.internal.Factories$1.create(Factories.java:22)
	at org.gradle.internal.progress.DefaultBuildOperationExecutor.run(DefaultBuildOperationExecutor.java:62)
	at org.gradle.internal.progress.DefaultBuildOperationExecutor.run(DefaultBuildOperationExecutor.java:47)
	at org.gradle.initialization.DefaultGradleLauncher.runBuildOperation(DefaultGradleLauncher.java:189)
	at org.gradle.initialization.DefaultGradleLauncher.doBuildStages(DefaultGradleLauncher.java:171)
	at org.gradle.initialization.DefaultGradleLauncher.access$200(DefaultGradleLauncher.java:35)
	at org.gradle.initialization.DefaultGradleLauncher$1.create(DefaultGradleLauncher.java:104)
	at org.gradle.initialization.DefaultGradleLauncher$1.create(DefaultGradleLauncher.java:97)
	at org.gradle.internal.progress.DefaultBuildOperationExecutor.run(DefaultBuildOperationExecutor.java:62)
	at org.gradle.initialization.DefaultGradleLauncher.runRootBuildOperation(DefaultGradleLauncher.java:184)
	at org.gradle.initialization.DefaultGradleLauncher.doBuild(DefaultGradleLauncher.java:97)
	at org.gradle.initialization.DefaultGradleLauncher.run(DefaultGradleLauncher.java:86)
	at org.gradle.launcher.exec.InProcessBuildActionExecuter$DefaultBuildController.run(InProcessBuildActionExecuter.java:93)
	at org.gradle.tooling.internal.provider.ExecuteBuildActionRunner.run(ExecuteBuildActionRunner.java:28)
	at org.gradle.launcher.exec.ChainingBuildActionRunner.run(ChainingBuildActionRunner.java:35)
	at org.gradle.launcher.exec.InProcessBuildActionExecuter.execute(InProcessBuildActionExecuter.java:43)
	at org.gradle.launcher.exec.InProcessBuildActionExecuter.execute(InProcessBuildActionExecuter.java:27)
	at org.gradle.launcher.exec.ContinuousBuildActionExecuter.execute(ContinuousBuildActionExecuter.java:72)
	at org.gradle.launcher.exec.ContinuousBuildActionExecuter.execute(ContinuousBuildActionExecuter.java:44)
	at org.gradle.launcher.exec.DaemonUsageSuggestingBuildActionExecuter.execute(DaemonUsageSuggestingBuildActionExecuter.java:50)
	at org.gradle.launcher.exec.DaemonUsageSuggestingBuildActionExecuter.execute(DaemonUsageSuggestingBuildActionExecuter.java:27)
	at org.gradle.launcher.cli.RunBuildAction.run(RunBuildAction.java:40)
	at org.gradle.internal.Actions$RunnableActionAdapter.execute(Actions.java:170)
	at org.gradle.launcher.cli.CommandLineActionFactory$ParseAndBuildAction.execute(CommandLineActionFactory.java:237)
	at org.gradle.launcher.cli.CommandLineActionFactory$ParseAndBuildAction.execute(CommandLineActionFactory.java:210)
	at org.gradle.launcher.cli.JavaRuntimeValidationAction.execute(JavaRuntimeValidationAction.java:35)
	at org.gradle.launcher.cli.JavaRuntimeValidationAction.execute(JavaRuntimeValidationAction.java:24)
	at org.gradle.launcher.cli.CommandLineActionFactory$WithLogging.execute(CommandLineActionFactory.java:206)
	at org.gradle.launcher.cli.CommandLineActionFactory$WithLogging.execute(CommandLineActionFactory.java:169)
	at org.gradle.launcher.cli.ExceptionReportingAction.execute(ExceptionReportingAction.java:33)
	at org.gradle.launcher.cli.ExceptionReportingAction.execute(ExceptionReportingAction.java:22)
	at org.gradle.launcher.Main.doAction(Main.java:33)
	at org.gradle.launcher.bootstrap.EntryPoint.run(EntryPoint.java:45)
	at org.gradle.launcher.bootstrap.ProcessBootstrap.runNoExit(ProcessBootstrap.java:54)
	at org.gradle.launcher.bootstrap.ProcessBootstrap.run(ProcessBootstrap.java:35)
	at org.gradle.launcher.GradleMain.main(GradleMain.java:23)
	at org.gradle.wrapper.BootstrapMainStarter.start(BootstrapMainStarter.java:30)
	at org.gradle.wrapper.WrapperExecutor.execute(WrapperExecutor.java:127)
	at org.gradle.wrapper.GradleWrapperMain.main(GradleWrapperMain.java:55)
Caused by: org.gradle.api.GradleException: Javadoc generation failed. Generated Javadoc options
file (useful for troubleshooting): '<https://builds.apache.org/job/Zest(JavaEdition)-develop-java8-checkDists/ws/build/tmp/javadocs/javadoc.options'>
	at org.gradle.api.tasks.javadoc.internal.JavadocGenerator.execute(JavadocGenerator.java:57)
	at org.gradle.api.tasks.javadoc.internal.JavadocGenerator.execute(JavadocGenerator.java:31)
	at org.gradle.api.tasks.javadoc.Javadoc.executeExternalJavadoc(Javadoc.java:143)
	at org.gradle.api.tasks.javadoc.Javadoc.generate(Javadoc.java:131)
	at org.gradle.internal.reflect.JavaMethod.invoke(JavaMethod.java:75)
	at org.gradle.api.internal.project.taskfactory.AnnotationProcessingTaskFactory$StandardTaskAction.doExecute(AnnotationProcessingTaskFactory.java:226)
	at org.gradle.api.internal.project.taskfactory.AnnotationProcessingTaskFactory$StandardTaskAction.execute(AnnotationProcessingTaskFactory.java:219)
	at org.gradle.api.internal.project.taskfactory.AnnotationProcessingTaskFactory$StandardTaskAction.execute(AnnotationProcessingTaskFactory.java:208)
	at org.gradle.api.internal.AbstractTask$TaskActionWrapper.execute(AbstractTask.java:585)
	at org.gradle.api.internal.AbstractTask$TaskActionWrapper.execute(AbstractTask.java:568)
	at org.gradle.api.internal.tasks.execution.ExecuteActionsTaskExecuter.executeAction(ExecuteActionsTaskExecuter.java:80)
	at org.gradle.api.internal.tasks.execution.ExecuteActionsTaskExecuter.executeActions(ExecuteActionsTaskExecuter.java:61)
	... 61 more
Caused by: org.gradle.process.internal.ExecException: Process 'command '/home/jenkins/tools/java/jdk1.8.0/bin/javadoc''
finished with non-zero exit value 1
	at org.gradle.process.internal.DefaultExecHandle$ExecResultImpl.assertNormalExitValue(DefaultExecHandle.java:366)
	at org.gradle.process.internal.DefaultExecAction.execute(DefaultExecAction.java:31)
	at org.gradle.api.tasks.javadoc.internal.JavadocGenerator.execute(JavadocGenerator.java:52)
	... 72 more


BUILD FAILED

Total time: 11 mins 32.347 secs
Build step 'Invoke Gradle script' changed build result to FAILURE
Build step 'Invoke Gradle script' marked build as failure
Xvfb stopping
Archiving artifacts
Recording test results
Publishing Javadoc

Mime
View raw message