polygene-dev mailing list archives

Site index · List index
Message view « Date » · « Thread »
Top « Date » · « Thread »
From Apache Jenkins Server <jenk...@builds.apache.org>
Subject Build failed in Jenkins: Zest - Check 2.1-SNAPSHOT distributions from develop branch on Java7 (Oracle JDK) #23
Date Wed, 15 Jul 2015 18:31:50 GMT
See <https://builds.apache.org/job/Zest%20-%20Check%202.1-SNAPSHOT%20distributions%20from%20develop%20branch%20on%20Java7%20(Oracle%20JDK)/23/changes>

Changes:

[paulmerlin] Build now use Gradle 2.5

------------------------------------------
[...truncated 2734 lines...]
:org.qi4j.tutorials:org.qi4j.tutorial.introduction:org.qi4j.tutorial.introduction.tenminutes:assemble
:org.qi4j.tutorials:org.qi4j.tutorial.introduction:org.qi4j.tutorial.introduction.tenminutes:dependencyReport
:org.qi4j.tutorials:org.qi4j.tutorial.introduction:org.qi4j.tutorial.introduction.thirtyminutes:processVersionResources
UP-TO-DATE
:org.qi4j.tutorials:org.qi4j.tutorial.introduction:org.qi4j.tutorial.introduction.thirtyminutes:versionClasses
:org.qi4j.tutorials:org.qi4j.tutorial.introduction:org.qi4j.tutorial.introduction.thirtyminutes:jar
:org.qi4j.tutorials:org.qi4j.tutorial.introduction:org.qi4j.tutorial.introduction.thirtyminutes:javadoc
:org.qi4j.tutorials:org.qi4j.tutorial.introduction:org.qi4j.tutorial.introduction.thirtyminutes:javadocJar
:org.qi4j.tutorials:org.qi4j.tutorial.introduction:org.qi4j.tutorial.introduction.thirtyminutes:sourceJar
:org.qi4j.tutorials:org.qi4j.tutorial.introduction:org.qi4j.tutorial.introduction.thirtyminutes:testSourceJar
:org.qi4j.tutorials:org.qi4j.tutorial.introduction:org.qi4j.tutorial.introduction.thirtyminutes:signArchives
SKIPPED
:org.qi4j.tutorials:org.qi4j.tutorial.introduction:org.qi4j.tutorial.introduction.thirtyminutes:assemble
:org.qi4j.tutorials:org.qi4j.tutorial.introduction:org.qi4j.tutorial.introduction.thirtyminutes:dependencyReport
:org.qi4j.tutorials:org.qi4j.tutorial.introduction:org.qi4j.tutorial.introduction.twominutes:processVersionResources
UP-TO-DATE
:org.qi4j.tutorials:org.qi4j.tutorial.introduction:org.qi4j.tutorial.introduction.twominutes:versionClasses
:org.qi4j.tutorials:org.qi4j.tutorial.introduction:org.qi4j.tutorial.introduction.twominutes:jar
:org.qi4j.tutorials:org.qi4j.tutorial.introduction:org.qi4j.tutorial.introduction.twominutes:javadoc
:org.qi4j.tutorials:org.qi4j.tutorial.introduction:org.qi4j.tutorial.introduction.twominutes:javadocJar
:org.qi4j.tutorials:org.qi4j.tutorial.introduction:org.qi4j.tutorial.introduction.twominutes:sourceJar
:org.qi4j.tutorials:org.qi4j.tutorial.introduction:org.qi4j.tutorial.introduction.twominutes:testSourceJar
:org.qi4j.tutorials:org.qi4j.tutorial.introduction:org.qi4j.tutorial.introduction.twominutes:signArchives
SKIPPED
:org.qi4j.tutorials:org.qi4j.tutorial.introduction:org.qi4j.tutorial.introduction.twominutes:assemble
:org.qi4j.tutorials:org.qi4j.tutorial.introduction:org.qi4j.tutorial.introduction.twominutes:dependencyReport
:buildAll
:generateBinDistGoOfflineHelpers
:tarBinaries
:tarSources
:zipBinaries
:zipSources
:assemble
:unpackBinDist
:checkBinDist_goOfflineGradle
:buildSrc:compileJava UP-TO-DATE
:buildSrc:compileGroovy UP-TO-DATE
:buildSrc:processResources UP-TO-DATE
:buildSrc:classes UP-TO-DATE
:buildSrc:jar UP-TO-DATE
:buildSrc:assemble UP-TO-DATE
:buildSrc:compileTestJava UP-TO-DATE
:buildSrc:compileTestGroovy UP-TO-DATE
:buildSrc:processTestResources UP-TO-DATE
:buildSrc:testClasses UP-TO-DATE
:buildSrc:test UP-TO-DATE
:buildSrc:check UP-TO-DATE
:buildSrc:build UP-TO-DATE
Project: org.qi4j
Project: org.qi4j.core
Project: org.qi4j.core.functional
Project: org.qi4j.core.io
Project: org.qi4j.core.api
Project: org.qi4j.core.spi
Project: org.qi4j.core.testsupport
Project: org.qi4j.core.bootstrap
Project: org.qi4j.core.runtime
Project: org.qi4j.libraries
Project: org.qi4j.library.alarm
Project: org.qi4j.library.circuitbreaker
Project: org.qi4j.library.constraints
Project: org.qi4j.library.conversion
Project: org.qi4j.library.eventsourcing
Project: org.qi4j.library.eventsourcing-jdbm
Project: org.qi4j.library.eventsourcing-rest
Project: org.qi4j.library.fileconfig
Project: org.qi4j.library.http
Project: org.qi4j.library.invocation-cache
Project: org.qi4j.library.lang-groovy
Project: org.qi4j.library.lang-javascript
Project: org.qi4j.library.lang-scala
Project: org.qi4j.library.jmx
Project: org.qi4j.library.locking
Project: org.qi4j.library.logging
Project: org.qi4j.library.metrics
Project: org.qi4j.library.osgi
Project: org.qi4j.library.rdf
Project: org.qi4j.library.rest
Project: org.qi4j.library.rest-client
Project: org.qi4j.library.rest-common
Project: org.qi4j.library.rest-server
Project: org.qi4j.library.scheduler
Project: org.qi4j.library.scripting
Project: org.qi4j.library.servlet
Project: org.qi4j.library.shiro-core
Project: org.qi4j.library.shiro-web
Project: org.qi4j.library.spring
Project: org.qi4j.library.sql
Project: org.qi4j.library.sql-bonecp
Project: org.qi4j.library.sql-dbcp
Project: org.qi4j.library.sql-liquibase
Project: org.qi4j.library.uid
Project: org.qi4j.library.uowfile
Project: org.qi4j.extensions
Project: org.qi4j.extension.cache-ehcache
Project: org.qi4j.extension.cache-memcache
Project: org.qi4j.extension.entitystore-memory
Project: org.qi4j.extension.entitystore-file
Project: org.qi4j.extension.entitystore-hazelcast
Project: org.qi4j.extension.entitystore-jclouds
Project: org.qi4j.extension.entitystore-jdbm
Project: org.qi4j.extension.entitystore-leveldb
Project: org.qi4j.extension.entitystore-mongodb
Project: org.qi4j.extension.entitystore-preferences
Project: org.qi4j.extension.entitystore-redis
Project: org.qi4j.extension.entitystore-riak
Project: org.qi4j.extension.entitystore-sql
Project: org.qi4j.extension.entitystore-voldemort
Project: org.qi4j.extension.indexing-elasticsearch
Project: org.qi4j.extension.indexing-rdf
Project: org.qi4j.extension.indexing-solr
Project: org.qi4j.extension.indexing-sql
Project: org.qi4j.extension.metrics-yammer
Project: org.qi4j.extension.migration
Project: org.qi4j.extension.reindexer
Project: org.qi4j.extension.valueserialization-orgjson
Project: org.qi4j.extension.valueserialization-jackson
Project: org.qi4j.extension.valueserialization-stax
Project: org.qi4j.manual
Project: org.qi4j.samples
Project: org.qi4j.sample.dci
Project: org.qi4j.sample.dci-cargo
Project: org.qi4j.sample.dci-cargo.dcisample_a
Project: org.qi4j.sample.dci-cargo.dcisample_b
Project: org.qi4j.sample.forum
Project: org.qi4j.sample.rental
Project: org.qi4j.sample.sql-support
Project: org.qi4j.sample.swing
Project: org.qi4j.tools
Project: org.qi4j.tool.model-detail
Project: org.qi4j.tool.envisage
Project: org.qi4j.tool.shell
Project: org.qi4j.tutorials
Project: org.qi4j.tutorial.cargo
Project: org.qi4j.tutorial.composites
Project: org.qi4j.tutorial.hello
Project: org.qi4j.tutorial.introduction
Project: org.qi4j.tutorial.introduction.twominutes
Project: org.qi4j.tutorial.introduction.tenminutes
Project: org.qi4j.tutorial.introduction.thirtyminutes
Project: org.qi4j.tutorial.services
Project: org.qi4j.tests
Project: org.qi4j.test.regression
Project: org.qi4j.test.performance
:qi4j-sdk-2.1-SNAPSHOT:download
:checkBinDist_goOfflineMaven
+ Error stacktraces are turned on.
[ERROR] BUILD ERROR
:checkBinDist_goOfflineMaven FAILED

FAILURE: Build failed with an exception.

* What went wrong:
Execution failed for task ':checkBinDist_goOfflineMaven'.
> Process 'command 'mvn'' finished with non-zero exit value 1

* Try:
Run with --info or --debug option to get more log output.

* Exception is:
org.gradle.api.tasks.TaskExecutionException: Execution failed for task ':checkBinDist_goOfflineMaven'.
	at org.gradle.api.internal.tasks.execution.ExecuteActionsTaskExecuter.executeActions(ExecuteActionsTaskExecuter.java:69)
	at org.gradle.api.internal.tasks.execution.ExecuteActionsTaskExecuter.execute(ExecuteActionsTaskExecuter.java:46)
	at org.gradle.api.internal.tasks.execution.PostExecutionAnalysisTaskExecuter.execute(PostExecutionAnalysisTaskExecuter.java:35)
	at org.gradle.api.internal.tasks.execution.SkipUpToDateTaskExecuter.execute(SkipUpToDateTaskExecuter.java:64)
	at org.gradle.api.internal.tasks.execution.ValidatingTaskExecuter.execute(ValidatingTaskExecuter.java:58)
	at org.gradle.api.internal.tasks.execution.SkipEmptySourceFilesTaskExecuter.execute(SkipEmptySourceFilesTaskExecuter.java:52)
	at org.gradle.api.internal.tasks.execution.SkipTaskWithNoActionsExecuter.execute(SkipTaskWithNoActionsExecuter.java:52)
	at org.gradle.api.internal.tasks.execution.SkipOnlyIfTaskExecuter.execute(SkipOnlyIfTaskExecuter.java:53)
	at org.gradle.api.internal.tasks.execution.ExecuteAtMostOnceTaskExecuter.execute(ExecuteAtMostOnceTaskExecuter.java:43)
	at org.gradle.execution.taskgraph.DefaultTaskGraphExecuter$EventFiringTaskWorker.execute(DefaultTaskGraphExecuter.java:208)
	at org.gradle.execution.taskgraph.DefaultTaskGraphExecuter$EventFiringTaskWorker.execute(DefaultTaskGraphExecuter.java:186)
	at org.gradle.execution.taskgraph.AbstractTaskPlanExecutor$TaskExecutorWorker.processTask(AbstractTaskPlanExecutor.java:62)
	at org.gradle.execution.taskgraph.AbstractTaskPlanExecutor$TaskExecutorWorker.run(AbstractTaskPlanExecutor.java:50)
	at org.gradle.execution.taskgraph.DefaultTaskPlanExecutor.process(DefaultTaskPlanExecutor.java:25)
	at org.gradle.execution.taskgraph.DefaultTaskGraphExecuter.execute(DefaultTaskGraphExecuter.java:111)
	at org.gradle.execution.SelectedTaskExecutionAction.execute(SelectedTaskExecutionAction.java:37)
	at org.gradle.execution.DefaultBuildExecuter.execute(DefaultBuildExecuter.java:62)
	at org.gradle.execution.DefaultBuildExecuter.access$200(DefaultBuildExecuter.java:23)
	at org.gradle.execution.DefaultBuildExecuter$2.proceed(DefaultBuildExecuter.java:68)
	at org.gradle.execution.DryRunBuildExecutionAction.execute(DryRunBuildExecutionAction.java:32)
	at org.gradle.execution.DefaultBuildExecuter.execute(DefaultBuildExecuter.java:62)
	at org.gradle.execution.DefaultBuildExecuter.execute(DefaultBuildExecuter.java:55)
	at org.gradle.initialization.DefaultGradleLauncher$6.run(DefaultGradleLauncher.java:174)
	at org.gradle.internal.Factories$1.create(Factories.java:22)
	at org.gradle.internal.progress.DefaultBuildOperationExecutor.run(DefaultBuildOperationExecutor.java:62)
	at org.gradle.internal.progress.DefaultBuildOperationExecutor.run(DefaultBuildOperationExecutor.java:47)
	at org.gradle.initialization.DefaultGradleLauncher.runBuildOperation(DefaultGradleLauncher.java:189)
	at org.gradle.initialization.DefaultGradleLauncher.doBuildStages(DefaultGradleLauncher.java:171)
	at org.gradle.initialization.DefaultGradleLauncher.access$200(DefaultGradleLauncher.java:35)
	at org.gradle.initialization.DefaultGradleLauncher$1.create(DefaultGradleLauncher.java:104)
	at org.gradle.initialization.DefaultGradleLauncher$1.create(DefaultGradleLauncher.java:97)
	at org.gradle.internal.progress.DefaultBuildOperationExecutor.run(DefaultBuildOperationExecutor.java:62)
	at org.gradle.initialization.DefaultGradleLauncher.runRootBuildOperation(DefaultGradleLauncher.java:184)
	at org.gradle.initialization.DefaultGradleLauncher.doBuild(DefaultGradleLauncher.java:97)
	at org.gradle.initialization.DefaultGradleLauncher.run(DefaultGradleLauncher.java:86)
	at org.gradle.launcher.exec.InProcessBuildActionExecuter$DefaultBuildController.run(InProcessBuildActionExecuter.java:93)
	at org.gradle.tooling.internal.provider.ExecuteBuildActionRunner.run(ExecuteBuildActionRunner.java:28)
	at org.gradle.launcher.exec.ChainingBuildActionRunner.run(ChainingBuildActionRunner.java:35)
	at org.gradle.launcher.exec.InProcessBuildActionExecuter.execute(InProcessBuildActionExecuter.java:43)
	at org.gradle.launcher.exec.InProcessBuildActionExecuter.execute(InProcessBuildActionExecuter.java:27)
	at org.gradle.launcher.exec.ContinuousBuildActionExecuter.execute(ContinuousBuildActionExecuter.java:72)
	at org.gradle.launcher.exec.ContinuousBuildActionExecuter.execute(ContinuousBuildActionExecuter.java:44)
	at org.gradle.launcher.exec.DaemonUsageSuggestingBuildActionExecuter.execute(DaemonUsageSuggestingBuildActionExecuter.java:50)
	at org.gradle.launcher.exec.DaemonUsageSuggestingBuildActionExecuter.execute(DaemonUsageSuggestingBuildActionExecuter.java:27)
	at org.gradle.launcher.cli.RunBuildAction.run(RunBuildAction.java:40)
	at org.gradle.internal.Actions$RunnableActionAdapter.execute(Actions.java:170)
	at org.gradle.launcher.cli.CommandLineActionFactory$ParseAndBuildAction.execute(CommandLineActionFactory.java:237)
	at org.gradle.launcher.cli.CommandLineActionFactory$ParseAndBuildAction.execute(CommandLineActionFactory.java:210)
	at org.gradle.launcher.cli.JavaRuntimeValidationAction.execute(JavaRuntimeValidationAction.java:35)
	at org.gradle.launcher.cli.JavaRuntimeValidationAction.execute(JavaRuntimeValidationAction.java:24)
	at org.gradle.launcher.cli.CommandLineActionFactory$WithLogging.execute(CommandLineActionFactory.java:206)
	at org.gradle.launcher.cli.CommandLineActionFactory$WithLogging.execute(CommandLineActionFactory.java:169)
	at org.gradle.launcher.cli.ExceptionReportingAction.execute(ExceptionReportingAction.java:33)
	at org.gradle.launcher.cli.ExceptionReportingAction.execute(ExceptionReportingAction.java:22)
	at org.gradle.launcher.Main.doAction(Main.java:33)
	at org.gradle.launcher.bootstrap.EntryPoint.run(EntryPoint.java:45)
	at org.gradle.launcher.bootstrap.ProcessBootstrap.runNoExit(ProcessBootstrap.java:54)
	at org.gradle.launcher.bootstrap.ProcessBootstrap.run(ProcessBootstrap.java:35)
	at org.gradle.launcher.GradleMain.main(GradleMain.java:23)
	at org.gradle.wrapper.BootstrapMainStarter.start(BootstrapMainStarter.java:30)
	at org.gradle.wrapper.WrapperExecutor.execute(WrapperExecutor.java:127)
	at org.gradle.wrapper.GradleWrapperMain.main(GradleWrapperMain.java:55)
Caused by: org.gradle.process.internal.ExecException: Process 'command 'mvn'' finished with
non-zero exit value 1
	at org.gradle.process.internal.DefaultExecHandle$ExecResultImpl.assertNormalExitValue(DefaultExecHandle.java:366)
	at org.gradle.process.internal.DefaultExecAction.execute(DefaultExecAction.java:31)
	at org.gradle.api.tasks.AbstractExecTask.exec(AbstractExecTask.java:54)
	at org.gradle.internal.reflect.JavaMethod.invoke(JavaMethod.java:75)
	at org.gradle.api.internal.project.taskfactory.AnnotationProcessingTaskFactory$StandardTaskAction.doExecute(AnnotationProcessingTaskFactory.java:226)
	at org.gradle.api.internal.project.taskfactory.AnnotationProcessingTaskFactory$StandardTaskAction.execute(AnnotationProcessingTaskFactory.java:219)
	at org.gradle.api.internal.project.taskfactory.AnnotationProcessingTaskFactory$StandardTaskAction.execute(AnnotationProcessingTaskFactory.java:208)
	at org.gradle.api.internal.AbstractTask$TaskActionWrapper.execute(AbstractTask.java:585)
	at org.gradle.api.internal.AbstractTask$TaskActionWrapper.execute(AbstractTask.java:568)
	at org.gradle.api.internal.tasks.execution.ExecuteActionsTaskExecuter.executeAction(ExecuteActionsTaskExecuter.java:80)
	at org.gradle.api.internal.tasks.execution.ExecuteActionsTaskExecuter.executeActions(ExecuteActionsTaskExecuter.java:61)
	... 61 more


BUILD FAILED

Total time: 14 mins 19.152 secs
Build step 'Invoke Gradle script' changed build result to FAILURE
Build step 'Invoke Gradle script' marked build as failure
Xvfb stopping
Archiving artifacts
Sending artifact delta relative to Zest - Check 2.1-SNAPSHOT distributions from develop branch
on Java7 (Oracle JDK) #22
Archived 4 artifacts
Archive block size is 32768
Received 10 blocks and 36501327 bytes
Compression is 0.9%
Took 8.3 sec
Recording test results
Publishing Javadoc

Mime
View raw message