polygene-dev mailing list archives

Site index · List index
Message view « Date » · « Thread »
Top « Date » · « Thread »
From Apache Jenkins Server <jenk...@builds.apache.org>
Subject Build failed in Jenkins: Zest - Check 2.1-SNAPSHOT distributions from develop branch on Java7 (Oracle JDK) #26
Date Fri, 17 Jul 2015 19:10:14 GMT
See <https://builds.apache.org/job/Zest%20-%20Check%202.1-SNAPSHOT%20distributions%20from%20develop%20branch%20on%20Java7%20(Oracle%20JDK)/26/changes>

Changes:

[hedmann] NamedAssociations missing in equals() and hashCode()

[hedmann] And equals/hashCode is needed for the NamedAssociationValueState as well.

[hedmann] Introducing @Serialization annotations to mark Property methods on which variant
should be used.

[hedmann] More missing stuff for hashCode/equals of NamedAssociation.

[hedmann] Testcase for NamedAssociation equals/hashCode

------------------------------------------
[...truncated 4761 lines...]
:org.qi4j:org.qi4j.libraries:org.qi4j.library.jmx:honkerCheck
:org.qi4j:org.qi4j.libraries:org.qi4j.library.jmx:check
:org.qi4j:org.qi4j.libraries:org.qi4j.library.lang-groovy:honkerCheck
:org.qi4j:org.qi4j.libraries:org.qi4j.library.lang-groovy:check
:org.qi4j:org.qi4j.libraries:org.qi4j.library.lang-javascript:honkerCheck
:org.qi4j:org.qi4j.libraries:org.qi4j.library.lang-javascript:check
:org.qi4j:org.qi4j.libraries:org.qi4j.library.lang-scala:honkerCheck
:org.qi4j:org.qi4j.libraries:org.qi4j.library.lang-scala:check
:org.qi4j:org.qi4j.libraries:org.qi4j.library.locking:honkerCheck
:org.qi4j:org.qi4j.libraries:org.qi4j.library.locking:check
:org.qi4j:org.qi4j.libraries:org.qi4j.library.logging:honkerCheck
:org.qi4j:org.qi4j.libraries:org.qi4j.library.logging:check
:org.qi4j:org.qi4j.libraries:org.qi4j.library.metrics:honkerCheck
:org.qi4j:org.qi4j.libraries:org.qi4j.library.metrics:check
:org.qi4j:org.qi4j.libraries:org.qi4j.library.osgi:honkerCheck
:org.qi4j:org.qi4j.libraries:org.qi4j.library.osgi:check
:org.qi4j:org.qi4j.libraries:org.qi4j.library.rdf:honkerCheck
:org.qi4j:org.qi4j.libraries:org.qi4j.library.rdf:check
:org.qi4j:org.qi4j.libraries:org.qi4j.library.rest:honkerCheck
:org.qi4j:org.qi4j.libraries:org.qi4j.library.rest:check
:org.qi4j:org.qi4j.libraries:org.qi4j.library.rest-client:honkerCheck
:org.qi4j:org.qi4j.libraries:org.qi4j.library.rest-client:check
:org.qi4j:org.qi4j.libraries:org.qi4j.library.rest-common:honkerCheck
:org.qi4j:org.qi4j.libraries:org.qi4j.library.rest-common:check
:org.qi4j:org.qi4j.libraries:org.qi4j.library.rest-server:honkerCheck
:org.qi4j:org.qi4j.libraries:org.qi4j.library.rest-server:check
:org.qi4j:org.qi4j.libraries:org.qi4j.library.scheduler:honkerCheck
:org.qi4j:org.qi4j.libraries:org.qi4j.library.scheduler:check
:org.qi4j:org.qi4j.libraries:org.qi4j.library.scripting:honkerCheck
:org.qi4j:org.qi4j.libraries:org.qi4j.library.scripting:check
:org.qi4j:org.qi4j.libraries:org.qi4j.library.servlet:honkerCheck
:org.qi4j:org.qi4j.libraries:org.qi4j.library.servlet:check
:org.qi4j:org.qi4j.libraries:org.qi4j.library.shiro-core:honkerCheck
:org.qi4j:org.qi4j.libraries:org.qi4j.library.shiro-core:check
:org.qi4j:org.qi4j.libraries:org.qi4j.library.shiro-web:honkerCheck
:org.qi4j:org.qi4j.libraries:org.qi4j.library.shiro-web:check
:org.qi4j:org.qi4j.libraries:org.qi4j.library.spring:honkerCheck
:org.qi4j:org.qi4j.libraries:org.qi4j.library.spring:check
:org.qi4j:org.qi4j.libraries:org.qi4j.library.sql:honkerCheck
:org.qi4j:org.qi4j.libraries:org.qi4j.library.sql:check
:org.qi4j:org.qi4j.libraries:org.qi4j.library.sql-bonecp:honkerCheck
:org.qi4j:org.qi4j.libraries:org.qi4j.library.sql-bonecp:check
:org.qi4j:org.qi4j.libraries:org.qi4j.library.sql-dbcp:honkerCheck
:org.qi4j:org.qi4j.libraries:org.qi4j.library.sql-dbcp:check
:org.qi4j:org.qi4j.libraries:org.qi4j.library.sql-liquibase:honkerCheck
:org.qi4j:org.qi4j.libraries:org.qi4j.library.sql-liquibase:check
:org.qi4j:org.qi4j.libraries:org.qi4j.library.uid:honkerCheck
:org.qi4j:org.qi4j.libraries:org.qi4j.library.uid:check
:org.qi4j:org.qi4j.libraries:org.qi4j.library.uowfile:honkerCheck
:org.qi4j:org.qi4j.libraries:org.qi4j.library.uowfile:check
:org.qi4j:org.qi4j.samples:org.qi4j.sample.dci:honkerCheck
:org.qi4j:org.qi4j.samples:org.qi4j.sample.dci:check
:org.qi4j:org.qi4j.samples:org.qi4j.sample.dci-cargo:honkerCheck
:org.qi4j:org.qi4j.samples:org.qi4j.sample.dci-cargo:check
:org.qi4j:org.qi4j.samples:org.qi4j.sample.forum:honkerCheck
:org.qi4j:org.qi4j.samples:org.qi4j.sample.forum:check
:org.qi4j:org.qi4j.samples:org.qi4j.sample.rental:honkerCheck
:org.qi4j:org.qi4j.samples:org.qi4j.sample.rental:check
:org.qi4j:org.qi4j.samples:org.qi4j.sample.sql-support:honkerCheck
:org.qi4j:org.qi4j.samples:org.qi4j.sample.sql-support:check
:org.qi4j:org.qi4j.samples:org.qi4j.sample.swing:honkerCheck
:org.qi4j:org.qi4j.samples:org.qi4j.sample.swing:check
:org.qi4j:org.qi4j.extensions:org.qi4j.extension.cache-ehcache:processVersionResources UP-TO-DATE
:org.qi4j:org.qi4j.extensions:org.qi4j.extension.cache-ehcache:versionClasses
:org.qi4j:org.qi4j.extensions:org.qi4j.extension.cache-ehcache:jar
:org.qi4j:org.qi4j.extensions:org.qi4j.extension.entitystore-memory:processVersionResources
UP-TO-DATE
:org.qi4j:org.qi4j.extensions:org.qi4j.extension.entitystore-memory:versionClasses
:org.qi4j:org.qi4j.extensions:org.qi4j.extension.entitystore-memory:jar
:org.qi4j:org.qi4j.tests:org.qi4j.test.performance:compilePerfJava
:org.qi4j:org.qi4j.tests:org.qi4j.test.performance:honkerCheck
:org.qi4j:org.qi4j.tests:org.qi4j.test.performance:check
:org.qi4j:org.qi4j.tests:org.qi4j.test.regression:honkerCheck
:org.qi4j:org.qi4j.tests:org.qi4j.test.regression:check
:org.qi4j:org.qi4j.tools:org.qi4j.tool.envisage:honkerCheck
:org.qi4j:org.qi4j.tools:org.qi4j.tool.envisage:check
:org.qi4j:org.qi4j.tools:org.qi4j.tool.model-detail:honkerCheck
:org.qi4j:org.qi4j.tools:org.qi4j.tool.model-detail:check
:org.qi4j:org.qi4j.tutorials:org.qi4j.tutorial.cargo:honkerCheck
:org.qi4j:org.qi4j.tutorials:org.qi4j.tutorial.cargo:check
:org.qi4j:org.qi4j.tutorials:org.qi4j.tutorial.composites:honkerCheck
:org.qi4j:org.qi4j.tutorials:org.qi4j.tutorial.composites:check
:org.qi4j:org.qi4j.tutorials:org.qi4j.tutorial.hello:honkerCheck
:org.qi4j:org.qi4j.tutorials:org.qi4j.tutorial.hello:check
:org.qi4j:org.qi4j.tutorials:org.qi4j.tutorial.introduction:honkerCheck
:org.qi4j:org.qi4j.tutorials:org.qi4j.tutorial.introduction:check
:org.qi4j:org.qi4j.tutorials:org.qi4j.tutorial.services:honkerCheck
:org.qi4j:org.qi4j.tutorials:org.qi4j.tutorial.services:check
:org.qi4j:org.qi4j.samples:org.qi4j.sample.dci-cargo:org.qi4j.sample.dci-cargo.dcisample_a:honkerCheck
:org.qi4j:org.qi4j.samples:org.qi4j.sample.dci-cargo:org.qi4j.sample.dci-cargo.dcisample_a:check
:org.qi4j:org.qi4j.samples:org.qi4j.sample.dci-cargo:org.qi4j.sample.dci-cargo.dcisample_b:honkerCheck
:org.qi4j:org.qi4j.samples:org.qi4j.sample.dci-cargo:org.qi4j.sample.dci-cargo.dcisample_b:check
:org.qi4j:org.qi4j.tutorials:org.qi4j.tutorial.introduction:org.qi4j.tutorial.introduction.tenminutes:honkerCheck
:org.qi4j:org.qi4j.tutorials:org.qi4j.tutorial.introduction:org.qi4j.tutorial.introduction.tenminutes:check
:org.qi4j:org.qi4j.tutorials:org.qi4j.tutorial.introduction:org.qi4j.tutorial.introduction.thirtyminutes:honkerCheck
:org.qi4j:org.qi4j.tutorials:org.qi4j.tutorial.introduction:org.qi4j.tutorial.introduction.thirtyminutes:check
:org.qi4j:org.qi4j.tutorials:org.qi4j.tutorial.introduction:org.qi4j.tutorial.introduction.twominutes:honkerCheck
:org.qi4j:org.qi4j.tutorials:org.qi4j.tutorial.introduction:org.qi4j.tutorial.introduction.twominutes:check

Test failures in:
  org.qi4j.extension.valueserialization-jackson
  org.qi4j.extension.valueserialization-orgjson
  org.qi4j.extension.valueserialization-stax

:org.qi4j:org.qi4j.tutorials:org.qi4j.tutorial.introduction:org.qi4j.tutorial.introduction.twominutes:check
FAILED
:checkSrcDist FAILED

FAILURE: Build failed with an exception.

* Where:
Build file '<https://builds.apache.org/job/Zest%20-%20Check%202.1-SNAPSHOT%20distributions%20from%20develop%20branch%20on%20Java7%20(Oracle%20JDK)/ws/build/unpacked-distributions/src/qi4j-sdk-2.1-SNAPSHOT/build.gradle'>
line: 439

* What went wrong:
Execution failed for task ':org.qi4j.tutorials:org.qi4j.tutorial.introduction:org.qi4j.tutorial.introduction.twominutes:check'.
> There was TEST FAILURES!! See list above.

* Try:
Run with --info or --debug option to get more log output.

* Exception is:
org.gradle.api.tasks.TaskExecutionException: Execution failed for task ':org.qi4j.tutorials:org.qi4j.tutorial.introduction:org.qi4j.tutorial.introduction.twominutes:check'.
	at org.gradle.api.internal.tasks.execution.ExecuteActionsTaskExecuter.executeActions(ExecuteActionsTaskExecuter.java:69)
	at org.gradle.api.internal.tasks.execution.ExecuteActionsTaskExecuter.execute(ExecuteActionsTaskExecuter.java:46)
	at org.gradle.api.internal.tasks.execution.PostExecutionAnalysisTaskExecuter.execute(PostExecutionAnalysisTaskExecuter.java:35)
	at org.gradle.api.internal.tasks.execution.SkipUpToDateTaskExecuter.execute(SkipUpToDateTaskExecuter.java:64)
	at org.gradle.api.internal.tasks.execution.ValidatingTaskExecuter.execute(ValidatingTaskExecuter.java:58)
	at org.gradle.api.internal.tasks.execution.SkipEmptySourceFilesTaskExecuter.execute(SkipEmptySourceFilesTaskExecuter.java:52)
	at org.gradle.api.internal.tasks.execution.SkipTaskWithNoActionsExecuter.execute(SkipTaskWithNoActionsExecuter.java:52)
	at org.gradle.api.internal.tasks.execution.SkipOnlyIfTaskExecuter.execute(SkipOnlyIfTaskExecuter.java:53)
	at org.gradle.api.internal.tasks.execution.ExecuteAtMostOnceTaskExecuter.execute(ExecuteAtMostOnceTaskExecuter.java:43)
	at org.gradle.execution.taskgraph.DefaultTaskGraphExecuter$EventFiringTaskWorker.execute(DefaultTaskGraphExecuter.java:208)
	at org.gradle.execution.taskgraph.DefaultTaskGraphExecuter$EventFiringTaskWorker.execute(DefaultTaskGraphExecuter.java:186)
	at org.gradle.execution.taskgraph.AbstractTaskPlanExecutor$TaskExecutorWorker.processTask(AbstractTaskPlanExecutor.java:62)
	at org.gradle.execution.taskgraph.AbstractTaskPlanExecutor$TaskExecutorWorker.run(AbstractTaskPlanExecutor.java:50)
	at org.gradle.execution.taskgraph.DefaultTaskPlanExecutor.process(DefaultTaskPlanExecutor.java:25)
	at org.gradle.execution.taskgraph.DefaultTaskGraphExecuter.execute(DefaultTaskGraphExecuter.java:111)
	at org.gradle.execution.SelectedTaskExecutionAction.execute(SelectedTaskExecutionAction.java:37)
	at org.gradle.execution.DefaultBuildExecuter.execute(DefaultBuildExecuter.java:62)
	at org.gradle.execution.DefaultBuildExecuter.access$200(DefaultBuildExecuter.java:23)
	at org.gradle.execution.DefaultBuildExecuter$2.proceed(DefaultBuildExecuter.java:68)
	at org.gradle.execution.DryRunBuildExecutionAction.execute(DryRunBuildExecutionAction.java:32)
	at org.gradle.execution.DefaultBuildExecuter.execute(DefaultBuildExecuter.java:62)
	at org.gradle.execution.DefaultBuildExecuter.execute(DefaultBuildExecuter.java:55)
	at org.gradle.initialization.DefaultGradleLauncher$6.run(DefaultGradleLauncher.java:174)
	at org.gradle.internal.Factories$1.create(Factories.java:22)
	at org.gradle.internal.progress.DefaultBuildOperationExecutor.run(DefaultBuildOperationExecutor.java:62)
	at org.gradle.internal.progress.DefaultBuildOperationExecutor.run(DefaultBuildOperationExecutor.java:47)
	at org.gradle.initialization.DefaultGradleLauncher.runBuildOperation(DefaultGradleLauncher.java:189)
	at org.gradle.initialization.DefaultGradleLauncher.doBuildStages(DefaultGradleLauncher.java:171)
	at org.gradle.initialization.DefaultGradleLauncher.access$200(DefaultGradleLauncher.java:35)
	at org.gradle.initialization.DefaultGradleLauncher$1.create(DefaultGradleLauncher.java:104)
	at org.gradle.initialization.DefaultGradleLauncher$1.create(DefaultGradleLauncher.java:97)
	at org.gradle.internal.progress.DefaultBuildOperationExecutor.run(DefaultBuildOperationExecutor.java:62)
	at org.gradle.initialization.DefaultGradleLauncher.runRootBuildOperation(DefaultGradleLauncher.java:184)
	at org.gradle.initialization.DefaultGradleLauncher.doBuild(DefaultGradleLauncher.java:97)
	at org.gradle.initialization.DefaultGradleLauncher.run(DefaultGradleLauncher.java:86)
	at org.gradle.api.tasks.GradleBuild.build(GradleBuild.java:117)
	at org.gradle.internal.reflect.JavaMethod.invoke(JavaMethod.java:75)
	at org.gradle.api.internal.project.taskfactory.AnnotationProcessingTaskFactory$StandardTaskAction.doExecute(AnnotationProcessingTaskFactory.java:226)
	at org.gradle.api.internal.project.taskfactory.AnnotationProcessingTaskFactory$StandardTaskAction.execute(AnnotationProcessingTaskFactory.java:219)
	at org.gradle.api.internal.project.taskfactory.AnnotationProcessingTaskFactory$StandardTaskAction.execute(AnnotationProcessingTaskFactory.java:208)
	at org.gradle.api.internal.AbstractTask$TaskActionWrapper.execute(AbstractTask.java:585)
	at org.gradle.api.internal.AbstractTask$TaskActionWrapper.execute(AbstractTask.java:568)
	at org.gradle.api.internal.tasks.execution.ExecuteActionsTaskExecuter.executeAction(ExecuteActionsTaskExecuter.java:80)
	at org.gradle.api.internal.tasks.execution.ExecuteActionsTaskExecuter.executeActions(ExecuteActionsTaskExecuter.java:61)
	at org.gradle.api.internal.tasks.execution.ExecuteActionsTaskExecuter.execute(ExecuteActionsTaskExecuter.java:46)
	at org.gradle.api.internal.tasks.execution.PostExecutionAnalysisTaskExecuter.execute(PostExecutionAnalysisTaskExecuter.java:35)
	at org.gradle.api.internal.tasks.execution.SkipUpToDateTaskExecuter.execute(SkipUpToDateTaskExecuter.java:64)
	at org.gradle.api.internal.tasks.execution.ValidatingTaskExecuter.execute(ValidatingTaskExecuter.java:58)
	at org.gradle.api.internal.tasks.execution.SkipEmptySourceFilesTaskExecuter.execute(SkipEmptySourceFilesTaskExecuter.java:52)
	at org.gradle.api.internal.tasks.execution.SkipTaskWithNoActionsExecuter.execute(SkipTaskWithNoActionsExecuter.java:52)
	at org.gradle.api.internal.tasks.execution.SkipOnlyIfTaskExecuter.execute(SkipOnlyIfTaskExecuter.java:53)
	at org.gradle.api.internal.tasks.execution.ExecuteAtMostOnceTaskExecuter.execute(ExecuteAtMostOnceTaskExecuter.java:43)
	at org.gradle.execution.taskgraph.DefaultTaskGraphExecuter$EventFiringTaskWorker.execute(DefaultTaskGraphExecuter.java:208)
	at org.gradle.execution.taskgraph.DefaultTaskGraphExecuter$EventFiringTaskWorker.execute(DefaultTaskGraphExecuter.java:186)
	at org.gradle.execution.taskgraph.AbstractTaskPlanExecutor$TaskExecutorWorker.processTask(AbstractTaskPlanExecutor.java:62)
	at org.gradle.execution.taskgraph.AbstractTaskPlanExecutor$TaskExecutorWorker.run(AbstractTaskPlanExecutor.java:50)
	at org.gradle.execution.taskgraph.DefaultTaskPlanExecutor.process(DefaultTaskPlanExecutor.java:25)
	at org.gradle.execution.taskgraph.DefaultTaskGraphExecuter.execute(DefaultTaskGraphExecuter.java:111)
	at org.gradle.execution.SelectedTaskExecutionAction.execute(SelectedTaskExecutionAction.java:37)
	at org.gradle.execution.DefaultBuildExecuter.execute(DefaultBuildExecuter.java:62)
	at org.gradle.execution.DefaultBuildExecuter.access$200(DefaultBuildExecuter.java:23)
	at org.gradle.execution.DefaultBuildExecuter$2.proceed(DefaultBuildExecuter.java:68)
	at org.gradle.execution.DryRunBuildExecutionAction.execute(DryRunBuildExecutionAction.java:32)
	at org.gradle.execution.DefaultBuildExecuter.execute(DefaultBuildExecuter.java:62)
	at org.gradle.execution.DefaultBuildExecuter.execute(DefaultBuildExecuter.java:55)
	at org.gradle.initialization.DefaultGradleLauncher$6.run(DefaultGradleLauncher.java:174)
	at org.gradle.internal.Factories$1.create(Factories.java:22)
	at org.gradle.internal.progress.DefaultBuildOperationExecutor.run(DefaultBuildOperationExecutor.java:62)
	at org.gradle.internal.progress.DefaultBuildOperationExecutor.run(DefaultBuildOperationExecutor.java:47)
	at org.gradle.initialization.DefaultGradleLauncher.runBuildOperation(DefaultGradleLauncher.java:189)
	at org.gradle.initialization.DefaultGradleLauncher.doBuildStages(DefaultGradleLauncher.java:171)
	at org.gradle.initialization.DefaultGradleLauncher.access$200(DefaultGradleLauncher.java:35)
	at org.gradle.initialization.DefaultGradleLauncher$1.create(DefaultGradleLauncher.java:104)
	at org.gradle.initialization.DefaultGradleLauncher$1.create(DefaultGradleLauncher.java:97)
	at org.gradle.internal.progress.DefaultBuildOperationExecutor.run(DefaultBuildOperationExecutor.java:62)
	at org.gradle.initialization.DefaultGradleLauncher.runRootBuildOperation(DefaultGradleLauncher.java:184)
	at org.gradle.initialization.DefaultGradleLauncher.doBuild(DefaultGradleLauncher.java:97)
	at org.gradle.initialization.DefaultGradleLauncher.run(DefaultGradleLauncher.java:86)
	at org.gradle.launcher.exec.InProcessBuildActionExecuter$DefaultBuildController.run(InProcessBuildActionExecuter.java:93)
	at org.gradle.tooling.internal.provider.ExecuteBuildActionRunner.run(ExecuteBuildActionRunner.java:28)
	at org.gradle.launcher.exec.ChainingBuildActionRunner.run(ChainingBuildActionRunner.java:35)
	at org.gradle.launcher.exec.InProcessBuildActionExecuter.execute(InProcessBuildActionExecuter.java:43)
	at org.gradle.launcher.exec.InProcessBuildActionExecuter.execute(InProcessBuildActionExecuter.java:27)
	at org.gradle.launcher.exec.ContinuousBuildActionExecuter.execute(ContinuousBuildActionExecuter.java:72)
	at org.gradle.launcher.exec.ContinuousBuildActionExecuter.execute(ContinuousBuildActionExecuter.java:44)
	at org.gradle.launcher.exec.DaemonUsageSuggestingBuildActionExecuter.execute(DaemonUsageSuggestingBuildActionExecuter.java:50)
	at org.gradle.launcher.exec.DaemonUsageSuggestingBuildActionExecuter.execute(DaemonUsageSuggestingBuildActionExecuter.java:27)
	at org.gradle.launcher.cli.RunBuildAction.run(RunBuildAction.java:40)
	at org.gradle.internal.Actions$RunnableActionAdapter.execute(Actions.java:170)
	at org.gradle.launcher.cli.CommandLineActionFactory$ParseAndBuildAction.execute(CommandLineActionFactory.java:237)
	at org.gradle.launcher.cli.CommandLineActionFactory$ParseAndBuildAction.execute(CommandLineActionFactory.java:210)
	at org.gradle.launcher.cli.JavaRuntimeValidationAction.execute(JavaRuntimeValidationAction.java:35)
	at org.gradle.launcher.cli.JavaRuntimeValidationAction.execute(JavaRuntimeValidationAction.java:24)
	at org.gradle.launcher.cli.CommandLineActionFactory$WithLogging.execute(CommandLineActionFactory.java:206)
	at org.gradle.launcher.cli.CommandLineActionFactory$WithLogging.execute(CommandLineActionFactory.java:169)
	at org.gradle.launcher.cli.ExceptionReportingAction.execute(ExceptionReportingAction.java:33)
	at org.gradle.launcher.cli.ExceptionReportingAction.execute(ExceptionReportingAction.java:22)
	at org.gradle.launcher.Main.doAction(Main.java:33)
	at org.gradle.launcher.bootstrap.EntryPoint.run(EntryPoint.java:45)
	at org.gradle.launcher.bootstrap.ProcessBootstrap.runNoExit(ProcessBootstrap.java:54)
	at org.gradle.launcher.bootstrap.ProcessBootstrap.run(ProcessBootstrap.java:35)
	at org.gradle.launcher.GradleMain.main(GradleMain.java:23)
	at org.gradle.wrapper.BootstrapMainStarter.start(BootstrapMainStarter.java:30)
	at org.gradle.wrapper.WrapperExecutor.execute(WrapperExecutor.java:127)
	at org.gradle.wrapper.GradleWrapperMain.main(GradleWrapperMain.java:55)
Caused by: java.lang.RuntimeException: There was TEST FAILURES!! See list above.
	at build_9egk367izfjjtkef8fmqjlih$_run_closure7_closure93.doCall(<https://builds.apache.org/job/Zest%20-%20Check%202.1-SNAPSHOT%20distributions%20from%20develop%20branch%20on%20Java7%20(Oracle%20JDK)/ws/build/unpacked-distributions/src/qi4j-sdk-2.1-SNAPSHOT/build.gradle>:439)
	at org.gradle.api.internal.AbstractTask$ClosureTaskAction.execute(AbstractTask.java:554)
	at org.gradle.api.internal.AbstractTask$ClosureTaskAction.execute(AbstractTask.java:535)
	at org.gradle.api.internal.tasks.execution.ExecuteActionsTaskExecuter.executeAction(ExecuteActionsTaskExecuter.java:80)
	at org.gradle.api.internal.tasks.execution.ExecuteActionsTaskExecuter.executeActions(ExecuteActionsTaskExecuter.java:61)
	... 104 more


BUILD FAILED

Total time: 31 mins 49.334 secs
Build step 'Invoke Gradle script' changed build result to FAILURE
Build step 'Invoke Gradle script' marked build as failure
Xvfb stopping
Archiving artifacts
Sending artifact delta relative to Zest - Check 2.1-SNAPSHOT distributions from develop branch
on Java7 (Oracle JDK) #25
Archived 4 artifacts
Archive block size is 32768
Received 5 blocks and 36383603 bytes
Compression is 0.4%
Took 11 sec
Recording test results
Publishing Javadoc

Mime
View raw message