polygene-dev mailing list archives

Site index · List index
Message view « Date » · « Thread »
Top « Date » · « Thread »
From Apache Jenkins Server <jenk...@builds.apache.org>
Subject Build failed in Jenkins: Zest - Check 2.1-SNAPSHOT distributions from develop branch on Java8 (OpenJDK) #15
Date Wed, 22 Jul 2015 00:23:45 GMT
See <https://builds.apache.org/job/Zest%20-%20Check%202.1-SNAPSHOT%20distributions%20from%20develop%20branch%20on%20Java8%20(OpenJDK)/15/changes>

Changes:

[paulmerlin] ZEST-100 Release process documentation draft progress

[paulmerlin] EventSourcing: add missing javadoc package.html

[paulmerlin] Build: minor edits, mostly documentation

[paulmerlin] ZEST-25 Checksum distributions

[paulmerlin] ZEST-25 & ZEST-40 Rename dists form qi4j-sdk-* to apache-zest-java-*

[paulmerlin] ZEST-100 Release process documentation draft progress

------------------------------------------
[...truncated 288 lines...]
:org.qi4j.tutorials:org.qi4j.tutorial.services:clean
:org.qi4j.samples:org.qi4j.sample.dci-cargo:org.qi4j.sample.dci-cargo.dcisample_a:clean
:org.qi4j.samples:org.qi4j.sample.dci-cargo:org.qi4j.sample.dci-cargo.dcisample_b:clean
:org.qi4j.tutorials:org.qi4j.tutorial.introduction:org.qi4j.tutorial.introduction.tenminutes:clean
:org.qi4j.tutorials:org.qi4j.tutorial.introduction:org.qi4j.tutorial.introduction.thirtyminutes:clean
:org.qi4j.tutorials:org.qi4j.tutorial.introduction:org.qi4j.tutorial.introduction.twominutes:clean
:compileJava UP-TO-DATE
:honkerGenDependencies
:honkerGenLicense
:honkerGenNotice
:processResources UP-TO-DATE
:classes
:jar
:honkerCheck
:rat
:org.qi4j.core:compileJava UP-TO-DATE
:org.qi4j.core:honkerGenDependencies
:org.qi4j.core:honkerGenLicense
:org.qi4j.core:honkerGenNotice
:org.qi4j.core:processResources UP-TO-DATE
:org.qi4j.core:classes
:org.qi4j.core:compileTestJava UP-TO-DATE
:org.qi4j.core:processTestResources UP-TO-DATE
:org.qi4j.core:testClasses UP-TO-DATE
:org.qi4j.core:test UP-TO-DATE
:org.qi4j.extensions:compileJava UP-TO-DATE
:org.qi4j.extensions:honkerGenDependencies
:org.qi4j.extensions:honkerGenLicense
:org.qi4j.extensions:honkerGenNotice
:org.qi4j.extensions:processResources UP-TO-DATE
:org.qi4j.extensions:classes
:org.qi4j.extensions:compileTestJava UP-TO-DATE
:org.qi4j.extensions:processTestResources UP-TO-DATE
:org.qi4j.extensions:testClasses UP-TO-DATE
:org.qi4j.extensions:test UP-TO-DATE
:org.qi4j.libraries:compileJava UP-TO-DATE
:org.qi4j.libraries:honkerGenDependencies
:org.qi4j.libraries:honkerGenLicense
:org.qi4j.libraries:honkerGenNotice
:org.qi4j.libraries:processResources UP-TO-DATE
:org.qi4j.libraries:classes
:org.qi4j.libraries:compileTestJava UP-TO-DATE
:org.qi4j.libraries:processTestResources UP-TO-DATE
:org.qi4j.libraries:testClasses UP-TO-DATE
:org.qi4j.libraries:test UP-TO-DATE
:org.qi4j.manual:makeVersionClass
:org.qi4j.manual:compileVersionJava
:org.qi4j.core:org.qi4j.core.api:makeVersionClass
:org.qi4j.core:org.qi4j.core.api:compileVersionJava
:org.qi4j.core:org.qi4j.core.functional:makeVersionClass
:org.qi4j.core:org.qi4j.core.functional:compileVersionJava
:org.qi4j.core:org.qi4j.core.functional:compileJava
:org.qi4j.core:org.qi4j.core.functional:honkerGenDependencies
:org.qi4j.core:org.qi4j.core.functional:honkerGenLicense
:org.qi4j.core:org.qi4j.core.functional:honkerGenNotice
:org.qi4j.core:org.qi4j.core.functional:processResources UP-TO-DATE
:org.qi4j.core:org.qi4j.core.functional:classes
:org.qi4j.core:org.qi4j.core.functional:processVersionResources UP-TO-DATE
:org.qi4j.core:org.qi4j.core.functional:versionClasses
:org.qi4j.core:org.qi4j.core.functional:jar
:org.qi4j.core:org.qi4j.core.io:makeVersionClass
:org.qi4j.core:org.qi4j.core.io:compileVersionJava
:org.qi4j.core:org.qi4j.core.io:compileJava
:org.qi4j.core:org.qi4j.core.io:honkerGenDependencies
:org.qi4j.core:org.qi4j.core.io:honkerGenLicense
:org.qi4j.core:org.qi4j.core.io:honkerGenNotice
:org.qi4j.core:org.qi4j.core.io:processResources UP-TO-DATE
:org.qi4j.core:org.qi4j.core.io:classes
:org.qi4j.core:org.qi4j.core.io:processVersionResources UP-TO-DATE
:org.qi4j.core:org.qi4j.core.io:versionClasses
:org.qi4j.core:org.qi4j.core.io:jar
:org.qi4j.core:org.qi4j.core.api:compileJava
:org.qi4j.core:org.qi4j.core.api:honkerGenDependencies
:org.qi4j.core:org.qi4j.core.api:honkerGenLicense
:org.qi4j.core:org.qi4j.core.api:honkerGenNotice
:org.qi4j.core:org.qi4j.core.api:processResources UP-TO-DATE
:org.qi4j.core:org.qi4j.core.api:classes
:org.qi4j.core:org.qi4j.core.api:processVersionResources UP-TO-DATE
:org.qi4j.core:org.qi4j.core.api:versionClasses
:org.qi4j.core:org.qi4j.core.api:jar
:org.qi4j.core:org.qi4j.core.bootstrap:makeVersionClass
:org.qi4j.core:org.qi4j.core.bootstrap:compileVersionJava
:org.qi4j.core:org.qi4j.core.spi:makeVersionClass
:org.qi4j.core:org.qi4j.core.spi:compileVersionJava
:org.qi4j.core:org.qi4j.core.spi:compileJava
:org.qi4j.core:org.qi4j.core.spi:honkerGenDependencies
:org.qi4j.core:org.qi4j.core.spi:honkerGenLicense
:org.qi4j.core:org.qi4j.core.spi:honkerGenNotice
:org.qi4j.core:org.qi4j.core.spi:processResources UP-TO-DATE
:org.qi4j.core:org.qi4j.core.spi:classes
:org.qi4j.core:org.qi4j.core.spi:processVersionResources UP-TO-DATE
:org.qi4j.core:org.qi4j.core.spi:versionClasses
:org.qi4j.core:org.qi4j.core.spi:jar
:org.qi4j.core:org.qi4j.core.bootstrap:compileJava
:org.qi4j.core:org.qi4j.core.bootstrap:honkerGenDependencies
:org.qi4j.core:org.qi4j.core.bootstrap:honkerGenLicense
:org.qi4j.core:org.qi4j.core.bootstrap:honkerGenNotice
:org.qi4j.core:org.qi4j.core.bootstrap:processResources UP-TO-DATE
:org.qi4j.core:org.qi4j.core.bootstrap:classes
:org.qi4j.core:org.qi4j.core.bootstrap:processVersionResources UP-TO-DATE
:org.qi4j.core:org.qi4j.core.bootstrap:versionClasses
:org.qi4j.core:org.qi4j.core.bootstrap:jar
:org.qi4j.libraries:org.qi4j.library.constraints:makeVersionClass
:org.qi4j.libraries:org.qi4j.library.constraints:compileVersionJava
:org.qi4j.libraries:org.qi4j.library.constraints:compileJava
:org.qi4j.libraries:org.qi4j.library.constraints:honkerGenDependencies
:org.qi4j.libraries:org.qi4j.library.constraints:honkerGenLicense
:org.qi4j.libraries:org.qi4j.library.constraints:honkerGenNotice
:org.qi4j.libraries:org.qi4j.library.constraints:processResources UP-TO-DATE
:org.qi4j.libraries:org.qi4j.library.constraints:classes
:org.qi4j.libraries:org.qi4j.library.constraints:processVersionResources UP-TO-DATE
:org.qi4j.libraries:org.qi4j.library.constraints:versionClasses
:org.qi4j.libraries:org.qi4j.library.constraints:jar
:org.qi4j.libraries:org.qi4j.library.logging:makeVersionClass
:org.qi4j.libraries:org.qi4j.library.logging:compileVersionJava
:org.qi4j.libraries:org.qi4j.library.logging:compileJava
:org.qi4j.libraries:org.qi4j.library.logging:honkerGenDependencies
:org.qi4j.libraries:org.qi4j.library.logging:honkerGenLicense
:org.qi4j.libraries:org.qi4j.library.logging:honkerGenNotice
:org.qi4j.libraries:org.qi4j.library.logging:processResources UP-TO-DATE
:org.qi4j.libraries:org.qi4j.library.logging:classes
:org.qi4j.libraries:org.qi4j.library.logging:processVersionResources UP-TO-DATE
:org.qi4j.libraries:org.qi4j.library.logging:versionClasses
:org.qi4j.libraries:org.qi4j.library.logging:jar
:org.qi4j.manual:compileJava
:org.qi4j.core:org.qi4j.core.runtime:makeVersionClass
:org.qi4j.core:org.qi4j.core.runtime:compileVersionJava
:org.qi4j.core:org.qi4j.core.runtime:compileJava<https://builds.apache.org/job/Zest%20-%20Check%202.1-SNAPSHOT%20distributions%20from%20develop%20branch%20on%20Java8%20(OpenJDK)/ws/core/runtime/src/main/java/org/qi4j/runtime/property/PropertyModel.java>:175:
error: method newValue in interface ValueBuilderFactory cannot be applied to given types;
                return module.newValue( first( valueType().types() ) );
                             ^
  required: Class<T>
  found: Class<CAP#1>
  reason: inference variable X has incompatible bounds
    equality constraints: Class<?>
    upper bounds: Class<CAP#2>,Object
  where T,X are type-variables:
    T extends Object declared in method <T>newValue(Class<T>)
    X extends Object declared in method <X>first(Iterable<X>)
  where CAP#1,CAP#2 are fresh type-variables:
    CAP#1 extends Object from capture of ?
    CAP#2 extends Object from capture of ?
Note: Some input files use unchecked or unsafe operations.
Note: Recompile with -Xlint:unchecked for details.
1 error
 FAILED

FAILURE: Build failed with an exception.

* What went wrong:
Execution failed for task ':org.qi4j.core:org.qi4j.core.runtime:compileJava'.
> Compilation failed; see the compiler error output for details.

* Try:
Run with --info or --debug option to get more log output.

* Exception is:
org.gradle.api.tasks.TaskExecutionException: Execution failed for task ':org.qi4j.core:org.qi4j.core.runtime:compileJava'.
	at org.gradle.api.internal.tasks.execution.ExecuteActionsTaskExecuter.executeActions(ExecuteActionsTaskExecuter.java:69)
	at org.gradle.api.internal.tasks.execution.ExecuteActionsTaskExecuter.execute(ExecuteActionsTaskExecuter.java:46)
	at org.gradle.api.internal.tasks.execution.PostExecutionAnalysisTaskExecuter.execute(PostExecutionAnalysisTaskExecuter.java:35)
	at org.gradle.api.internal.tasks.execution.SkipUpToDateTaskExecuter.execute(SkipUpToDateTaskExecuter.java:64)
	at org.gradle.api.internal.tasks.execution.ValidatingTaskExecuter.execute(ValidatingTaskExecuter.java:58)
	at org.gradle.api.internal.tasks.execution.SkipEmptySourceFilesTaskExecuter.execute(SkipEmptySourceFilesTaskExecuter.java:52)
	at org.gradle.api.internal.tasks.execution.SkipTaskWithNoActionsExecuter.execute(SkipTaskWithNoActionsExecuter.java:52)
	at org.gradle.api.internal.tasks.execution.SkipOnlyIfTaskExecuter.execute(SkipOnlyIfTaskExecuter.java:53)
	at org.gradle.api.internal.tasks.execution.ExecuteAtMostOnceTaskExecuter.execute(ExecuteAtMostOnceTaskExecuter.java:43)
	at org.gradle.execution.taskgraph.DefaultTaskGraphExecuter$EventFiringTaskWorker.execute(DefaultTaskGraphExecuter.java:208)
	at org.gradle.execution.taskgraph.DefaultTaskGraphExecuter$EventFiringTaskWorker.execute(DefaultTaskGraphExecuter.java:186)
	at org.gradle.execution.taskgraph.AbstractTaskPlanExecutor$TaskExecutorWorker.processTask(AbstractTaskPlanExecutor.java:62)
	at org.gradle.execution.taskgraph.AbstractTaskPlanExecutor$TaskExecutorWorker.run(AbstractTaskPlanExecutor.java:50)
	at org.gradle.execution.taskgraph.DefaultTaskPlanExecutor.process(DefaultTaskPlanExecutor.java:25)
	at org.gradle.execution.taskgraph.DefaultTaskGraphExecuter.execute(DefaultTaskGraphExecuter.java:111)
	at org.gradle.execution.SelectedTaskExecutionAction.execute(SelectedTaskExecutionAction.java:37)
	at org.gradle.execution.DefaultBuildExecuter.execute(DefaultBuildExecuter.java:62)
	at org.gradle.execution.DefaultBuildExecuter.access$200(DefaultBuildExecuter.java:23)
	at org.gradle.execution.DefaultBuildExecuter$2.proceed(DefaultBuildExecuter.java:68)
	at org.gradle.execution.DryRunBuildExecutionAction.execute(DryRunBuildExecutionAction.java:32)
	at org.gradle.execution.DefaultBuildExecuter.execute(DefaultBuildExecuter.java:62)
	at org.gradle.execution.DefaultBuildExecuter.execute(DefaultBuildExecuter.java:55)
	at org.gradle.initialization.DefaultGradleLauncher$6.run(DefaultGradleLauncher.java:174)
	at org.gradle.internal.Factories$1.create(Factories.java:22)
	at org.gradle.internal.progress.DefaultBuildOperationExecutor.run(DefaultBuildOperationExecutor.java:62)
	at org.gradle.internal.progress.DefaultBuildOperationExecutor.run(DefaultBuildOperationExecutor.java:47)
	at org.gradle.initialization.DefaultGradleLauncher.runBuildOperation(DefaultGradleLauncher.java:189)
	at org.gradle.initialization.DefaultGradleLauncher.doBuildStages(DefaultGradleLauncher.java:171)
	at org.gradle.initialization.DefaultGradleLauncher.access$200(DefaultGradleLauncher.java:35)
	at org.gradle.initialization.DefaultGradleLauncher$1.create(DefaultGradleLauncher.java:104)
	at org.gradle.initialization.DefaultGradleLauncher$1.create(DefaultGradleLauncher.java:97)
	at org.gradle.internal.progress.DefaultBuildOperationExecutor.run(DefaultBuildOperationExecutor.java:62)
	at org.gradle.initialization.DefaultGradleLauncher.runRootBuildOperation(DefaultGradleLauncher.java:184)
	at org.gradle.initialization.DefaultGradleLauncher.doBuild(DefaultGradleLauncher.java:97)
	at org.gradle.initialization.DefaultGradleLauncher.run(DefaultGradleLauncher.java:86)
	at org.gradle.launcher.exec.InProcessBuildActionExecuter$DefaultBuildController.run(InProcessBuildActionExecuter.java:93)
	at org.gradle.tooling.internal.provider.ExecuteBuildActionRunner.run(ExecuteBuildActionRunner.java:28)
	at org.gradle.launcher.exec.ChainingBuildActionRunner.run(ChainingBuildActionRunner.java:35)
	at org.gradle.launcher.exec.InProcessBuildActionExecuter.execute(InProcessBuildActionExecuter.java:43)
	at org.gradle.launcher.exec.InProcessBuildActionExecuter.execute(InProcessBuildActionExecuter.java:27)
	at org.gradle.launcher.exec.ContinuousBuildActionExecuter.execute(ContinuousBuildActionExecuter.java:72)
	at org.gradle.launcher.exec.ContinuousBuildActionExecuter.execute(ContinuousBuildActionExecuter.java:44)
	at org.gradle.launcher.exec.DaemonUsageSuggestingBuildActionExecuter.execute(DaemonUsageSuggestingBuildActionExecuter.java:50)
	at org.gradle.launcher.exec.DaemonUsageSuggestingBuildActionExecuter.execute(DaemonUsageSuggestingBuildActionExecuter.java:27)
	at org.gradle.launcher.cli.RunBuildAction.run(RunBuildAction.java:40)
	at org.gradle.internal.Actions$RunnableActionAdapter.execute(Actions.java:170)
	at org.gradle.launcher.cli.CommandLineActionFactory$ParseAndBuildAction.execute(CommandLineActionFactory.java:237)
	at org.gradle.launcher.cli.CommandLineActionFactory$ParseAndBuildAction.execute(CommandLineActionFactory.java:210)
	at org.gradle.launcher.cli.JavaRuntimeValidationAction.execute(JavaRuntimeValidationAction.java:35)
	at org.gradle.launcher.cli.JavaRuntimeValidationAction.execute(JavaRuntimeValidationAction.java:24)
	at org.gradle.launcher.cli.CommandLineActionFactory$WithLogging.execute(CommandLineActionFactory.java:206)
	at org.gradle.launcher.cli.CommandLineActionFactory$WithLogging.execute(CommandLineActionFactory.java:169)
	at org.gradle.launcher.cli.ExceptionReportingAction.execute(ExceptionReportingAction.java:33)
	at org.gradle.launcher.cli.ExceptionReportingAction.execute(ExceptionReportingAction.java:22)
	at org.gradle.launcher.Main.doAction(Main.java:33)
	at org.gradle.launcher.bootstrap.EntryPoint.run(EntryPoint.java:45)
	at org.gradle.launcher.bootstrap.ProcessBootstrap.runNoExit(ProcessBootstrap.java:54)
	at org.gradle.launcher.bootstrap.ProcessBootstrap.run(ProcessBootstrap.java:35)
	at org.gradle.launcher.GradleMain.main(GradleMain.java:23)
	at org.gradle.wrapper.BootstrapMainStarter.start(BootstrapMainStarter.java:30)
	at org.gradle.wrapper.WrapperExecutor.execute(WrapperExecutor.java:127)
	at org.gradle.wrapper.GradleWrapperMain.main(GradleWrapperMain.java:55)
Caused by: org.gradle.api.internal.tasks.compile.CompilationFailedException: Compilation failed;
see the compiler error output for details.
	at org.gradle.api.internal.tasks.compile.JdkJavaCompiler.execute(JdkJavaCompiler.java:47)
	at org.gradle.api.internal.tasks.compile.JdkJavaCompiler.execute(JdkJavaCompiler.java:33)
	at org.gradle.api.internal.tasks.compile.NormalizingJavaCompiler.delegateAndHandleErrors(NormalizingJavaCompiler.java:101)
	at org.gradle.api.internal.tasks.compile.NormalizingJavaCompiler.execute(NormalizingJavaCompiler.java:50)
	at org.gradle.api.internal.tasks.compile.NormalizingJavaCompiler.execute(NormalizingJavaCompiler.java:36)
	at org.gradle.api.internal.tasks.compile.CleaningJavaCompilerSupport.execute(CleaningJavaCompilerSupport.java:34)
	at org.gradle.api.internal.tasks.compile.CleaningJavaCompilerSupport.execute(CleaningJavaCompilerSupport.java:25)
	at org.gradle.api.tasks.compile.JavaCompile.performCompilation(JavaCompile.java:157)
	at org.gradle.api.tasks.compile.JavaCompile.compile(JavaCompile.java:137)
	at org.gradle.api.tasks.compile.JavaCompile.compile(JavaCompile.java:91)
	at org.gradle.internal.reflect.JavaMethod.invoke(JavaMethod.java:75)
	at org.gradle.api.internal.project.taskfactory.AnnotationProcessingTaskFactory$IncrementalTaskAction.doExecute(AnnotationProcessingTaskFactory.java:243)
	at org.gradle.api.internal.project.taskfactory.AnnotationProcessingTaskFactory$StandardTaskAction.execute(AnnotationProcessingTaskFactory.java:219)
	at org.gradle.api.internal.project.taskfactory.AnnotationProcessingTaskFactory$IncrementalTaskAction.execute(AnnotationProcessingTaskFactory.java:230)
	at org.gradle.api.internal.project.taskfactory.AnnotationProcessingTaskFactory$StandardTaskAction.execute(AnnotationProcessingTaskFactory.java:208)
	at org.gradle.api.internal.tasks.execution.ExecuteActionsTaskExecuter.executeAction(ExecuteActionsTaskExecuter.java:80)
	at org.gradle.api.internal.tasks.execution.ExecuteActionsTaskExecuter.executeActions(ExecuteActionsTaskExecuter.java:61)
	... 61 more


BUILD FAILED

Total time: 2 mins 18.964 secs
Build step 'Invoke Gradle script' changed build result to FAILURE
Build step 'Invoke Gradle script' marked build as failure
Xvfb stopping
Archiving artifacts
Recording test results
Publishing Javadoc

Mime
View raw message