polygene-dev mailing list archives

Site index · List index
Message view « Date » · « Thread »
Top « Date » · « Thread »
From Apache Jenkins Server <jenk...@builds.apache.org>
Subject Build failed in Jenkins: Zest - Check 2.1-SNAPSHOT distributions from develop branch on Java8 (OpenJDK) #21
Date Sun, 26 Jul 2015 00:45:28 GMT
See <https://builds.apache.org/job/Zest%20-%20Check%202.1-SNAPSHOT%20distributions%20from%20develop%20branch%20on%20Java8%20(OpenJDK)/21/changes>

Changes:

[paulmerlin] ZEST-100 Minor changes

[paulmerlin] ZEST-24 Fix release deployment Nexus URL for proper staging, see INFRA-10046

[paulmerlin] ZEST-24 Fix POM content customization

------------------------------------------
[...truncated 7601 lines...]
:org.qi4j:org.qi4j.tutorials:org.qi4j.tutorial.introduction:jar
:org.qi4j:org.qi4j.tutorials:org.qi4j.tutorial.introduction:javadoc
:org.qi4j:org.qi4j.tutorials:org.qi4j.tutorial.introduction:javadocJar
:org.qi4j:org.qi4j.tutorials:org.qi4j.tutorial.introduction:sourceJar
:org.qi4j:org.qi4j.tutorials:org.qi4j.tutorial.introduction:testSourceJar
:org.qi4j:org.qi4j.tutorials:org.qi4j.tutorial.introduction:signArchives SKIPPED
:org.qi4j:org.qi4j.tutorials:org.qi4j.tutorial.introduction:assemble
:org.qi4j:org.qi4j.tutorials:org.qi4j.tutorial.introduction:dependencyReport
:org.qi4j:org.qi4j.tutorials:org.qi4j.tutorial.services:processVersionResources UP-TO-DATE
:org.qi4j:org.qi4j.tutorials:org.qi4j.tutorial.services:versionClasses
:org.qi4j:org.qi4j.tutorials:org.qi4j.tutorial.services:jar
:org.qi4j:org.qi4j.tutorials:org.qi4j.tutorial.services:javadoc
:org.qi4j:org.qi4j.tutorials:org.qi4j.tutorial.services:javadocJar
:org.qi4j:org.qi4j.tutorials:org.qi4j.tutorial.services:sourceJar
:org.qi4j:org.qi4j.tutorials:org.qi4j.tutorial.services:testSourceJar
:org.qi4j:org.qi4j.tutorials:org.qi4j.tutorial.services:signArchives SKIPPED
:org.qi4j:org.qi4j.tutorials:org.qi4j.tutorial.services:assemble
:org.qi4j:org.qi4j.tutorials:org.qi4j.tutorial.services:dependencyReport
:org.qi4j:org.qi4j.samples:org.qi4j.sample.dci-cargo:org.qi4j.sample.dci-cargo.dcisample_a:processVersionResources
UP-TO-DATE
:org.qi4j:org.qi4j.samples:org.qi4j.sample.dci-cargo:org.qi4j.sample.dci-cargo.dcisample_a:versionClasses
:org.qi4j:org.qi4j.samples:org.qi4j.sample.dci-cargo:org.qi4j.sample.dci-cargo.dcisample_a:jar
:org.qi4j:org.qi4j.samples:org.qi4j.sample.dci-cargo:org.qi4j.sample.dci-cargo.dcisample_a:javadoc<https://builds.apache.org/job/Zest%20-%20Check%202.1-SNAPSHOT%20distributions%20from%20develop%20branch%20on%20Java8%20(OpenJDK)/ws/build/unpacked-distributions/src/apache-zest-java-2.1-SNAPSHOT-src/samples/dci-cargo/dcisample_a/src/main/java/org/qi4j/sample/dcicargo/sample_a/infrastructure/WicketQi4jApplication.java>:95:
warning: no @return
    protected ApplicationAssembler getAssembler()
                                   ^
<https://builds.apache.org/job/Zest%20-%20Check%202.1-SNAPSHOT%20distributions%20from%20develop%20branch%20on%20Java8%20(OpenJDK)/ws/build/unpacked-distributions/src/apache-zest-java-2.1-SNAPSHOT-src/samples/dci-cargo/dcisample_a/src/main/java/org/qi4j/sample/dcicargo/sample_a/infrastructure/WicketQi4jApplication.java>:95:
warning: no @throws for java.lang.Exception
    protected ApplicationAssembler getAssembler()
                                   ^
<https://builds.apache.org/job/Zest%20-%20Check%202.1-SNAPSHOT%20distributions%20from%20develop%20branch%20on%20Java8%20(OpenJDK)/ws/build/unpacked-distributions/src/apache-zest-java-2.1-SNAPSHOT-src/samples/dci-cargo/dcisample_a/src/main/java/org/qi4j/sample/dcicargo/sample_a/context/support/RoutingService.java>:60:
warning: no @throws for org.qi4j.sample.dcicargo.sample_a.context.support.FoundNoRoutesException
    List<Itinerary> fetchRoutesForSpecification( RouteSpecification routeSpecification
)
                    ^
<https://builds.apache.org/job/Zest%20-%20Check%202.1-SNAPSHOT%20distributions%20from%20develop%20branch%20on%20Java8%20(OpenJDK)/ws/build/unpacked-distributions/src/apache-zest-java-2.1-SNAPSHOT-src/samples/dci-cargo/dcisample_a/src/main/java/org/qi4j/sample/dcicargo/sample_a/data/shipping/delivery/Delivery.java>:111:
warning: no @return
    Property<ExpectedHandlingEvent> nextExpectedHandlingEvent();
                                    ^
<https://builds.apache.org/job/Zest%20-%20Check%202.1-SNAPSHOT%20distributions%20from%20develop%20branch%20on%20Java8%20(OpenJDK)/ws/build/unpacked-distributions/src/apache-zest-java-2.1-SNAPSHOT-src/samples/dci-cargo/dcisample_a/src/main/java/org/qi4j/sample/dcicargo/sample_a/infrastructure/dci/RoleMixin.java>:49:
warning: no @param for context
    public void setContext( T context )
                ^
<https://builds.apache.org/job/Zest%20-%20Check%202.1-SNAPSHOT%20distributions%20from%20develop%20branch%20on%20Java8%20(OpenJDK)/ws/build/unpacked-distributions/src/apache-zest-java-2.1-SNAPSHOT-src/samples/dci-cargo/dcisample_a/src/main/java/org/qi4j/sample/dcicargo/sample_a/infrastructure/model/ReadOnlyModel.java>:44:
warning: no description for @throws
     * @throws UnsupportedOperationException
       ^
<https://builds.apache.org/job/Zest%20-%20Check%202.1-SNAPSHOT%20distributions%20from%20develop%20branch%20on%20Java8%20(OpenJDK)/ws/build/unpacked-distributions/src/apache-zest-java-2.1-SNAPSHOT-src/samples/dci-cargo/dcisample_a/src/main/java/org/qi4j/sample/dcicargo/pathfinder_a/api/TransitEdge.java>:39:
warning: no description for @param
     * @param voyageNumber
       ^
<https://builds.apache.org/job/Zest%20-%20Check%202.1-SNAPSHOT%20distributions%20from%20develop%20branch%20on%20Java8%20(OpenJDK)/ws/build/unpacked-distributions/src/apache-zest-java-2.1-SNAPSHOT-src/samples/dci-cargo/dcisample_a/src/main/java/org/qi4j/sample/dcicargo/pathfinder_a/api/TransitEdge.java>:40:
warning: no description for @param
     * @param fromUnLocode
       ^
<https://builds.apache.org/job/Zest%20-%20Check%202.1-SNAPSHOT%20distributions%20from%20develop%20branch%20on%20Java8%20(OpenJDK)/ws/build/unpacked-distributions/src/apache-zest-java-2.1-SNAPSHOT-src/samples/dci-cargo/dcisample_a/src/main/java/org/qi4j/sample/dcicargo/pathfinder_a/api/TransitEdge.java>:41:
warning: no description for @param
     * @param toUnLocode
       ^
<https://builds.apache.org/job/Zest%20-%20Check%202.1-SNAPSHOT%20distributions%20from%20develop%20branch%20on%20Java8%20(OpenJDK)/ws/build/unpacked-distributions/src/apache-zest-java-2.1-SNAPSHOT-src/samples/dci-cargo/dcisample_a/src/main/java/org/qi4j/sample/dcicargo/pathfinder_a/api/TransitEdge.java>:42:
warning: no description for @param
     * @param fromDate
       ^
<https://builds.apache.org/job/Zest%20-%20Check%202.1-SNAPSHOT%20distributions%20from%20develop%20branch%20on%20Java8%20(OpenJDK)/ws/build/unpacked-distributions/src/apache-zest-java-2.1-SNAPSHOT-src/samples/dci-cargo/dcisample_a/src/main/java/org/qi4j/sample/dcicargo/pathfinder_a/api/TransitEdge.java>:43:
warning: no description for @param
     * @param toDate
       ^

11 warnings
:org.qi4j:org.qi4j.samples:org.qi4j.sample.dci-cargo:org.qi4j.sample.dci-cargo.dcisample_a:javadocJar
:org.qi4j:org.qi4j.samples:org.qi4j.sample.dci-cargo:org.qi4j.sample.dci-cargo.dcisample_a:sourceJar
:org.qi4j:org.qi4j.samples:org.qi4j.sample.dci-cargo:org.qi4j.sample.dci-cargo.dcisample_a:testSourceJar
:org.qi4j:org.qi4j.samples:org.qi4j.sample.dci-cargo:org.qi4j.sample.dci-cargo.dcisample_a:signArchives
SKIPPED
:org.qi4j:org.qi4j.samples:org.qi4j.sample.dci-cargo:org.qi4j.sample.dci-cargo.dcisample_a:assemble
:org.qi4j:org.qi4j.samples:org.qi4j.sample.dci-cargo:org.qi4j.sample.dci-cargo.dcisample_a:dependencyReport
:org.qi4j:org.qi4j.samples:org.qi4j.sample.dci-cargo:org.qi4j.sample.dci-cargo.dcisample_b:processVersionResources
UP-TO-DATE
:org.qi4j:org.qi4j.samples:org.qi4j.sample.dci-cargo:org.qi4j.sample.dci-cargo.dcisample_b:versionClasses
:org.qi4j:org.qi4j.samples:org.qi4j.sample.dci-cargo:org.qi4j.sample.dci-cargo.dcisample_b:jar
:org.qi4j:org.qi4j.samples:org.qi4j.sample.dci-cargo:org.qi4j.sample.dci-cargo.dcisample_b:javadoc<https://builds.apache.org/job/Zest%20-%20Check%202.1-SNAPSHOT%20distributions%20from%20develop%20branch%20on%20Java8%20(OpenJDK)/ws/build/unpacked-distributions/src/apache-zest-java-2.1-SNAPSHOT-src/samples/dci-cargo/dcisample_b/src/main/java/org/qi4j/sample/dcicargo/sample_b/context/service/routing/RoutingService.java>:61:
warning: no @throws for org.qi4j.sample.dcicargo.sample_b.context.service.routing.exception.FoundNoRoutesException
    List<Itinerary> fetchRoutesForSpecification( RouteSpecification routeSpecification
)
                    ^
<https://builds.apache.org/job/Zest%20-%20Check%202.1-SNAPSHOT%20distributions%20from%20develop%20branch%20on%20Java8%20(OpenJDK)/ws/build/unpacked-distributions/src/apache-zest-java-2.1-SNAPSHOT-src/samples/dci-cargo/dcisample_b/src/main/java/org/qi4j/sample/dcicargo/pathfinder_b/api/GraphTraversalService.java>:33:
warning: no description for @param
     * @param departureDate
       ^
<https://builds.apache.org/job/Zest%20-%20Check%202.1-SNAPSHOT%20distributions%20from%20develop%20branch%20on%20Java8%20(OpenJDK)/ws/build/unpacked-distributions/src/apache-zest-java-2.1-SNAPSHOT-src/samples/dci-cargo/dcisample_b/src/main/java/org/qi4j/sample/dcicargo/pathfinder_b/api/TransitEdge.java>:39:
warning: no description for @param
     * @param voyageNumber
       ^
<https://builds.apache.org/job/Zest%20-%20Check%202.1-SNAPSHOT%20distributions%20from%20develop%20branch%20on%20Java8%20(OpenJDK)/ws/build/unpacked-distributions/src/apache-zest-java-2.1-SNAPSHOT-src/samples/dci-cargo/dcisample_b/src/main/java/org/qi4j/sample/dcicargo/pathfinder_b/api/TransitEdge.java>:40:
warning: no description for @param
     * @param fromUnLocode
       ^
<https://builds.apache.org/job/Zest%20-%20Check%202.1-SNAPSHOT%20distributions%20from%20develop%20branch%20on%20Java8%20(OpenJDK)/ws/build/unpacked-distributions/src/apache-zest-java-2.1-SNAPSHOT-src/samples/dci-cargo/dcisample_b/src/main/java/org/qi4j/sample/dcicargo/pathfinder_b/api/TransitEdge.java>:41:
warning: no description for @param
     * @param toUnLocode
       ^
<https://builds.apache.org/job/Zest%20-%20Check%202.1-SNAPSHOT%20distributions%20from%20develop%20branch%20on%20Java8%20(OpenJDK)/ws/build/unpacked-distributions/src/apache-zest-java-2.1-SNAPSHOT-src/samples/dci-cargo/dcisample_b/src/main/java/org/qi4j/sample/dcicargo/pathfinder_b/api/TransitEdge.java>:42:
warning: no description for @param
     * @param fromDate
       ^
<https://builds.apache.org/job/Zest%20-%20Check%202.1-SNAPSHOT%20distributions%20from%20develop%20branch%20on%20Java8%20(OpenJDK)/ws/build/unpacked-distributions/src/apache-zest-java-2.1-SNAPSHOT-src/samples/dci-cargo/dcisample_b/src/main/java/org/qi4j/sample/dcicargo/pathfinder_b/api/TransitEdge.java>:43:
warning: no description for @param
     * @param toDate
       ^
<https://builds.apache.org/job/Zest%20-%20Check%202.1-SNAPSHOT%20distributions%20from%20develop%20branch%20on%20Java8%20(OpenJDK)/ws/build/unpacked-distributions/src/apache-zest-java-2.1-SNAPSHOT-src/samples/dci-cargo/dcisample_b/src/main/java/org/qi4j/sample/dcicargo/sample_b/infrastructure/dci/RoleMixin.java>:60:
warning: no @param for context
    public void setContext( T context )
                ^
<https://builds.apache.org/job/Zest%20-%20Check%202.1-SNAPSHOT%20distributions%20from%20develop%20branch%20on%20Java8%20(OpenJDK)/ws/build/unpacked-distributions/src/apache-zest-java-2.1-SNAPSHOT-src/samples/dci-cargo/dcisample_b/src/main/java/org/qi4j/sample/dcicargo/sample_b/infrastructure/WicketQi4jApplication.java>:84:
warning: no @return
    protected ApplicationAssembler getAssembler()
                                   ^
<https://builds.apache.org/job/Zest%20-%20Check%202.1-SNAPSHOT%20distributions%20from%20develop%20branch%20on%20Java8%20(OpenJDK)/ws/build/unpacked-distributions/src/apache-zest-java-2.1-SNAPSHOT-src/samples/dci-cargo/dcisample_b/src/main/java/org/qi4j/sample/dcicargo/sample_b/infrastructure/WicketQi4jApplication.java>:84:
warning: no @throws for java.lang.Exception
    protected ApplicationAssembler getAssembler()
                                   ^
<https://builds.apache.org/job/Zest%20-%20Check%202.1-SNAPSHOT%20distributions%20from%20develop%20branch%20on%20Java8%20(OpenJDK)/ws/build/unpacked-distributions/src/apache-zest-java-2.1-SNAPSHOT-src/samples/dci-cargo/dcisample_b/src/main/java/org/qi4j/sample/dcicargo/sample_b/infrastructure/model/ReadOnlyModel.java>:46:
warning: no description for @throws
     * @throws UnsupportedOperationException
       ^

11 warnings
:org.qi4j:org.qi4j.samples:org.qi4j.sample.dci-cargo:org.qi4j.sample.dci-cargo.dcisample_b:javadocJar
:org.qi4j:org.qi4j.samples:org.qi4j.sample.dci-cargo:org.qi4j.sample.dci-cargo.dcisample_b:sourceJar
:org.qi4j:org.qi4j.samples:org.qi4j.sample.dci-cargo:org.qi4j.sample.dci-cargo.dcisample_b:testSourceJar
:org.qi4j:org.qi4j.samples:org.qi4j.sample.dci-cargo:org.qi4j.sample.dci-cargo.dcisample_b:signArchives
SKIPPED
:org.qi4j:org.qi4j.samples:org.qi4j.sample.dci-cargo:org.qi4j.sample.dci-cargo.dcisample_b:assemble
:org.qi4j:org.qi4j.samples:org.qi4j.sample.dci-cargo:org.qi4j.sample.dci-cargo.dcisample_b:dependencyReport
:org.qi4j:org.qi4j.tutorials:org.qi4j.tutorial.introduction:org.qi4j.tutorial.introduction.tenminutes:javadoc
:org.qi4j:org.qi4j.tutorials:org.qi4j.tutorial.introduction:org.qi4j.tutorial.introduction.tenminutes:javadocJar
:org.qi4j:org.qi4j.tutorials:org.qi4j.tutorial.introduction:org.qi4j.tutorial.introduction.tenminutes:sourceJar
:org.qi4j:org.qi4j.tutorials:org.qi4j.tutorial.introduction:org.qi4j.tutorial.introduction.tenminutes:testSourceJar
:org.qi4j:org.qi4j.tutorials:org.qi4j.tutorial.introduction:org.qi4j.tutorial.introduction.tenminutes:signArchives
SKIPPED
:org.qi4j:org.qi4j.tutorials:org.qi4j.tutorial.introduction:org.qi4j.tutorial.introduction.tenminutes:assemble
:org.qi4j:org.qi4j.tutorials:org.qi4j.tutorial.introduction:org.qi4j.tutorial.introduction.tenminutes:dependencyReport
:org.qi4j:org.qi4j.tutorials:org.qi4j.tutorial.introduction:org.qi4j.tutorial.introduction.thirtyminutes:processVersionResources
UP-TO-DATE
:org.qi4j:org.qi4j.tutorials:org.qi4j.tutorial.introduction:org.qi4j.tutorial.introduction.thirtyminutes:versionClasses
:org.qi4j:org.qi4j.tutorials:org.qi4j.tutorial.introduction:org.qi4j.tutorial.introduction.thirtyminutes:jar
:org.qi4j:org.qi4j.tutorials:org.qi4j.tutorial.introduction:org.qi4j.tutorial.introduction.thirtyminutes:javadoc
:org.qi4j:org.qi4j.tutorials:org.qi4j.tutorial.introduction:org.qi4j.tutorial.introduction.thirtyminutes:javadocJar
:org.qi4j:org.qi4j.tutorials:org.qi4j.tutorial.introduction:org.qi4j.tutorial.introduction.thirtyminutes:sourceJar
:org.qi4j:org.qi4j.tutorials:org.qi4j.tutorial.introduction:org.qi4j.tutorial.introduction.thirtyminutes:testSourceJar
:org.qi4j:org.qi4j.tutorials:org.qi4j.tutorial.introduction:org.qi4j.tutorial.introduction.thirtyminutes:signArchives
SKIPPED
:org.qi4j:org.qi4j.tutorials:org.qi4j.tutorial.introduction:org.qi4j.tutorial.introduction.thirtyminutes:assemble
:org.qi4j:org.qi4j.tutorials:org.qi4j.tutorial.introduction:org.qi4j.tutorial.introduction.thirtyminutes:dependencyReport
:org.qi4j:org.qi4j.tutorials:org.qi4j.tutorial.introduction:org.qi4j.tutorial.introduction.twominutes:processVersionResources
UP-TO-DATE
:org.qi4j:org.qi4j.tutorials:org.qi4j.tutorial.introduction:org.qi4j.tutorial.introduction.twominutes:versionClasses
:org.qi4j:org.qi4j.tutorials:org.qi4j.tutorial.introduction:org.qi4j.tutorial.introduction.twominutes:jar
:org.qi4j:org.qi4j.tutorials:org.qi4j.tutorial.introduction:org.qi4j.tutorial.introduction.twominutes:javadoc
:org.qi4j:org.qi4j.tutorials:org.qi4j.tutorial.introduction:org.qi4j.tutorial.introduction.twominutes:javadocJar
:org.qi4j:org.qi4j.tutorials:org.qi4j.tutorial.introduction:org.qi4j.tutorial.introduction.twominutes:sourceJar
:org.qi4j:org.qi4j.tutorials:org.qi4j.tutorial.introduction:org.qi4j.tutorial.introduction.twominutes:testSourceJar
:org.qi4j:org.qi4j.tutorials:org.qi4j.tutorial.introduction:org.qi4j.tutorial.introduction.twominutes:signArchives
SKIPPED
:org.qi4j:org.qi4j.tutorials:org.qi4j.tutorial.introduction:org.qi4j.tutorial.introduction.twominutes:assemble
:org.qi4j:org.qi4j.tutorials:org.qi4j.tutorial.introduction:org.qi4j.tutorial.introduction.twominutes:dependencyReport
:org.qi4j:buildAll
:org.qi4j:generateBinDistGoOfflineHelpers
:org.qi4j:tarBinaries
:org.qi4j:srcDistFilteredFiles
:org.qi4j:tarSources
:org.qi4j:zipBinaries
:org.qi4j:zipSources
:org.qi4j:signArchives SKIPPED
:org.qi4j:assemble
:checkDists

Test failures in:
  org.qi4j.library.metrics

:checkDists FAILED

FAILURE: Build failed with an exception.

* Where:
Build file '<https://builds.apache.org/job/Zest%20-%20Check%202.1-SNAPSHOT%20distributions%20from%20develop%20branch%20on%20Java8%20(OpenJDK)/ws/build.gradle'>
line: 452

* What went wrong:
Execution failed for task ':checkDists'.
> There was TEST FAILURES!! See list above.

* Try:
Run with --info or --debug option to get more log output.

* Exception is:
org.gradle.api.tasks.TaskExecutionException: Execution failed for task ':checkDists'.
	at org.gradle.api.internal.tasks.execution.ExecuteActionsTaskExecuter.executeActions(ExecuteActionsTaskExecuter.java:69)
	at org.gradle.api.internal.tasks.execution.ExecuteActionsTaskExecuter.execute(ExecuteActionsTaskExecuter.java:46)
	at org.gradle.api.internal.tasks.execution.PostExecutionAnalysisTaskExecuter.execute(PostExecutionAnalysisTaskExecuter.java:35)
	at org.gradle.api.internal.tasks.execution.SkipUpToDateTaskExecuter.execute(SkipUpToDateTaskExecuter.java:64)
	at org.gradle.api.internal.tasks.execution.ValidatingTaskExecuter.execute(ValidatingTaskExecuter.java:58)
	at org.gradle.api.internal.tasks.execution.SkipEmptySourceFilesTaskExecuter.execute(SkipEmptySourceFilesTaskExecuter.java:52)
	at org.gradle.api.internal.tasks.execution.SkipTaskWithNoActionsExecuter.execute(SkipTaskWithNoActionsExecuter.java:52)
	at org.gradle.api.internal.tasks.execution.SkipOnlyIfTaskExecuter.execute(SkipOnlyIfTaskExecuter.java:53)
	at org.gradle.api.internal.tasks.execution.ExecuteAtMostOnceTaskExecuter.execute(ExecuteAtMostOnceTaskExecuter.java:43)
	at org.gradle.execution.taskgraph.DefaultTaskGraphExecuter$EventFiringTaskWorker.execute(DefaultTaskGraphExecuter.java:208)
	at org.gradle.execution.taskgraph.DefaultTaskGraphExecuter$EventFiringTaskWorker.execute(DefaultTaskGraphExecuter.java:186)
	at org.gradle.execution.taskgraph.AbstractTaskPlanExecutor$TaskExecutorWorker.processTask(AbstractTaskPlanExecutor.java:62)
	at org.gradle.execution.taskgraph.AbstractTaskPlanExecutor$TaskExecutorWorker.run(AbstractTaskPlanExecutor.java:50)
	at org.gradle.execution.taskgraph.DefaultTaskPlanExecutor.process(DefaultTaskPlanExecutor.java:25)
	at org.gradle.execution.taskgraph.DefaultTaskGraphExecuter.execute(DefaultTaskGraphExecuter.java:111)
	at org.gradle.execution.SelectedTaskExecutionAction.execute(SelectedTaskExecutionAction.java:37)
	at org.gradle.execution.DefaultBuildExecuter.execute(DefaultBuildExecuter.java:62)
	at org.gradle.execution.DefaultBuildExecuter.access$200(DefaultBuildExecuter.java:23)
	at org.gradle.execution.DefaultBuildExecuter$2.proceed(DefaultBuildExecuter.java:68)
	at org.gradle.execution.DryRunBuildExecutionAction.execute(DryRunBuildExecutionAction.java:32)
	at org.gradle.execution.DefaultBuildExecuter.execute(DefaultBuildExecuter.java:62)
	at org.gradle.execution.DefaultBuildExecuter.execute(DefaultBuildExecuter.java:55)
	at org.gradle.initialization.DefaultGradleLauncher$6.run(DefaultGradleLauncher.java:174)
	at org.gradle.internal.Factories$1.create(Factories.java:22)
	at org.gradle.internal.progress.DefaultBuildOperationExecutor.run(DefaultBuildOperationExecutor.java:62)
	at org.gradle.internal.progress.DefaultBuildOperationExecutor.run(DefaultBuildOperationExecutor.java:47)
	at org.gradle.initialization.DefaultGradleLauncher.runBuildOperation(DefaultGradleLauncher.java:189)
	at org.gradle.initialization.DefaultGradleLauncher.doBuildStages(DefaultGradleLauncher.java:171)
	at org.gradle.initialization.DefaultGradleLauncher.access$200(DefaultGradleLauncher.java:35)
	at org.gradle.initialization.DefaultGradleLauncher$1.create(DefaultGradleLauncher.java:104)
	at org.gradle.initialization.DefaultGradleLauncher$1.create(DefaultGradleLauncher.java:97)
	at org.gradle.internal.progress.DefaultBuildOperationExecutor.run(DefaultBuildOperationExecutor.java:62)
	at org.gradle.initialization.DefaultGradleLauncher.runRootBuildOperation(DefaultGradleLauncher.java:184)
	at org.gradle.initialization.DefaultGradleLauncher.doBuild(DefaultGradleLauncher.java:97)
	at org.gradle.initialization.DefaultGradleLauncher.run(DefaultGradleLauncher.java:86)
	at org.gradle.launcher.exec.InProcessBuildActionExecuter$DefaultBuildController.run(InProcessBuildActionExecuter.java:93)
	at org.gradle.tooling.internal.provider.ExecuteBuildActionRunner.run(ExecuteBuildActionRunner.java:28)
	at org.gradle.launcher.exec.ChainingBuildActionRunner.run(ChainingBuildActionRunner.java:35)
	at org.gradle.launcher.exec.InProcessBuildActionExecuter.execute(InProcessBuildActionExecuter.java:43)
	at org.gradle.launcher.exec.InProcessBuildActionExecuter.execute(InProcessBuildActionExecuter.java:27)
	at org.gradle.launcher.exec.ContinuousBuildActionExecuter.execute(ContinuousBuildActionExecuter.java:72)
	at org.gradle.launcher.exec.ContinuousBuildActionExecuter.execute(ContinuousBuildActionExecuter.java:44)
	at org.gradle.launcher.exec.DaemonUsageSuggestingBuildActionExecuter.execute(DaemonUsageSuggestingBuildActionExecuter.java:50)
	at org.gradle.launcher.exec.DaemonUsageSuggestingBuildActionExecuter.execute(DaemonUsageSuggestingBuildActionExecuter.java:27)
	at org.gradle.launcher.cli.RunBuildAction.run(RunBuildAction.java:40)
	at org.gradle.internal.Actions$RunnableActionAdapter.execute(Actions.java:170)
	at org.gradle.launcher.cli.CommandLineActionFactory$ParseAndBuildAction.execute(CommandLineActionFactory.java:237)
	at org.gradle.launcher.cli.CommandLineActionFactory$ParseAndBuildAction.execute(CommandLineActionFactory.java:210)
	at org.gradle.launcher.cli.JavaRuntimeValidationAction.execute(JavaRuntimeValidationAction.java:35)
	at org.gradle.launcher.cli.JavaRuntimeValidationAction.execute(JavaRuntimeValidationAction.java:24)
	at org.gradle.launcher.cli.CommandLineActionFactory$WithLogging.execute(CommandLineActionFactory.java:206)
	at org.gradle.launcher.cli.CommandLineActionFactory$WithLogging.execute(CommandLineActionFactory.java:169)
	at org.gradle.launcher.cli.ExceptionReportingAction.execute(ExceptionReportingAction.java:33)
	at org.gradle.launcher.cli.ExceptionReportingAction.execute(ExceptionReportingAction.java:22)
	at org.gradle.launcher.Main.doAction(Main.java:33)
	at org.gradle.launcher.bootstrap.EntryPoint.run(EntryPoint.java:45)
	at org.gradle.launcher.bootstrap.ProcessBootstrap.runNoExit(ProcessBootstrap.java:54)
	at org.gradle.launcher.bootstrap.ProcessBootstrap.run(ProcessBootstrap.java:35)
	at org.gradle.launcher.GradleMain.main(GradleMain.java:23)
	at org.gradle.wrapper.BootstrapMainStarter.start(BootstrapMainStarter.java:30)
	at org.gradle.wrapper.WrapperExecutor.execute(WrapperExecutor.java:127)
	at org.gradle.wrapper.GradleWrapperMain.main(GradleWrapperMain.java:55)
Caused by: java.lang.RuntimeException: There was TEST FAILURES!! See list above.
	at build_awguo97dsdj2mz8d49jjdesy$_run_closure7_closure98.doCall(<https://builds.apache.org/job/Zest%20-%20Check%202.1-SNAPSHOT%20distributions%20from%20develop%20branch%20on%20Java8%20(OpenJDK)/ws/build.gradle>:452)
	at org.gradle.api.internal.AbstractTask$ClosureTaskAction.execute(AbstractTask.java:554)
	at org.gradle.api.internal.AbstractTask$ClosureTaskAction.execute(AbstractTask.java:535)
	at org.gradle.api.internal.tasks.execution.ExecuteActionsTaskExecuter.executeAction(ExecuteActionsTaskExecuter.java:80)
	at org.gradle.api.internal.tasks.execution.ExecuteActionsTaskExecuter.executeActions(ExecuteActionsTaskExecuter.java:61)
	... 61 more


BUILD FAILED

Total time: 23 mins 46.658 secs
Build step 'Invoke Gradle script' changed build result to FAILURE
Build step 'Invoke Gradle script' marked build as failure
Xvfb stopping
Archiving artifacts
Sending artifact delta relative to Zest - Check 2.1-SNAPSHOT distributions from develop branch
on Java8 (OpenJDK) #19
Archived 12 artifacts
Archive block size is 32768
Received 12 blocks and 38059427 bytes
Compression is 1.0%
Took 12 sec
Recording test results
Publishing Javadoc

Mime
View raw message