polygene-dev mailing list archives

Site index · List index
Message view « Date » · « Thread »
Top « Date » · « Thread »
From Apache Jenkins Server <jenk...@builds.apache.org>
Subject Build failed in Jenkins: Zest - Check 2.1-SNAPSHOT distributions from develop branch on Java7 (Oracle JDK) #28
Date Sun, 19 Jul 2015 18:27:50 GMT
See <https://builds.apache.org/job/Zest%20-%20Check%202.1-SNAPSHOT%20distributions%20from%20develop%20branch%20on%20Java7%20(Oracle%20JDK)/28/changes>

Changes:

[paulmerlin] ZEST-104 Remove Voldemort EntityStore

[tibor.mlynarik] eventsourcing: added assembly; bad concern fix; application events test

[tibor.mlynarik] docs snippets fixes; code formatting

[tibor.mlynarik] eventsourcing docs

[paulmerlin] EventSourcing: licensing, formatting, some fixes in documentation

------------------------------------------
[...truncated 2595 lines...]
:org.qi4j.tests:org.qi4j.test.performance:sourceJar
:org.qi4j.tests:org.qi4j.test.performance:testSourceJar
:org.qi4j.tests:org.qi4j.test.performance:signArchives SKIPPED
:org.qi4j.tests:org.qi4j.test.performance:assemble
:org.qi4j.tests:org.qi4j.test.performance:dependencyReport
:org.qi4j.tests:org.qi4j.test.regression:processVersionResources UP-TO-DATE
:org.qi4j.tests:org.qi4j.test.regression:versionClasses
:org.qi4j.tests:org.qi4j.test.regression:jar
:org.qi4j.tests:org.qi4j.test.regression:javadoc
:org.qi4j.tests:org.qi4j.test.regression:javadocJar
:org.qi4j.tests:org.qi4j.test.regression:sourceJar
:org.qi4j.tests:org.qi4j.test.regression:testSourceJar
:org.qi4j.tests:org.qi4j.test.regression:signArchives SKIPPED
:org.qi4j.tests:org.qi4j.test.regression:assemble
:org.qi4j.tests:org.qi4j.test.regression:dependencyReport
:org.qi4j.tools:org.qi4j.tool.model-detail:javadoc
:org.qi4j.tools:org.qi4j.tool.envisage:javadoc
:org.qi4j.tools:org.qi4j.tool.envisage:javadocJar
:org.qi4j.tools:org.qi4j.tool.envisage:sourceJar
:org.qi4j.tools:org.qi4j.tool.envisage:testSourceJar
:org.qi4j.tools:org.qi4j.tool.envisage:signArchives SKIPPED
:org.qi4j.tools:org.qi4j.tool.envisage:assemble
:org.qi4j.tools:org.qi4j.tool.envisage:dependencyReport
:org.qi4j.tools:org.qi4j.tool.model-detail:javadocJar
:org.qi4j.tools:org.qi4j.tool.model-detail:sourceJar
:org.qi4j.tools:org.qi4j.tool.model-detail:testSourceJar
:org.qi4j.tools:org.qi4j.tool.model-detail:signArchives SKIPPED
:org.qi4j.tools:org.qi4j.tool.model-detail:assemble
:org.qi4j.tools:org.qi4j.tool.model-detail:dependencyReport
:org.qi4j.tools:org.qi4j.tool.shell:processVersionResources UP-TO-DATE
:org.qi4j.tools:org.qi4j.tool.shell:versionClasses
:org.qi4j.tools:org.qi4j.tool.shell:jar
:org.qi4j.tools:org.qi4j.tool.shell:startScripts
:org.qi4j.tools:org.qi4j.tool.shell:distTar
:org.qi4j.tools:org.qi4j.tool.shell:distZip
:org.qi4j.tools:org.qi4j.tool.shell:javadoc
:org.qi4j.tools:org.qi4j.tool.shell:javadocJar
:org.qi4j.tools:org.qi4j.tool.shell:sourceJar
:org.qi4j.tools:org.qi4j.tool.shell:testSourceJar
:org.qi4j.tools:org.qi4j.tool.shell:signArchives SKIPPED
:org.qi4j.tools:org.qi4j.tool.shell:assemble
:org.qi4j.tools:org.qi4j.tool.shell:dependencyReport
:org.qi4j.tutorials:org.qi4j.tutorial.cargo:processVersionResources UP-TO-DATE
:org.qi4j.tutorials:org.qi4j.tutorial.cargo:versionClasses
:org.qi4j.tutorials:org.qi4j.tutorial.cargo:jar
:org.qi4j.tutorials:org.qi4j.tutorial.cargo:javadoc
:org.qi4j.tutorials:org.qi4j.tutorial.cargo:javadocJar
:org.qi4j.tutorials:org.qi4j.tutorial.cargo:sourceJar
:org.qi4j.tutorials:org.qi4j.tutorial.cargo:testSourceJar
:org.qi4j.tutorials:org.qi4j.tutorial.cargo:signArchives SKIPPED
:org.qi4j.tutorials:org.qi4j.tutorial.cargo:assemble
:org.qi4j.tutorials:org.qi4j.tutorial.cargo:dependencyReport
:org.qi4j.tutorials:org.qi4j.tutorial.composites:processVersionResources UP-TO-DATE
:org.qi4j.tutorials:org.qi4j.tutorial.composites:versionClasses
:org.qi4j.tutorials:org.qi4j.tutorial.composites:jar
:org.qi4j.tutorials:org.qi4j.tutorial.composites:javadoc
:org.qi4j.tutorials:org.qi4j.tutorial.composites:javadocJar
:org.qi4j.tutorials:org.qi4j.tutorial.composites:sourceJar
:org.qi4j.tutorials:org.qi4j.tutorial.composites:testSourceJar
:org.qi4j.tutorials:org.qi4j.tutorial.composites:signArchives SKIPPED
:org.qi4j.tutorials:org.qi4j.tutorial.composites:assemble
:org.qi4j.tutorials:org.qi4j.tutorial.composites:dependencyReport
:org.qi4j.tutorials:org.qi4j.tutorial.hello:processVersionResources UP-TO-DATE
:org.qi4j.tutorials:org.qi4j.tutorial.hello:versionClasses
:org.qi4j.tutorials:org.qi4j.tutorial.hello:jar
:org.qi4j.tutorials:org.qi4j.tutorial.hello:javadoc
:org.qi4j.tutorials:org.qi4j.tutorial.hello:javadocJar
:org.qi4j.tutorials:org.qi4j.tutorial.hello:sourceJar
:org.qi4j.tutorials:org.qi4j.tutorial.hello:testSourceJar
:org.qi4j.tutorials:org.qi4j.tutorial.hello:signArchives SKIPPED
:org.qi4j.tutorials:org.qi4j.tutorial.hello:assemble
:org.qi4j.tutorials:org.qi4j.tutorial.hello:dependencyReport
:org.qi4j.tutorials:org.qi4j.tutorial.introduction:processVersionResources UP-TO-DATE
:org.qi4j.tutorials:org.qi4j.tutorial.introduction:versionClasses
:org.qi4j.tutorials:org.qi4j.tutorial.introduction:jar
:org.qi4j.tutorials:org.qi4j.tutorial.introduction:javadoc
:org.qi4j.tutorials:org.qi4j.tutorial.introduction:javadocJar
:org.qi4j.tutorials:org.qi4j.tutorial.introduction:sourceJar
:org.qi4j.tutorials:org.qi4j.tutorial.introduction:testSourceJar
:org.qi4j.tutorials:org.qi4j.tutorial.introduction:signArchives SKIPPED
:org.qi4j.tutorials:org.qi4j.tutorial.introduction:assemble
:org.qi4j.tutorials:org.qi4j.tutorial.introduction:dependencyReport
:org.qi4j.tutorials:org.qi4j.tutorial.services:processVersionResources UP-TO-DATE
:org.qi4j.tutorials:org.qi4j.tutorial.services:versionClasses
:org.qi4j.tutorials:org.qi4j.tutorial.services:jar
:org.qi4j.tutorials:org.qi4j.tutorial.services:javadoc
:org.qi4j.tutorials:org.qi4j.tutorial.services:javadocJar
:org.qi4j.tutorials:org.qi4j.tutorial.services:sourceJar
:org.qi4j.tutorials:org.qi4j.tutorial.services:testSourceJar
:org.qi4j.tutorials:org.qi4j.tutorial.services:signArchives SKIPPED
:org.qi4j.tutorials:org.qi4j.tutorial.services:assemble
:org.qi4j.tutorials:org.qi4j.tutorial.services:dependencyReport
:org.qi4j.samples:org.qi4j.sample.dci-cargo:org.qi4j.sample.dci-cargo.dcisample_a:processVersionResources
UP-TO-DATE
:org.qi4j.samples:org.qi4j.sample.dci-cargo:org.qi4j.sample.dci-cargo.dcisample_a:versionClasses
:org.qi4j.samples:org.qi4j.sample.dci-cargo:org.qi4j.sample.dci-cargo.dcisample_a:jar
:org.qi4j.samples:org.qi4j.sample.dci-cargo:org.qi4j.sample.dci-cargo.dcisample_a:javadoc
:org.qi4j.samples:org.qi4j.sample.dci-cargo:org.qi4j.sample.dci-cargo.dcisample_a:javadocJar
:org.qi4j.samples:org.qi4j.sample.dci-cargo:org.qi4j.sample.dci-cargo.dcisample_a:sourceJar
:org.qi4j.samples:org.qi4j.sample.dci-cargo:org.qi4j.sample.dci-cargo.dcisample_a:testSourceJar
:org.qi4j.samples:org.qi4j.sample.dci-cargo:org.qi4j.sample.dci-cargo.dcisample_a:signArchives
SKIPPED
:org.qi4j.samples:org.qi4j.sample.dci-cargo:org.qi4j.sample.dci-cargo.dcisample_a:assemble
:org.qi4j.samples:org.qi4j.sample.dci-cargo:org.qi4j.sample.dci-cargo.dcisample_a:dependencyReport
:org.qi4j.samples:org.qi4j.sample.dci-cargo:org.qi4j.sample.dci-cargo.dcisample_b:processVersionResources
UP-TO-DATE
:org.qi4j.samples:org.qi4j.sample.dci-cargo:org.qi4j.sample.dci-cargo.dcisample_b:versionClasses
:org.qi4j.samples:org.qi4j.sample.dci-cargo:org.qi4j.sample.dci-cargo.dcisample_b:jar
:org.qi4j.samples:org.qi4j.sample.dci-cargo:org.qi4j.sample.dci-cargo.dcisample_b:javadoc
:org.qi4j.samples:org.qi4j.sample.dci-cargo:org.qi4j.sample.dci-cargo.dcisample_b:javadocJar
:org.qi4j.samples:org.qi4j.sample.dci-cargo:org.qi4j.sample.dci-cargo.dcisample_b:sourceJar
:org.qi4j.samples:org.qi4j.sample.dci-cargo:org.qi4j.sample.dci-cargo.dcisample_b:testSourceJar
:org.qi4j.samples:org.qi4j.sample.dci-cargo:org.qi4j.sample.dci-cargo.dcisample_b:signArchives
SKIPPED
:org.qi4j.samples:org.qi4j.sample.dci-cargo:org.qi4j.sample.dci-cargo.dcisample_b:assemble
:org.qi4j.samples:org.qi4j.sample.dci-cargo:org.qi4j.sample.dci-cargo.dcisample_b:dependencyReport
:org.qi4j.tutorials:org.qi4j.tutorial.introduction:org.qi4j.tutorial.introduction.tenminutes:javadoc
:org.qi4j.tutorials:org.qi4j.tutorial.introduction:org.qi4j.tutorial.introduction.tenminutes:javadocJar
:org.qi4j.tutorials:org.qi4j.tutorial.introduction:org.qi4j.tutorial.introduction.tenminutes:sourceJar
:org.qi4j.tutorials:org.qi4j.tutorial.introduction:org.qi4j.tutorial.introduction.tenminutes:testSourceJar
:org.qi4j.tutorials:org.qi4j.tutorial.introduction:org.qi4j.tutorial.introduction.tenminutes:signArchives
SKIPPED
:org.qi4j.tutorials:org.qi4j.tutorial.introduction:org.qi4j.tutorial.introduction.tenminutes:assemble
:org.qi4j.tutorials:org.qi4j.tutorial.introduction:org.qi4j.tutorial.introduction.tenminutes:dependencyReport
:org.qi4j.tutorials:org.qi4j.tutorial.introduction:org.qi4j.tutorial.introduction.thirtyminutes:processVersionResources
UP-TO-DATE
:org.qi4j.tutorials:org.qi4j.tutorial.introduction:org.qi4j.tutorial.introduction.thirtyminutes:versionClasses
:org.qi4j.tutorials:org.qi4j.tutorial.introduction:org.qi4j.tutorial.introduction.thirtyminutes:jar
:org.qi4j.tutorials:org.qi4j.tutorial.introduction:org.qi4j.tutorial.introduction.thirtyminutes:javadoc
:org.qi4j.tutorials:org.qi4j.tutorial.introduction:org.qi4j.tutorial.introduction.thirtyminutes:javadocJar
:org.qi4j.tutorials:org.qi4j.tutorial.introduction:org.qi4j.tutorial.introduction.thirtyminutes:sourceJar
:org.qi4j.tutorials:org.qi4j.tutorial.introduction:org.qi4j.tutorial.introduction.thirtyminutes:testSourceJar
:org.qi4j.tutorials:org.qi4j.tutorial.introduction:org.qi4j.tutorial.introduction.thirtyminutes:signArchives
SKIPPED
:org.qi4j.tutorials:org.qi4j.tutorial.introduction:org.qi4j.tutorial.introduction.thirtyminutes:assemble
:org.qi4j.tutorials:org.qi4j.tutorial.introduction:org.qi4j.tutorial.introduction.thirtyminutes:dependencyReport
:org.qi4j.tutorials:org.qi4j.tutorial.introduction:org.qi4j.tutorial.introduction.twominutes:processVersionResources
UP-TO-DATE
:org.qi4j.tutorials:org.qi4j.tutorial.introduction:org.qi4j.tutorial.introduction.twominutes:versionClasses
:org.qi4j.tutorials:org.qi4j.tutorial.introduction:org.qi4j.tutorial.introduction.twominutes:jar
:org.qi4j.tutorials:org.qi4j.tutorial.introduction:org.qi4j.tutorial.introduction.twominutes:javadoc
:org.qi4j.tutorials:org.qi4j.tutorial.introduction:org.qi4j.tutorial.introduction.twominutes:javadocJar
:org.qi4j.tutorials:org.qi4j.tutorial.introduction:org.qi4j.tutorial.introduction.twominutes:sourceJar
:org.qi4j.tutorials:org.qi4j.tutorial.introduction:org.qi4j.tutorial.introduction.twominutes:testSourceJar
:org.qi4j.tutorials:org.qi4j.tutorial.introduction:org.qi4j.tutorial.introduction.twominutes:signArchives
SKIPPED
:org.qi4j.tutorials:org.qi4j.tutorial.introduction:org.qi4j.tutorial.introduction.twominutes:assemble
:org.qi4j.tutorials:org.qi4j.tutorial.introduction:org.qi4j.tutorial.introduction.twominutes:dependencyReport
:buildAll
:generateBinDistGoOfflineHelpers
:tarBinaries
:srcDistFilteredFiles
:tarSources
:zipBinaries
:zipSources
:signArchives FAILED

FAILURE: Build failed with an exception.

* What went wrong:
Execution failed for task ':signArchives'.
> Cannot perform signing task ':signArchives' because it has no configured signatory

* Try:
Run with --info or --debug option to get more log output.

* Exception is:
org.gradle.api.tasks.TaskExecutionException: Execution failed for task ':signArchives'.
	at org.gradle.api.internal.tasks.execution.ExecuteActionsTaskExecuter.executeActions(ExecuteActionsTaskExecuter.java:69)
	at org.gradle.api.internal.tasks.execution.ExecuteActionsTaskExecuter.execute(ExecuteActionsTaskExecuter.java:46)
	at org.gradle.api.internal.tasks.execution.PostExecutionAnalysisTaskExecuter.execute(PostExecutionAnalysisTaskExecuter.java:35)
	at org.gradle.api.internal.tasks.execution.SkipUpToDateTaskExecuter.execute(SkipUpToDateTaskExecuter.java:64)
	at org.gradle.api.internal.tasks.execution.ValidatingTaskExecuter.execute(ValidatingTaskExecuter.java:58)
	at org.gradle.api.internal.tasks.execution.SkipEmptySourceFilesTaskExecuter.execute(SkipEmptySourceFilesTaskExecuter.java:52)
	at org.gradle.api.internal.tasks.execution.SkipTaskWithNoActionsExecuter.execute(SkipTaskWithNoActionsExecuter.java:52)
	at org.gradle.api.internal.tasks.execution.SkipOnlyIfTaskExecuter.execute(SkipOnlyIfTaskExecuter.java:53)
	at org.gradle.api.internal.tasks.execution.ExecuteAtMostOnceTaskExecuter.execute(ExecuteAtMostOnceTaskExecuter.java:43)
	at org.gradle.execution.taskgraph.DefaultTaskGraphExecuter$EventFiringTaskWorker.execute(DefaultTaskGraphExecuter.java:208)
	at org.gradle.execution.taskgraph.DefaultTaskGraphExecuter$EventFiringTaskWorker.execute(DefaultTaskGraphExecuter.java:186)
	at org.gradle.execution.taskgraph.AbstractTaskPlanExecutor$TaskExecutorWorker.processTask(AbstractTaskPlanExecutor.java:62)
	at org.gradle.execution.taskgraph.AbstractTaskPlanExecutor$TaskExecutorWorker.run(AbstractTaskPlanExecutor.java:50)
	at org.gradle.execution.taskgraph.DefaultTaskPlanExecutor.process(DefaultTaskPlanExecutor.java:25)
	at org.gradle.execution.taskgraph.DefaultTaskGraphExecuter.execute(DefaultTaskGraphExecuter.java:111)
	at org.gradle.execution.SelectedTaskExecutionAction.execute(SelectedTaskExecutionAction.java:37)
	at org.gradle.execution.DefaultBuildExecuter.execute(DefaultBuildExecuter.java:62)
	at org.gradle.execution.DefaultBuildExecuter.access$200(DefaultBuildExecuter.java:23)
	at org.gradle.execution.DefaultBuildExecuter$2.proceed(DefaultBuildExecuter.java:68)
	at org.gradle.execution.DryRunBuildExecutionAction.execute(DryRunBuildExecutionAction.java:32)
	at org.gradle.execution.DefaultBuildExecuter.execute(DefaultBuildExecuter.java:62)
	at org.gradle.execution.DefaultBuildExecuter.execute(DefaultBuildExecuter.java:55)
	at org.gradle.initialization.DefaultGradleLauncher$6.run(DefaultGradleLauncher.java:174)
	at org.gradle.internal.Factories$1.create(Factories.java:22)
	at org.gradle.internal.progress.DefaultBuildOperationExecutor.run(DefaultBuildOperationExecutor.java:62)
	at org.gradle.internal.progress.DefaultBuildOperationExecutor.run(DefaultBuildOperationExecutor.java:47)
	at org.gradle.initialization.DefaultGradleLauncher.runBuildOperation(DefaultGradleLauncher.java:189)
	at org.gradle.initialization.DefaultGradleLauncher.doBuildStages(DefaultGradleLauncher.java:171)
	at org.gradle.initialization.DefaultGradleLauncher.access$200(DefaultGradleLauncher.java:35)
	at org.gradle.initialization.DefaultGradleLauncher$1.create(DefaultGradleLauncher.java:104)
	at org.gradle.initialization.DefaultGradleLauncher$1.create(DefaultGradleLauncher.java:97)
	at org.gradle.internal.progress.DefaultBuildOperationExecutor.run(DefaultBuildOperationExecutor.java:62)
	at org.gradle.initialization.DefaultGradleLauncher.runRootBuildOperation(DefaultGradleLauncher.java:184)
	at org.gradle.initialization.DefaultGradleLauncher.doBuild(DefaultGradleLauncher.java:97)
	at org.gradle.initialization.DefaultGradleLauncher.run(DefaultGradleLauncher.java:86)
	at org.gradle.launcher.exec.InProcessBuildActionExecuter$DefaultBuildController.run(InProcessBuildActionExecuter.java:93)
	at org.gradle.tooling.internal.provider.ExecuteBuildActionRunner.run(ExecuteBuildActionRunner.java:28)
	at org.gradle.launcher.exec.ChainingBuildActionRunner.run(ChainingBuildActionRunner.java:35)
	at org.gradle.launcher.exec.InProcessBuildActionExecuter.execute(InProcessBuildActionExecuter.java:43)
	at org.gradle.launcher.exec.InProcessBuildActionExecuter.execute(InProcessBuildActionExecuter.java:27)
	at org.gradle.launcher.exec.ContinuousBuildActionExecuter.execute(ContinuousBuildActionExecuter.java:72)
	at org.gradle.launcher.exec.ContinuousBuildActionExecuter.execute(ContinuousBuildActionExecuter.java:44)
	at org.gradle.launcher.exec.DaemonUsageSuggestingBuildActionExecuter.execute(DaemonUsageSuggestingBuildActionExecuter.java:50)
	at org.gradle.launcher.exec.DaemonUsageSuggestingBuildActionExecuter.execute(DaemonUsageSuggestingBuildActionExecuter.java:27)
	at org.gradle.launcher.cli.RunBuildAction.run(RunBuildAction.java:40)
	at org.gradle.internal.Actions$RunnableActionAdapter.execute(Actions.java:170)
	at org.gradle.launcher.cli.CommandLineActionFactory$ParseAndBuildAction.execute(CommandLineActionFactory.java:237)
	at org.gradle.launcher.cli.CommandLineActionFactory$ParseAndBuildAction.execute(CommandLineActionFactory.java:210)
	at org.gradle.launcher.cli.JavaRuntimeValidationAction.execute(JavaRuntimeValidationAction.java:35)
	at org.gradle.launcher.cli.JavaRuntimeValidationAction.execute(JavaRuntimeValidationAction.java:24)
	at org.gradle.launcher.cli.CommandLineActionFactory$WithLogging.execute(CommandLineActionFactory.java:206)
	at org.gradle.launcher.cli.CommandLineActionFactory$WithLogging.execute(CommandLineActionFactory.java:169)
	at org.gradle.launcher.cli.ExceptionReportingAction.execute(ExceptionReportingAction.java:33)
	at org.gradle.launcher.cli.ExceptionReportingAction.execute(ExceptionReportingAction.java:22)
	at org.gradle.launcher.Main.doAction(Main.java:33)
	at org.gradle.launcher.bootstrap.EntryPoint.run(EntryPoint.java:45)
	at org.gradle.launcher.bootstrap.ProcessBootstrap.runNoExit(ProcessBootstrap.java:54)
	at org.gradle.launcher.bootstrap.ProcessBootstrap.run(ProcessBootstrap.java:35)
	at org.gradle.launcher.GradleMain.main(GradleMain.java:23)
	at org.gradle.wrapper.BootstrapMainStarter.start(BootstrapMainStarter.java:30)
	at org.gradle.wrapper.WrapperExecutor.execute(WrapperExecutor.java:127)
	at org.gradle.wrapper.GradleWrapperMain.main(GradleWrapperMain.java:55)
Caused by: org.gradle.api.InvalidUserDataException: Cannot perform signing task ':signArchives'
because it has no configured signatory
	at org.gradle.plugins.signing.Sign.generate(Sign.groovy:162)
	at org.gradle.internal.reflect.JavaMethod.invoke(JavaMethod.java:75)
	at org.gradle.api.internal.project.taskfactory.AnnotationProcessingTaskFactory$StandardTaskAction.doExecute(AnnotationProcessingTaskFactory.java:226)
	at org.gradle.api.internal.project.taskfactory.AnnotationProcessingTaskFactory$StandardTaskAction.execute(AnnotationProcessingTaskFactory.java:219)
	at org.gradle.api.internal.project.taskfactory.AnnotationProcessingTaskFactory$StandardTaskAction.execute(AnnotationProcessingTaskFactory.java:208)
	at org.gradle.api.internal.AbstractTask$TaskActionWrapper.execute(AbstractTask.java:585)
	at org.gradle.api.internal.AbstractTask$TaskActionWrapper.execute(AbstractTask.java:568)
	at org.gradle.api.internal.tasks.execution.ExecuteActionsTaskExecuter.executeAction(ExecuteActionsTaskExecuter.java:80)
	at org.gradle.api.internal.tasks.execution.ExecuteActionsTaskExecuter.executeActions(ExecuteActionsTaskExecuter.java:61)
	... 61 more


BUILD FAILED

Total time: 10 mins 18.925 secs
Build step 'Invoke Gradle script' changed build result to FAILURE
Build step 'Invoke Gradle script' marked build as failure
Xvfb stopping
Archiving artifacts
Sending artifact delta relative to Zest - Check 2.1-SNAPSHOT distributions from develop branch
on Java7 (Oracle JDK) #25
Archived 4 artifacts
Archive block size is 32768
Received 85 blocks and 35115984 bytes
Compression is 7.3%
Took 12 sec
Recording test results
Publishing Javadoc

Mime
View raw message