polygene-dev mailing list archives

Site index · List index
Message view « Date » · « Thread »
Top « Date » · « Thread »
From Apache Jenkins Server <jenk...@builds.apache.org>
Subject Build failed in Jenkins: Zest - Check 3.0-SNAPSHOT distributions from develop branch on Java7 (Oracle JDK) #42
Date Fri, 31 Jul 2015 18:21:01 GMT
See <https://builds.apache.org/job/Zest%20-%20Check%203.0-SNAPSHOT%20distributions%20from%20develop%20branch%20on%20Java7%20(Oracle%20JDK)/42/changes>

Changes:

[niclas] First round of changes to move to org.apache.zest namespace.

[niclas] Stage 2 of the namespace change. Bulk of documentation fixed.

[niclas] Tightening everything up after massive namespace change. Removal of practically all
"Qi4j" names and references.

[niclas] Need to take a break...

[niclas] A few things were missed in the renaming.

[niclas] Need to rename via a different name, as I am on a OSX case-insensitive file system.

[niclas] Rename to ZestAPI.

[niclas] Groovy support isn't working nicely with IDEA. First fix the build, then worry about
how it should be done instead.

[paul] ZEST-100 Some changes to the release guide after rolling 2.1

[paul] Build, minor: fix Jackson dependency resolution rule

[paulmerlin] Javadoc,minor: fix wrong html tag that was causing errors with Java 8

[paulmerlin] Groovy Support, minor: fix snippet path in documentation

[paulmerlin] ZEST-100 Some changes to the release guide after rolling 2.1

------------------------------------------
[...truncated 158 lines...]
org.apache.zest.extension.entitystore-riak(true) -> beta, good, good
org.apache.zest.extension.entitystore-sql(true) -> stable, good, good
org.apache.zest.extension.indexing-elasticsearch(true) -> beta, good, good
org.apache.zest.extension.indexing-rdf(true) -> stable, brief, good
org.apache.zest.extension.indexing-solr(true) -> stable, brief, some
org.apache.zest.extension.indexing-sql(true) -> stable, brief, good
org.apache.zest.extension.metrics-yammer(true) -> stable, none, some
org.apache.zest.extension.migration(true) -> stable, none, some
org.apache.zest.extension.reindexer(true) -> stable, none, some
org.apache.zest.extension.valueserialization-jackson(true) -> beta, good, complete
org.apache.zest.extension.valueserialization-orgjson(true) -> stable, good, complete
org.apache.zest.extension.valueserialization-stax(true) -> beta, good, complete
org.apache.zest.library.alarm(true) -> stable, brief, some
org.apache.zest.library.circuitbreaker(true) -> stable, good, good
org.apache.zest.library.constraints(true) -> stable, good, good
org.apache.zest.library.conversion(true) -> stable, brief, some
org.apache.zest.library.eventsourcing(true) -> beta, brief, some
org.apache.zest.library.eventsourcing-jdbm(true) -> beta, brief, some
org.apache.zest.library.eventsourcing-rest(true) -> beta, brief, some
org.apache.zest.library.fileconfig(true) -> stable, good, good
org.apache.zest.library.http(true) -> stable, good, good
org.apache.zest.library.invocation-cache(true) -> stable, brief, none
org.apache.zest.library.jmx(true) -> stable, brief, some
org.apache.zest.library.lang-groovy(true) -> beta, good, good
org.apache.zest.library.lang-javascript(true) -> beta, brief, some
org.apache.zest.library.lang-scala(true) -> beta, brief, some
org.apache.zest.library.locking(true) -> stable, brief, some
org.apache.zest.library.logging(true) -> stable, good, good
org.apache.zest.library.metrics(true) -> beta, brief, some
org.apache.zest.library.osgi(true) -> stable, brief, some
org.apache.zest.library.rdf(true) -> stable, none, some
org.apache.zest.library.rest(true) -> stable, none, none
org.apache.zest.library.rest-client(true) -> stable, good, some
org.apache.zest.library.rest-common(true) -> stable, none, none
org.apache.zest.library.rest-server(true) -> stable, none, none
org.apache.zest.library.scheduler(true) -> beta, good, good
org.apache.zest.library.scripting(true) -> stable, none, complete
org.apache.zest.library.servlet(true) -> stable, good, good
org.apache.zest.library.shiro-core(true) -> stable, good, good
org.apache.zest.library.shiro-web(true) -> stable, good, good
org.apache.zest.library.spring(true) -> beta, brief, some
org.apache.zest.library.sql(true) -> stable, good, good
org.apache.zest.library.sql-bonecp(true) -> stable, good, good
org.apache.zest.library.sql-dbcp(true) -> stable, good, good
org.apache.zest.library.sql-liquibase(true) -> stable, good, good
org.apache.zest.library.uid(true) -> stable, good, good
org.apache.zest.library.uowfile(true) -> stable, good, complete
org.apache.zest.tool.envisage(true) -> stable, brief, none
org.apache.zest.tool.model-detail(true) -> stable, brief, none
:clean
:org.apache.zest.core:clean UP-TO-DATE
:org.apache.zest.extensions:clean UP-TO-DATE
:org.apache.zest.libraries:clean UP-TO-DATE
:org.apache.zest.manual:clean UP-TO-DATE
:org.apache.zest.samples:clean UP-TO-DATE
:org.apache.zest.tests:clean UP-TO-DATE
:org.apache.zest.tools:clean UP-TO-DATE
:org.apache.zest.tutorials:clean UP-TO-DATE
:org.apache.zest.core:org.apache.zest.core.api:clean UP-TO-DATE
:org.apache.zest.core:org.apache.zest.core.bootstrap:clean UP-TO-DATE
:org.apache.zest.core:org.apache.zest.core.functional:clean UP-TO-DATE
:org.apache.zest.core:org.apache.zest.core.io:clean UP-TO-DATE
:org.apache.zest.core:org.apache.zest.core.runtime:clean UP-TO-DATE
:org.apache.zest.core:org.apache.zest.core.spi:clean UP-TO-DATE
:org.apache.zest.core:org.apache.zest.core.testsupport:clean UP-TO-DATE
:org.apache.zest.extensions:org.apache.zest.extension.cache-ehcache:clean UP-TO-DATE
:org.apache.zest.extensions:org.apache.zest.extension.cache-memcache:clean UP-TO-DATE
:org.apache.zest.extensions:org.apache.zest.extension.entitystore-file:clean UP-TO-DATE
:org.apache.zest.extensions:org.apache.zest.extension.entitystore-hazelcast:clean UP-TO-DATE
:org.apache.zest.extensions:org.apache.zest.extension.entitystore-jclouds:clean UP-TO-DATE
:org.apache.zest.extensions:org.apache.zest.extension.entitystore-jdbm:clean UP-TO-DATE
:org.apache.zest.extensions:org.apache.zest.extension.entitystore-leveldb:clean UP-TO-DATE
:org.apache.zest.extensions:org.apache.zest.extension.entitystore-memory:clean UP-TO-DATE
:org.apache.zest.extensions:org.apache.zest.extension.entitystore-mongodb:clean UP-TO-DATE
:org.apache.zest.extensions:org.apache.zest.extension.entitystore-preferences:clean UP-TO-DATE
:org.apache.zest.extensions:org.apache.zest.extension.entitystore-redis:clean UP-TO-DATE
:org.apache.zest.extensions:org.apache.zest.extension.entitystore-riak:clean UP-TO-DATE
:org.apache.zest.extensions:org.apache.zest.extension.entitystore-sql:clean UP-TO-DATE
:org.apache.zest.extensions:org.apache.zest.extension.indexing-elasticsearch:clean UP-TO-DATE
:org.apache.zest.extensions:org.apache.zest.extension.indexing-rdf:clean UP-TO-DATE
:org.apache.zest.extensions:org.apache.zest.extension.indexing-solr:clean UP-TO-DATE
:org.apache.zest.extensions:org.apache.zest.extension.indexing-sql:clean UP-TO-DATE
:org.apache.zest.extensions:org.apache.zest.extension.metrics-yammer:clean UP-TO-DATE
:org.apache.zest.extensions:org.apache.zest.extension.migration:clean UP-TO-DATE
:org.apache.zest.extensions:org.apache.zest.extension.reindexer:clean UP-TO-DATE
:org.apache.zest.extensions:org.apache.zest.extension.valueserialization-jackson:clean UP-TO-DATE
:org.apache.zest.extensions:org.apache.zest.extension.valueserialization-orgjson:clean UP-TO-DATE
:org.apache.zest.extensions:org.apache.zest.extension.valueserialization-stax:clean UP-TO-DATE
:org.apache.zest.libraries:org.apache.zest.library.alarm:clean UP-TO-DATE
:org.apache.zest.libraries:org.apache.zest.library.circuitbreaker:clean UP-TO-DATE
:org.apache.zest.libraries:org.apache.zest.library.constraints:clean UP-TO-DATE
:org.apache.zest.libraries:org.apache.zest.library.conversion:clean UP-TO-DATE
:org.apache.zest.libraries:org.apache.zest.library.eventsourcing:clean UP-TO-DATE
:org.apache.zest.libraries:org.apache.zest.library.eventsourcing-jdbm:clean UP-TO-DATE
:org.apache.zest.libraries:org.apache.zest.library.eventsourcing-rest:clean UP-TO-DATE
:org.apache.zest.libraries:org.apache.zest.library.fileconfig:clean UP-TO-DATE
:org.apache.zest.libraries:org.apache.zest.library.http:clean UP-TO-DATE
:org.apache.zest.libraries:org.apache.zest.library.invocation-cache:clean UP-TO-DATE
:org.apache.zest.libraries:org.apache.zest.library.jmx:clean UP-TO-DATE
:org.apache.zest.libraries:org.apache.zest.library.lang-groovy:clean UP-TO-DATE
:org.apache.zest.libraries:org.apache.zest.library.lang-javascript:clean UP-TO-DATE
:org.apache.zest.libraries:org.apache.zest.library.lang-scala:clean UP-TO-DATE
:org.apache.zest.libraries:org.apache.zest.library.locking:clean UP-TO-DATE
:org.apache.zest.libraries:org.apache.zest.library.logging:clean UP-TO-DATE
:org.apache.zest.libraries:org.apache.zest.library.metrics:clean UP-TO-DATE
:org.apache.zest.libraries:org.apache.zest.library.osgi:clean UP-TO-DATE
:org.apache.zest.libraries:org.apache.zest.library.rdf:clean UP-TO-DATE
:org.apache.zest.libraries:org.apache.zest.library.rest:clean UP-TO-DATE
:org.apache.zest.libraries:org.apache.zest.library.rest-client:clean UP-TO-DATE
:org.apache.zest.libraries:org.apache.zest.library.rest-common:clean UP-TO-DATE
:org.apache.zest.libraries:org.apache.zest.library.rest-server:clean UP-TO-DATE
:org.apache.zest.libraries:org.apache.zest.library.scheduler:clean UP-TO-DATE
:org.apache.zest.libraries:org.apache.zest.library.scripting:clean UP-TO-DATE
:org.apache.zest.libraries:org.apache.zest.library.servlet:clean UP-TO-DATE
:org.apache.zest.libraries:org.apache.zest.library.shiro-core:clean UP-TO-DATE
:org.apache.zest.libraries:org.apache.zest.library.shiro-web:clean UP-TO-DATE
:org.apache.zest.libraries:org.apache.zest.library.spring:clean UP-TO-DATE
:org.apache.zest.libraries:org.apache.zest.library.sql:clean UP-TO-DATE
:org.apache.zest.libraries:org.apache.zest.library.sql-bonecp:clean UP-TO-DATE
:org.apache.zest.libraries:org.apache.zest.library.sql-dbcp:clean UP-TO-DATE
:org.apache.zest.libraries:org.apache.zest.library.sql-liquibase:clean UP-TO-DATE
:org.apache.zest.libraries:org.apache.zest.library.uid:clean UP-TO-DATE
:org.apache.zest.libraries:org.apache.zest.library.uowfile:clean UP-TO-DATE
:org.apache.zest.samples:org.apache.zest.sample.dci:clean UP-TO-DATE
:org.apache.zest.samples:org.apache.zest.sample.dci-cargo:clean UP-TO-DATE
:org.apache.zest.samples:org.apache.zest.sample.forum:clean UP-TO-DATE
:org.apache.zest.samples:org.apache.zest.sample.rental:clean UP-TO-DATE
:org.apache.zest.samples:org.apache.zest.sample.sql-support:clean UP-TO-DATE
:org.apache.zest.samples:org.apache.zest.sample.swing:clean UP-TO-DATE
:org.apache.zest.tests:org.apache.zest.test.performance:clean UP-TO-DATE
:org.apache.zest.tests:org.apache.zest.test.regression:clean UP-TO-DATE
:org.apache.zest.tools:org.apache.zest.tool.envisage:clean UP-TO-DATE
:org.apache.zest.tools:org.apache.zest.tool.model-detail:clean UP-TO-DATE
:org.apache.zest.tools:org.apache.zest.tool.shell:clean UP-TO-DATE
:org.apache.zest.tutorials:org.apache.zest.tutorial.cargo:clean UP-TO-DATE
:org.apache.zest.tutorials:org.apache.zest.tutorial.composites:clean UP-TO-DATE
:org.apache.zest.tutorials:org.apache.zest.tutorial.hello:clean UP-TO-DATE
:org.apache.zest.tutorials:org.apache.zest.tutorial.introduction:clean UP-TO-DATE
:org.apache.zest.tutorials:org.apache.zest.tutorial.services:clean UP-TO-DATE
:org.apache.zest.samples:org.apache.zest.sample.dci-cargo:org.apache.zest.sample.dci-cargo.dcisample_a:clean
UP-TO-DATE
:org.apache.zest.samples:org.apache.zest.sample.dci-cargo:org.apache.zest.sample.dci-cargo.dcisample_b:clean
UP-TO-DATE
:org.apache.zest.tutorials:org.apache.zest.tutorial.introduction:org.apache.zest.tutorial.introduction.tenminutes:clean
UP-TO-DATE
:org.apache.zest.tutorials:org.apache.zest.tutorial.introduction:org.apache.zest.tutorial.introduction.thirtyminutes:clean
UP-TO-DATE
:org.apache.zest.tutorials:org.apache.zest.tutorial.introduction:org.apache.zest.tutorial.introduction.twominutes:clean
UP-TO-DATE
:compileJava UP-TO-DATE
:honkerGenDependencies
:honkerGenLicense
:honkerGenNotice
:processResources UP-TO-DATE
:classes
:jar
:honkerCheck
:rat FAILED

FAILURE: Build failed with an exception.

* What went wrong:
Execution failed for task ':rat'.
> Found 3 files with unapproved/unknown licenses. See <https://builds.apache.org/job/Zest%20-%20Check%203.0-SNAPSHOT%20distributions%20from%20develop%20branch%20on%20Java7%20(Oracle%20JDK)/ws/build/reports/rat/index.html>

* Try:
Run with --info or --debug option to get more log output.

* Exception is:
org.gradle.api.tasks.TaskExecutionException: Execution failed for task ':rat'.
	at org.gradle.api.internal.tasks.execution.ExecuteActionsTaskExecuter.executeActions(ExecuteActionsTaskExecuter.java:69)
	at org.gradle.api.internal.tasks.execution.ExecuteActionsTaskExecuter.execute(ExecuteActionsTaskExecuter.java:46)
	at org.gradle.api.internal.tasks.execution.PostExecutionAnalysisTaskExecuter.execute(PostExecutionAnalysisTaskExecuter.java:35)
	at org.gradle.api.internal.tasks.execution.SkipUpToDateTaskExecuter.execute(SkipUpToDateTaskExecuter.java:64)
	at org.gradle.api.internal.tasks.execution.ValidatingTaskExecuter.execute(ValidatingTaskExecuter.java:58)
	at org.gradle.api.internal.tasks.execution.SkipEmptySourceFilesTaskExecuter.execute(SkipEmptySourceFilesTaskExecuter.java:52)
	at org.gradle.api.internal.tasks.execution.SkipTaskWithNoActionsExecuter.execute(SkipTaskWithNoActionsExecuter.java:52)
	at org.gradle.api.internal.tasks.execution.SkipOnlyIfTaskExecuter.execute(SkipOnlyIfTaskExecuter.java:53)
	at org.gradle.api.internal.tasks.execution.ExecuteAtMostOnceTaskExecuter.execute(ExecuteAtMostOnceTaskExecuter.java:43)
	at org.gradle.execution.taskgraph.DefaultTaskGraphExecuter$EventFiringTaskWorker.execute(DefaultTaskGraphExecuter.java:208)
	at org.gradle.execution.taskgraph.DefaultTaskGraphExecuter$EventFiringTaskWorker.execute(DefaultTaskGraphExecuter.java:186)
	at org.gradle.execution.taskgraph.AbstractTaskPlanExecutor$TaskExecutorWorker.processTask(AbstractTaskPlanExecutor.java:62)
	at org.gradle.execution.taskgraph.AbstractTaskPlanExecutor$TaskExecutorWorker.run(AbstractTaskPlanExecutor.java:50)
	at org.gradle.execution.taskgraph.DefaultTaskPlanExecutor.process(DefaultTaskPlanExecutor.java:25)
	at org.gradle.execution.taskgraph.DefaultTaskGraphExecuter.execute(DefaultTaskGraphExecuter.java:111)
	at org.gradle.execution.SelectedTaskExecutionAction.execute(SelectedTaskExecutionAction.java:37)
	at org.gradle.execution.DefaultBuildExecuter.execute(DefaultBuildExecuter.java:62)
	at org.gradle.execution.DefaultBuildExecuter.access$200(DefaultBuildExecuter.java:23)
	at org.gradle.execution.DefaultBuildExecuter$2.proceed(DefaultBuildExecuter.java:68)
	at org.gradle.execution.DryRunBuildExecutionAction.execute(DryRunBuildExecutionAction.java:32)
	at org.gradle.execution.DefaultBuildExecuter.execute(DefaultBuildExecuter.java:62)
	at org.gradle.execution.DefaultBuildExecuter.execute(DefaultBuildExecuter.java:55)
	at org.gradle.initialization.DefaultGradleLauncher$6.run(DefaultGradleLauncher.java:174)
	at org.gradle.internal.Factories$1.create(Factories.java:22)
	at org.gradle.internal.progress.DefaultBuildOperationExecutor.run(DefaultBuildOperationExecutor.java:62)
	at org.gradle.internal.progress.DefaultBuildOperationExecutor.run(DefaultBuildOperationExecutor.java:47)
	at org.gradle.initialization.DefaultGradleLauncher.runBuildOperation(DefaultGradleLauncher.java:189)
	at org.gradle.initialization.DefaultGradleLauncher.doBuildStages(DefaultGradleLauncher.java:171)
	at org.gradle.initialization.DefaultGradleLauncher.access$200(DefaultGradleLauncher.java:35)
	at org.gradle.initialization.DefaultGradleLauncher$1.create(DefaultGradleLauncher.java:104)
	at org.gradle.initialization.DefaultGradleLauncher$1.create(DefaultGradleLauncher.java:97)
	at org.gradle.internal.progress.DefaultBuildOperationExecutor.run(DefaultBuildOperationExecutor.java:62)
	at org.gradle.initialization.DefaultGradleLauncher.runRootBuildOperation(DefaultGradleLauncher.java:184)
	at org.gradle.initialization.DefaultGradleLauncher.doBuild(DefaultGradleLauncher.java:97)
	at org.gradle.initialization.DefaultGradleLauncher.run(DefaultGradleLauncher.java:86)
	at org.gradle.launcher.exec.InProcessBuildActionExecuter$DefaultBuildController.run(InProcessBuildActionExecuter.java:93)
	at org.gradle.tooling.internal.provider.ExecuteBuildActionRunner.run(ExecuteBuildActionRunner.java:28)
	at org.gradle.launcher.exec.ChainingBuildActionRunner.run(ChainingBuildActionRunner.java:35)
	at org.gradle.launcher.exec.InProcessBuildActionExecuter.execute(InProcessBuildActionExecuter.java:43)
	at org.gradle.launcher.exec.InProcessBuildActionExecuter.execute(InProcessBuildActionExecuter.java:27)
	at org.gradle.launcher.exec.ContinuousBuildActionExecuter.execute(ContinuousBuildActionExecuter.java:72)
	at org.gradle.launcher.exec.ContinuousBuildActionExecuter.execute(ContinuousBuildActionExecuter.java:44)
	at org.gradle.launcher.exec.DaemonUsageSuggestingBuildActionExecuter.execute(DaemonUsageSuggestingBuildActionExecuter.java:50)
	at org.gradle.launcher.exec.DaemonUsageSuggestingBuildActionExecuter.execute(DaemonUsageSuggestingBuildActionExecuter.java:27)
	at org.gradle.launcher.cli.RunBuildAction.run(RunBuildAction.java:40)
	at org.gradle.internal.Actions$RunnableActionAdapter.execute(Actions.java:170)
	at org.gradle.launcher.cli.CommandLineActionFactory$ParseAndBuildAction.execute(CommandLineActionFactory.java:237)
	at org.gradle.launcher.cli.CommandLineActionFactory$ParseAndBuildAction.execute(CommandLineActionFactory.java:210)
	at org.gradle.launcher.cli.JavaRuntimeValidationAction.execute(JavaRuntimeValidationAction.java:35)
	at org.gradle.launcher.cli.JavaRuntimeValidationAction.execute(JavaRuntimeValidationAction.java:24)
	at org.gradle.launcher.cli.CommandLineActionFactory$WithLogging.execute(CommandLineActionFactory.java:206)
	at org.gradle.launcher.cli.CommandLineActionFactory$WithLogging.execute(CommandLineActionFactory.java:169)
	at org.gradle.launcher.cli.ExceptionReportingAction.execute(ExceptionReportingAction.java:33)
	at org.gradle.launcher.cli.ExceptionReportingAction.execute(ExceptionReportingAction.java:22)
	at org.gradle.launcher.Main.doAction(Main.java:33)
	at org.gradle.launcher.bootstrap.EntryPoint.run(EntryPoint.java:45)
	at org.gradle.launcher.bootstrap.ProcessBootstrap.runNoExit(ProcessBootstrap.java:54)
	at org.gradle.launcher.bootstrap.ProcessBootstrap.run(ProcessBootstrap.java:35)
	at org.gradle.launcher.GradleMain.main(GradleMain.java:23)
	at org.gradle.wrapper.BootstrapMainStarter.start(BootstrapMainStarter.java:30)
	at org.gradle.wrapper.WrapperExecutor.execute(WrapperExecutor.java:127)
	at org.gradle.wrapper.GradleWrapperMain.main(GradleWrapperMain.java:55)
Caused by: org.gradle.api.GradleException: Found 3 files with unapproved/unknown licenses.
See <https://builds.apache.org/job/Zest%20-%20Check%203.0-SNAPSHOT%20distributions%20from%20develop%20branch%20on%20Java7%20(Oracle%20JDK)/ws/build/reports/rat/index.html>
	at org.apache.rat.gradle.RatTask.rat(RatTask.groovy:53)
	at org.gradle.internal.reflect.JavaMethod.invoke(JavaMethod.java:75)
	at org.gradle.api.internal.project.taskfactory.AnnotationProcessingTaskFactory$StandardTaskAction.doExecute(AnnotationProcessingTaskFactory.java:226)
	at org.gradle.api.internal.project.taskfactory.AnnotationProcessingTaskFactory$StandardTaskAction.execute(AnnotationProcessingTaskFactory.java:219)
	at org.gradle.api.internal.project.taskfactory.AnnotationProcessingTaskFactory$StandardTaskAction.execute(AnnotationProcessingTaskFactory.java:208)
	at org.gradle.api.internal.AbstractTask$TaskActionWrapper.execute(AbstractTask.java:585)
	at org.gradle.api.internal.AbstractTask$TaskActionWrapper.execute(AbstractTask.java:568)
	at org.gradle.api.internal.tasks.execution.ExecuteActionsTaskExecuter.executeAction(ExecuteActionsTaskExecuter.java:80)
	at org.gradle.api.internal.tasks.execution.ExecuteActionsTaskExecuter.executeActions(ExecuteActionsTaskExecuter.java:61)
	... 61 more


BUILD FAILED

Total time: 1 mins 27.812 secs
Build step 'Invoke Gradle script' changed build result to FAILURE
Build step 'Invoke Gradle script' marked build as failure
Xvfb stopping
Archiving artifacts
Recording test results
Publishing Javadoc

Mime
View raw message