polygene-dev mailing list archives

Site index · List index
Message view « Date » · « Thread »
Top « Date » · « Thread »
From Apache Jenkins Server <jenk...@builds.apache.org>
Subject Build failed in Jenkins: Zest - Check 2.1-SNAPSHOT distributions from develop branch on Java8 (OpenJDK) #16
Date Thu, 23 Jul 2015 01:02:39 GMT
See <https://builds.apache.org/job/Zest%20-%20Check%202.1-SNAPSHOT%20distributions%20from%20develop%20branch%20on%20Java8%20(OpenJDK)/16/changes>

Changes:

[paulmerlin] ZEST-100 Better ‘Update the Zest website’ section

[paulmerlin] ZEST-100 Enhanced ‘Prepare Release-Notes’ section

[paulmerlin] ZEST-100 Warn about unix-like-only process

[paulmerlin] ZEST-100 Fix commands for dev/release dist uploads, they were too greedy

[paulmerlin] Build javadocs with links to joda-time, json.org and junit apis

[paulmerlin] Build now skip asciidoc tasks if not installed, except for releases

[paulmerlin] ZEST-25 Better build instructions in source distribution

[paulmerlin] ZEST-25 Add skipSigning build property set in src dist gradle.properties

[paulmerlin] Solr Idx/Query: remove javadoc offending constructor from internal code

[paulmerlin] ZEST-25 Add missing files into source distribution

[paulmerlin] ZEST-25 Add skipAsciidocIfAbsent build property set in src dist gradle.properties

[paulmerlin] ZEST-25 checkSrcDist task now run ‘check assemble’ inside source dist

[paulmerlin] Attempt to fix compilation with OpenJDK 8 in PropertyModel

[paulmerlin] ZEST-25 Fix wrong folder for javadocs in binary distribution

------------------------------------------
[...truncated 7973 lines...]
     * @param fromUnLocode
       ^
<https://builds.apache.org/job/Zest%20-%20Check%202.1-SNAPSHOT%20distributions%20from%20develop%20branch%20on%20Java8%20(OpenJDK)/ws/build/unpacked-distributions/src/apache-zest-java-2.1-SNAPSHOT-src/samples/dci-cargo/dcisample_a/src/main/java/org/qi4j/sample/dcicargo/pathfinder_a/api/TransitEdge.java>:41:
warning: no description for @param
     * @param toUnLocode
       ^
<https://builds.apache.org/job/Zest%20-%20Check%202.1-SNAPSHOT%20distributions%20from%20develop%20branch%20on%20Java8%20(OpenJDK)/ws/build/unpacked-distributions/src/apache-zest-java-2.1-SNAPSHOT-src/samples/dci-cargo/dcisample_a/src/main/java/org/qi4j/sample/dcicargo/pathfinder_a/api/TransitEdge.java>:42:
warning: no description for @param
     * @param fromDate
       ^
<https://builds.apache.org/job/Zest%20-%20Check%202.1-SNAPSHOT%20distributions%20from%20develop%20branch%20on%20Java8%20(OpenJDK)/ws/build/unpacked-distributions/src/apache-zest-java-2.1-SNAPSHOT-src/samples/dci-cargo/dcisample_a/src/main/java/org/qi4j/sample/dcicargo/pathfinder_a/api/TransitEdge.java>:43:
warning: no description for @param
     * @param toDate
       ^

11 warnings
:org.qi4j:org.qi4j.samples:org.qi4j.sample.dci-cargo:org.qi4j.sample.dci-cargo.dcisample_a:javadocJar
:org.qi4j:org.qi4j.samples:org.qi4j.sample.dci-cargo:org.qi4j.sample.dci-cargo.dcisample_a:sourceJar
:org.qi4j:org.qi4j.samples:org.qi4j.sample.dci-cargo:org.qi4j.sample.dci-cargo.dcisample_a:testSourceJar
:org.qi4j:org.qi4j.samples:org.qi4j.sample.dci-cargo:org.qi4j.sample.dci-cargo.dcisample_a:signArchives
SKIPPED
:org.qi4j:org.qi4j.samples:org.qi4j.sample.dci-cargo:org.qi4j.sample.dci-cargo.dcisample_a:assemble
:org.qi4j:org.qi4j.samples:org.qi4j.sample.dci-cargo:org.qi4j.sample.dci-cargo.dcisample_a:dependencyReport
:org.qi4j:org.qi4j.samples:org.qi4j.sample.dci-cargo:org.qi4j.sample.dci-cargo.dcisample_b:processVersionResources
UP-TO-DATE
:org.qi4j:org.qi4j.samples:org.qi4j.sample.dci-cargo:org.qi4j.sample.dci-cargo.dcisample_b:versionClasses
:org.qi4j:org.qi4j.samples:org.qi4j.sample.dci-cargo:org.qi4j.sample.dci-cargo.dcisample_b:jar
:org.qi4j:org.qi4j.samples:org.qi4j.sample.dci-cargo:org.qi4j.sample.dci-cargo.dcisample_b:javadoc<https://builds.apache.org/job/Zest%20-%20Check%202.1-SNAPSHOT%20distributions%20from%20develop%20branch%20on%20Java8%20(OpenJDK)/ws/build/unpacked-distributions/src/apache-zest-java-2.1-SNAPSHOT-src/samples/dci-cargo/dcisample_b/src/main/java/org/qi4j/sample/dcicargo/sample_b/context/service/routing/RoutingService.java>:61:
warning: no @throws for org.qi4j.sample.dcicargo.sample_b.context.service.routing.exception.FoundNoRoutesException
    List<Itinerary> fetchRoutesForSpecification( RouteSpecification routeSpecification
)
                    ^
<https://builds.apache.org/job/Zest%20-%20Check%202.1-SNAPSHOT%20distributions%20from%20develop%20branch%20on%20Java8%20(OpenJDK)/ws/build/unpacked-distributions/src/apache-zest-java-2.1-SNAPSHOT-src/samples/dci-cargo/dcisample_b/src/main/java/org/qi4j/sample/dcicargo/pathfinder_b/api/GraphTraversalService.java>:33:
warning: no description for @param
     * @param departureDate
       ^
<https://builds.apache.org/job/Zest%20-%20Check%202.1-SNAPSHOT%20distributions%20from%20develop%20branch%20on%20Java8%20(OpenJDK)/ws/build/unpacked-distributions/src/apache-zest-java-2.1-SNAPSHOT-src/samples/dci-cargo/dcisample_b/src/main/java/org/qi4j/sample/dcicargo/pathfinder_b/api/TransitEdge.java>:39:
warning: no description for @param
     * @param voyageNumber
       ^
<https://builds.apache.org/job/Zest%20-%20Check%202.1-SNAPSHOT%20distributions%20from%20develop%20branch%20on%20Java8%20(OpenJDK)/ws/build/unpacked-distributions/src/apache-zest-java-2.1-SNAPSHOT-src/samples/dci-cargo/dcisample_b/src/main/java/org/qi4j/sample/dcicargo/pathfinder_b/api/TransitEdge.java>:40:
warning: no description for @param
     * @param fromUnLocode
       ^
<https://builds.apache.org/job/Zest%20-%20Check%202.1-SNAPSHOT%20distributions%20from%20develop%20branch%20on%20Java8%20(OpenJDK)/ws/build/unpacked-distributions/src/apache-zest-java-2.1-SNAPSHOT-src/samples/dci-cargo/dcisample_b/src/main/java/org/qi4j/sample/dcicargo/pathfinder_b/api/TransitEdge.java>:41:
warning: no description for @param
     * @param toUnLocode
       ^
<https://builds.apache.org/job/Zest%20-%20Check%202.1-SNAPSHOT%20distributions%20from%20develop%20branch%20on%20Java8%20(OpenJDK)/ws/build/unpacked-distributions/src/apache-zest-java-2.1-SNAPSHOT-src/samples/dci-cargo/dcisample_b/src/main/java/org/qi4j/sample/dcicargo/pathfinder_b/api/TransitEdge.java>:42:
warning: no description for @param
     * @param fromDate
       ^
<https://builds.apache.org/job/Zest%20-%20Check%202.1-SNAPSHOT%20distributions%20from%20develop%20branch%20on%20Java8%20(OpenJDK)/ws/build/unpacked-distributions/src/apache-zest-java-2.1-SNAPSHOT-src/samples/dci-cargo/dcisample_b/src/main/java/org/qi4j/sample/dcicargo/pathfinder_b/api/TransitEdge.java>:43:
warning: no description for @param
     * @param toDate
       ^
<https://builds.apache.org/job/Zest%20-%20Check%202.1-SNAPSHOT%20distributions%20from%20develop%20branch%20on%20Java8%20(OpenJDK)/ws/build/unpacked-distributions/src/apache-zest-java-2.1-SNAPSHOT-src/samples/dci-cargo/dcisample_b/src/main/java/org/qi4j/sample/dcicargo/sample_b/infrastructure/dci/RoleMixin.java>:60:
warning: no @param for context
    public void setContext( T context )
                ^
<https://builds.apache.org/job/Zest%20-%20Check%202.1-SNAPSHOT%20distributions%20from%20develop%20branch%20on%20Java8%20(OpenJDK)/ws/build/unpacked-distributions/src/apache-zest-java-2.1-SNAPSHOT-src/samples/dci-cargo/dcisample_b/src/main/java/org/qi4j/sample/dcicargo/sample_b/infrastructure/WicketQi4jApplication.java>:84:
warning: no @return
    protected ApplicationAssembler getAssembler()
                                   ^
<https://builds.apache.org/job/Zest%20-%20Check%202.1-SNAPSHOT%20distributions%20from%20develop%20branch%20on%20Java8%20(OpenJDK)/ws/build/unpacked-distributions/src/apache-zest-java-2.1-SNAPSHOT-src/samples/dci-cargo/dcisample_b/src/main/java/org/qi4j/sample/dcicargo/sample_b/infrastructure/WicketQi4jApplication.java>:84:
warning: no @throws for java.lang.Exception
    protected ApplicationAssembler getAssembler()
                                   ^
<https://builds.apache.org/job/Zest%20-%20Check%202.1-SNAPSHOT%20distributions%20from%20develop%20branch%20on%20Java8%20(OpenJDK)/ws/build/unpacked-distributions/src/apache-zest-java-2.1-SNAPSHOT-src/samples/dci-cargo/dcisample_b/src/main/java/org/qi4j/sample/dcicargo/sample_b/infrastructure/model/ReadOnlyModel.java>:46:
warning: no description for @throws
     * @throws UnsupportedOperationException
       ^

11 warnings
:org.qi4j:org.qi4j.samples:org.qi4j.sample.dci-cargo:org.qi4j.sample.dci-cargo.dcisample_b:javadocJar
:org.qi4j:org.qi4j.samples:org.qi4j.sample.dci-cargo:org.qi4j.sample.dci-cargo.dcisample_b:sourceJar
:org.qi4j:org.qi4j.samples:org.qi4j.sample.dci-cargo:org.qi4j.sample.dci-cargo.dcisample_b:testSourceJar
:org.qi4j:org.qi4j.samples:org.qi4j.sample.dci-cargo:org.qi4j.sample.dci-cargo.dcisample_b:signArchives
SKIPPED
:org.qi4j:org.qi4j.samples:org.qi4j.sample.dci-cargo:org.qi4j.sample.dci-cargo.dcisample_b:assemble
:org.qi4j:org.qi4j.samples:org.qi4j.sample.dci-cargo:org.qi4j.sample.dci-cargo.dcisample_b:dependencyReport
:org.qi4j:org.qi4j.tutorials:org.qi4j.tutorial.introduction:org.qi4j.tutorial.introduction.tenminutes:javadoc
:org.qi4j:org.qi4j.tutorials:org.qi4j.tutorial.introduction:org.qi4j.tutorial.introduction.tenminutes:javadocJar
:org.qi4j:org.qi4j.tutorials:org.qi4j.tutorial.introduction:org.qi4j.tutorial.introduction.tenminutes:sourceJar
:org.qi4j:org.qi4j.tutorials:org.qi4j.tutorial.introduction:org.qi4j.tutorial.introduction.tenminutes:testSourceJar
:org.qi4j:org.qi4j.tutorials:org.qi4j.tutorial.introduction:org.qi4j.tutorial.introduction.tenminutes:signArchives
SKIPPED
:org.qi4j:org.qi4j.tutorials:org.qi4j.tutorial.introduction:org.qi4j.tutorial.introduction.tenminutes:assemble
:org.qi4j:org.qi4j.tutorials:org.qi4j.tutorial.introduction:org.qi4j.tutorial.introduction.tenminutes:dependencyReport
:org.qi4j:org.qi4j.tutorials:org.qi4j.tutorial.introduction:org.qi4j.tutorial.introduction.thirtyminutes:processVersionResources
UP-TO-DATE
:org.qi4j:org.qi4j.tutorials:org.qi4j.tutorial.introduction:org.qi4j.tutorial.introduction.thirtyminutes:versionClasses
:org.qi4j:org.qi4j.tutorials:org.qi4j.tutorial.introduction:org.qi4j.tutorial.introduction.thirtyminutes:jar
:org.qi4j:org.qi4j.tutorials:org.qi4j.tutorial.introduction:org.qi4j.tutorial.introduction.thirtyminutes:javadoc
:org.qi4j:org.qi4j.tutorials:org.qi4j.tutorial.introduction:org.qi4j.tutorial.introduction.thirtyminutes:javadocJar
:org.qi4j:org.qi4j.tutorials:org.qi4j.tutorial.introduction:org.qi4j.tutorial.introduction.thirtyminutes:sourceJar
:org.qi4j:org.qi4j.tutorials:org.qi4j.tutorial.introduction:org.qi4j.tutorial.introduction.thirtyminutes:testSourceJar
:org.qi4j:org.qi4j.tutorials:org.qi4j.tutorial.introduction:org.qi4j.tutorial.introduction.thirtyminutes:signArchives
SKIPPED
:org.qi4j:org.qi4j.tutorials:org.qi4j.tutorial.introduction:org.qi4j.tutorial.introduction.thirtyminutes:assemble
:org.qi4j:org.qi4j.tutorials:org.qi4j.tutorial.introduction:org.qi4j.tutorial.introduction.thirtyminutes:dependencyReport
:org.qi4j:org.qi4j.tutorials:org.qi4j.tutorial.introduction:org.qi4j.tutorial.introduction.twominutes:processVersionResources
UP-TO-DATE
:org.qi4j:org.qi4j.tutorials:org.qi4j.tutorial.introduction:org.qi4j.tutorial.introduction.twominutes:versionClasses
:org.qi4j:org.qi4j.tutorials:org.qi4j.tutorial.introduction:org.qi4j.tutorial.introduction.twominutes:jar
:org.qi4j:org.qi4j.tutorials:org.qi4j.tutorial.introduction:org.qi4j.tutorial.introduction.twominutes:javadoc
:org.qi4j:org.qi4j.tutorials:org.qi4j.tutorial.introduction:org.qi4j.tutorial.introduction.twominutes:javadocJar
:org.qi4j:org.qi4j.tutorials:org.qi4j.tutorial.introduction:org.qi4j.tutorial.introduction.twominutes:sourceJar
:org.qi4j:org.qi4j.tutorials:org.qi4j.tutorial.introduction:org.qi4j.tutorial.introduction.twominutes:testSourceJar
:org.qi4j:org.qi4j.tutorials:org.qi4j.tutorial.introduction:org.qi4j.tutorial.introduction.twominutes:signArchives
SKIPPED
:org.qi4j:org.qi4j.tutorials:org.qi4j.tutorial.introduction:org.qi4j.tutorial.introduction.twominutes:assemble
:org.qi4j:org.qi4j.tutorials:org.qi4j.tutorial.introduction:org.qi4j.tutorial.introduction.twominutes:dependencyReport
:org.qi4j:buildAll
:org.qi4j:generateBinDistGoOfflineHelpers
:org.qi4j:tarBinaries
:org.qi4j:srcDistFilteredFiles
:org.qi4j:tarSources
:org.qi4j:zipBinaries
:org.qi4j:zipSources
:org.qi4j:signArchives SKIPPED
:org.qi4j:assemble

Test failures in:
  org.qi4j.extension.valueserialization-stax

:org.qi4j:assemble FAILED
:checkSrcDist FAILED

FAILURE: Build failed with an exception.

* Where:
Build file '<https://builds.apache.org/job/Zest%20-%20Check%202.1-SNAPSHOT%20distributions%20from%20develop%20branch%20on%20Java8%20(OpenJDK)/ws/build/unpacked-distributions/src/apache-zest-java-2.1-SNAPSHOT-src/build.gradle'>
line: 452

* What went wrong:
Execution failed for task ':assemble'.
> There was TEST FAILURES!! See list above.

* Try:
Run with --info or --debug option to get more log output.

* Exception is:
org.gradle.api.tasks.TaskExecutionException: Execution failed for task ':assemble'.
	at org.gradle.api.internal.tasks.execution.ExecuteActionsTaskExecuter.executeActions(ExecuteActionsTaskExecuter.java:69)
	at org.gradle.api.internal.tasks.execution.ExecuteActionsTaskExecuter.execute(ExecuteActionsTaskExecuter.java:46)
	at org.gradle.api.internal.tasks.execution.PostExecutionAnalysisTaskExecuter.execute(PostExecutionAnalysisTaskExecuter.java:35)
	at org.gradle.api.internal.tasks.execution.SkipUpToDateTaskExecuter.execute(SkipUpToDateTaskExecuter.java:64)
	at org.gradle.api.internal.tasks.execution.ValidatingTaskExecuter.execute(ValidatingTaskExecuter.java:58)
	at org.gradle.api.internal.tasks.execution.SkipEmptySourceFilesTaskExecuter.execute(SkipEmptySourceFilesTaskExecuter.java:52)
	at org.gradle.api.internal.tasks.execution.SkipTaskWithNoActionsExecuter.execute(SkipTaskWithNoActionsExecuter.java:52)
	at org.gradle.api.internal.tasks.execution.SkipOnlyIfTaskExecuter.execute(SkipOnlyIfTaskExecuter.java:53)
	at org.gradle.api.internal.tasks.execution.ExecuteAtMostOnceTaskExecuter.execute(ExecuteAtMostOnceTaskExecuter.java:43)
	at org.gradle.execution.taskgraph.DefaultTaskGraphExecuter$EventFiringTaskWorker.execute(DefaultTaskGraphExecuter.java:208)
	at org.gradle.execution.taskgraph.DefaultTaskGraphExecuter$EventFiringTaskWorker.execute(DefaultTaskGraphExecuter.java:186)
	at org.gradle.execution.taskgraph.AbstractTaskPlanExecutor$TaskExecutorWorker.processTask(AbstractTaskPlanExecutor.java:62)
	at org.gradle.execution.taskgraph.AbstractTaskPlanExecutor$TaskExecutorWorker.run(AbstractTaskPlanExecutor.java:50)
	at org.gradle.execution.taskgraph.DefaultTaskPlanExecutor.process(DefaultTaskPlanExecutor.java:25)
	at org.gradle.execution.taskgraph.DefaultTaskGraphExecuter.execute(DefaultTaskGraphExecuter.java:111)
	at org.gradle.execution.SelectedTaskExecutionAction.execute(SelectedTaskExecutionAction.java:37)
	at org.gradle.execution.DefaultBuildExecuter.execute(DefaultBuildExecuter.java:62)
	at org.gradle.execution.DefaultBuildExecuter.access$200(DefaultBuildExecuter.java:23)
	at org.gradle.execution.DefaultBuildExecuter$2.proceed(DefaultBuildExecuter.java:68)
	at org.gradle.execution.DryRunBuildExecutionAction.execute(DryRunBuildExecutionAction.java:32)
	at org.gradle.execution.DefaultBuildExecuter.execute(DefaultBuildExecuter.java:62)
	at org.gradle.execution.DefaultBuildExecuter.execute(DefaultBuildExecuter.java:55)
	at org.gradle.initialization.DefaultGradleLauncher$6.run(DefaultGradleLauncher.java:174)
	at org.gradle.internal.Factories$1.create(Factories.java:22)
	at org.gradle.internal.progress.DefaultBuildOperationExecutor.run(DefaultBuildOperationExecutor.java:62)
	at org.gradle.internal.progress.DefaultBuildOperationExecutor.run(DefaultBuildOperationExecutor.java:47)
	at org.gradle.initialization.DefaultGradleLauncher.runBuildOperation(DefaultGradleLauncher.java:189)
	at org.gradle.initialization.DefaultGradleLauncher.doBuildStages(DefaultGradleLauncher.java:171)
	at org.gradle.initialization.DefaultGradleLauncher.access$200(DefaultGradleLauncher.java:35)
	at org.gradle.initialization.DefaultGradleLauncher$1.create(DefaultGradleLauncher.java:104)
	at org.gradle.initialization.DefaultGradleLauncher$1.create(DefaultGradleLauncher.java:97)
	at org.gradle.internal.progress.DefaultBuildOperationExecutor.run(DefaultBuildOperationExecutor.java:62)
	at org.gradle.initialization.DefaultGradleLauncher.runRootBuildOperation(DefaultGradleLauncher.java:184)
	at org.gradle.initialization.DefaultGradleLauncher.doBuild(DefaultGradleLauncher.java:97)
	at org.gradle.initialization.DefaultGradleLauncher.run(DefaultGradleLauncher.java:86)
	at org.gradle.api.tasks.GradleBuild.build(GradleBuild.java:117)
	at org.gradle.internal.reflect.JavaMethod.invoke(JavaMethod.java:75)
	at org.gradle.api.internal.project.taskfactory.AnnotationProcessingTaskFactory$StandardTaskAction.doExecute(AnnotationProcessingTaskFactory.java:226)
	at org.gradle.api.internal.project.taskfactory.AnnotationProcessingTaskFactory$StandardTaskAction.execute(AnnotationProcessingTaskFactory.java:219)
	at org.gradle.api.internal.project.taskfactory.AnnotationProcessingTaskFactory$StandardTaskAction.execute(AnnotationProcessingTaskFactory.java:208)
	at org.gradle.api.internal.AbstractTask$TaskActionWrapper.execute(AbstractTask.java:585)
	at org.gradle.api.internal.AbstractTask$TaskActionWrapper.execute(AbstractTask.java:568)
	at org.gradle.api.internal.tasks.execution.ExecuteActionsTaskExecuter.executeAction(ExecuteActionsTaskExecuter.java:80)
	at org.gradle.api.internal.tasks.execution.ExecuteActionsTaskExecuter.executeActions(ExecuteActionsTaskExecuter.java:61)
	at org.gradle.api.internal.tasks.execution.ExecuteActionsTaskExecuter.execute(ExecuteActionsTaskExecuter.java:46)
	at org.gradle.api.internal.tasks.execution.PostExecutionAnalysisTaskExecuter.execute(PostExecutionAnalysisTaskExecuter.java:35)
	at org.gradle.api.internal.tasks.execution.SkipUpToDateTaskExecuter.execute(SkipUpToDateTaskExecuter.java:64)
	at org.gradle.api.internal.tasks.execution.ValidatingTaskExecuter.execute(ValidatingTaskExecuter.java:58)
	at org.gradle.api.internal.tasks.execution.SkipEmptySourceFilesTaskExecuter.execute(SkipEmptySourceFilesTaskExecuter.java:52)
	at org.gradle.api.internal.tasks.execution.SkipTaskWithNoActionsExecuter.execute(SkipTaskWithNoActionsExecuter.java:52)
	at org.gradle.api.internal.tasks.execution.SkipOnlyIfTaskExecuter.execute(SkipOnlyIfTaskExecuter.java:53)
	at org.gradle.api.internal.tasks.execution.ExecuteAtMostOnceTaskExecuter.execute(ExecuteAtMostOnceTaskExecuter.java:43)
	at org.gradle.execution.taskgraph.DefaultTaskGraphExecuter$EventFiringTaskWorker.execute(DefaultTaskGraphExecuter.java:208)
	at org.gradle.execution.taskgraph.DefaultTaskGraphExecuter$EventFiringTaskWorker.execute(DefaultTaskGraphExecuter.java:186)
	at org.gradle.execution.taskgraph.AbstractTaskPlanExecutor$TaskExecutorWorker.processTask(AbstractTaskPlanExecutor.java:62)
	at org.gradle.execution.taskgraph.AbstractTaskPlanExecutor$TaskExecutorWorker.run(AbstractTaskPlanExecutor.java:50)
	at org.gradle.execution.taskgraph.DefaultTaskPlanExecutor.process(DefaultTaskPlanExecutor.java:25)
	at org.gradle.execution.taskgraph.DefaultTaskGraphExecuter.execute(DefaultTaskGraphExecuter.java:111)
	at org.gradle.execution.SelectedTaskExecutionAction.execute(SelectedTaskExecutionAction.java:37)
	at org.gradle.execution.DefaultBuildExecuter.execute(DefaultBuildExecuter.java:62)
	at org.gradle.execution.DefaultBuildExecuter.access$200(DefaultBuildExecuter.java:23)
	at org.gradle.execution.DefaultBuildExecuter$2.proceed(DefaultBuildExecuter.java:68)
	at org.gradle.execution.DryRunBuildExecutionAction.execute(DryRunBuildExecutionAction.java:32)
	at org.gradle.execution.DefaultBuildExecuter.execute(DefaultBuildExecuter.java:62)
	at org.gradle.execution.DefaultBuildExecuter.execute(DefaultBuildExecuter.java:55)
	at org.gradle.initialization.DefaultGradleLauncher$6.run(DefaultGradleLauncher.java:174)
	at org.gradle.internal.Factories$1.create(Factories.java:22)
	at org.gradle.internal.progress.DefaultBuildOperationExecutor.run(DefaultBuildOperationExecutor.java:62)
	at org.gradle.internal.progress.DefaultBuildOperationExecutor.run(DefaultBuildOperationExecutor.java:47)
	at org.gradle.initialization.DefaultGradleLauncher.runBuildOperation(DefaultGradleLauncher.java:189)
	at org.gradle.initialization.DefaultGradleLauncher.doBuildStages(DefaultGradleLauncher.java:171)
	at org.gradle.initialization.DefaultGradleLauncher.access$200(DefaultGradleLauncher.java:35)
	at org.gradle.initialization.DefaultGradleLauncher$1.create(DefaultGradleLauncher.java:104)
	at org.gradle.initialization.DefaultGradleLauncher$1.create(DefaultGradleLauncher.java:97)
	at org.gradle.internal.progress.DefaultBuildOperationExecutor.run(DefaultBuildOperationExecutor.java:62)
	at org.gradle.initialization.DefaultGradleLauncher.runRootBuildOperation(DefaultGradleLauncher.java:184)
	at org.gradle.initialization.DefaultGradleLauncher.doBuild(DefaultGradleLauncher.java:97)
	at org.gradle.initialization.DefaultGradleLauncher.run(DefaultGradleLauncher.java:86)
	at org.gradle.launcher.exec.InProcessBuildActionExecuter$DefaultBuildController.run(InProcessBuildActionExecuter.java:93)
	at org.gradle.tooling.internal.provider.ExecuteBuildActionRunner.run(ExecuteBuildActionRunner.java:28)
	at org.gradle.launcher.exec.ChainingBuildActionRunner.run(ChainingBuildActionRunner.java:35)
	at org.gradle.launcher.exec.InProcessBuildActionExecuter.execute(InProcessBuildActionExecuter.java:43)
	at org.gradle.launcher.exec.InProcessBuildActionExecuter.execute(InProcessBuildActionExecuter.java:27)
	at org.gradle.launcher.exec.ContinuousBuildActionExecuter.execute(ContinuousBuildActionExecuter.java:72)
	at org.gradle.launcher.exec.ContinuousBuildActionExecuter.execute(ContinuousBuildActionExecuter.java:44)
	at org.gradle.launcher.exec.DaemonUsageSuggestingBuildActionExecuter.execute(DaemonUsageSuggestingBuildActionExecuter.java:50)
	at org.gradle.launcher.exec.DaemonUsageSuggestingBuildActionExecuter.execute(DaemonUsageSuggestingBuildActionExecuter.java:27)
	at org.gradle.launcher.cli.RunBuildAction.run(RunBuildAction.java:40)
	at org.gradle.internal.Actions$RunnableActionAdapter.execute(Actions.java:170)
	at org.gradle.launcher.cli.CommandLineActionFactory$ParseAndBuildAction.execute(CommandLineActionFactory.java:237)
	at org.gradle.launcher.cli.CommandLineActionFactory$ParseAndBuildAction.execute(CommandLineActionFactory.java:210)
	at org.gradle.launcher.cli.JavaRuntimeValidationAction.execute(JavaRuntimeValidationAction.java:35)
	at org.gradle.launcher.cli.JavaRuntimeValidationAction.execute(JavaRuntimeValidationAction.java:24)
	at org.gradle.launcher.cli.CommandLineActionFactory$WithLogging.execute(CommandLineActionFactory.java:206)
	at org.gradle.launcher.cli.CommandLineActionFactory$WithLogging.execute(CommandLineActionFactory.java:169)
	at org.gradle.launcher.cli.ExceptionReportingAction.execute(ExceptionReportingAction.java:33)
	at org.gradle.launcher.cli.ExceptionReportingAction.execute(ExceptionReportingAction.java:22)
	at org.gradle.launcher.Main.doAction(Main.java:33)
	at org.gradle.launcher.bootstrap.EntryPoint.run(EntryPoint.java:45)
	at org.gradle.launcher.bootstrap.ProcessBootstrap.runNoExit(ProcessBootstrap.java:54)
	at org.gradle.launcher.bootstrap.ProcessBootstrap.run(ProcessBootstrap.java:35)
	at org.gradle.launcher.GradleMain.main(GradleMain.java:23)
	at org.gradle.wrapper.BootstrapMainStarter.start(BootstrapMainStarter.java:30)
	at org.gradle.wrapper.WrapperExecutor.execute(WrapperExecutor.java:127)
	at org.gradle.wrapper.GradleWrapperMain.main(GradleWrapperMain.java:55)
Caused by: java.lang.RuntimeException: There was TEST FAILURES!! See list above.
	at build_2vjcamg5g6vgprtkn4314btkd$_run_closure7_closure98.doCall(<https://builds.apache.org/job/Zest%20-%20Check%202.1-SNAPSHOT%20distributions%20from%20develop%20branch%20on%20Java8%20(OpenJDK)/ws/build/unpacked-distributions/src/apache-zest-java-2.1-SNAPSHOT-src/build.gradle>:452)
	at org.gradle.api.internal.AbstractTask$ClosureTaskAction.execute(AbstractTask.java:554)
	at org.gradle.api.internal.AbstractTask$ClosureTaskAction.execute(AbstractTask.java:535)
	at org.gradle.api.internal.tasks.execution.ExecuteActionsTaskExecuter.executeAction(ExecuteActionsTaskExecuter.java:80)
	at org.gradle.api.internal.tasks.execution.ExecuteActionsTaskExecuter.executeActions(ExecuteActionsTaskExecuter.java:61)
	... 104 more


BUILD FAILED

Total time: 37 mins 37.302 secs
Build step 'Invoke Gradle script' changed build result to FAILURE
Build step 'Invoke Gradle script' marked build as failure
Xvfb stopping
Archiving artifacts
Sending artifact delta relative to Zest - Check 2.1-SNAPSHOT distributions from develop branch
on Java8 (OpenJDK) #10
Archived 12 artifacts
Archive block size is 32768
Received 5 blocks and 38282127 bytes
Compression is 0.4%
Took 12 sec
Recording test results
Publishing Javadoc

Mime
View raw message