polygene-dev mailing list archives

Site index · List index
Message view « Date » · « Thread »
Top « Date » · « Thread »
From Apache Jenkins Server <jenk...@builds.apache.org>
Subject Build failed in Jenkins: Zest-Qi4j - Check 2.1-SNAPSHOT distributions from develop branch on Java7 (Oracle JDK) #13
Date Tue, 07 Jul 2015 06:58:59 GMT
See <https://builds.apache.org/job/Zest-Qi4j%20-%20Check%202.1-SNAPSHOT%20distributions%20from%20develop%20branch%20on%20Java7%20(Oracle%20JDK)/13/>

------------------------------------------
[...truncated 2936 lines...]
Project: org.qi4j.library.servlet
Project: org.qi4j.library.shiro-core
Project: org.qi4j.library.shiro-web
Project: org.qi4j.library.spring
Project: org.qi4j.library.sql
Project: org.qi4j.library.sql-bonecp
Project: org.qi4j.library.sql-dbcp
Project: org.qi4j.library.sql-liquibase
Project: org.qi4j.library.uid
Project: org.qi4j.library.uowfile
Project: org.qi4j.extensions
Project: org.qi4j.extension.cache-ehcache
Project: org.qi4j.extension.cache-memcache
Project: org.qi4j.extension.entitystore-memory
Project: org.qi4j.extension.entitystore-file
Project: org.qi4j.extension.entitystore-hazelcast
Project: org.qi4j.extension.entitystore-jclouds
Project: org.qi4j.extension.entitystore-jdbm
Project: org.qi4j.extension.entitystore-leveldb
Project: org.qi4j.extension.entitystore-mongodb
Project: org.qi4j.extension.entitystore-preferences
Project: org.qi4j.extension.entitystore-redis
Project: org.qi4j.extension.entitystore-riak
Project: org.qi4j.extension.entitystore-sql
Project: org.qi4j.extension.entitystore-voldemort
Project: org.qi4j.extension.indexing-elasticsearch
Project: org.qi4j.extension.indexing-rdf
Project: org.qi4j.extension.indexing-solr
Project: org.qi4j.extension.indexing-sql
Project: org.qi4j.extension.metrics-yammer
Project: org.qi4j.extension.migration
Project: org.qi4j.extension.reindexer
Project: org.qi4j.extension.valueserialization-orgjson
Project: org.qi4j.extension.valueserialization-jackson
Project: org.qi4j.extension.valueserialization-stax
Project: org.qi4j.manual
Project: org.qi4j.samples
Project: org.qi4j.sample.dci
Project: org.qi4j.sample.dci-cargo
Project: org.qi4j.sample.dci-cargo.dcisample_a
Project: org.qi4j.sample.dci-cargo.dcisample_b
Project: org.qi4j.sample.forum
Project: org.qi4j.sample.rental
Project: org.qi4j.sample.sql-support
Project: org.qi4j.sample.swing
Project: org.qi4j.tools
Project: org.qi4j.tool.model-detail
Project: org.qi4j.tool.envisage
Project: org.qi4j.tool.shell
Project: org.qi4j.tutorials
Project: org.qi4j.tutorial.cargo
Project: org.qi4j.tutorial.composites
Project: org.qi4j.tutorial.hello
Project: org.qi4j.tutorial.introduction
Project: org.qi4j.tutorial.introduction.twominutes
Project: org.qi4j.tutorial.introduction.tenminutes
Project: org.qi4j.tutorial.introduction.thirtyminutes
Project: org.qi4j.tutorial.services
Project: org.qi4j.tests
Project: org.qi4j.test.regression
Project: org.qi4j.test.performance
org.qi4j.core.api(true) -> stable, good, good
org.qi4j.core.bootstrap(true) -> stable, brief, good
org.qi4j.core.functional(true) -> beta, good, good
org.qi4j.core.io(true) -> beta, good, good
org.qi4j.core.runtime(true) -> stable, brief, good
org.qi4j.core.spi(true) -> stable, brief, good
org.qi4j.core.testsupport(true) -> stable, brief, none
org.qi4j.extension.cache-ehcache(true) -> beta, brief, some
org.qi4j.extension.cache-memcache(true) -> beta, brief, some
org.qi4j.extension.entitystore-file(true) -> stable, good, good
org.qi4j.extension.entitystore-hazelcast(true) -> stable, brief, good
org.qi4j.extension.entitystore-jclouds(true) -> stable, brief, good
org.qi4j.extension.entitystore-jdbm(true) -> stable, brief, good
org.qi4j.extension.entitystore-leveldb(true) -> beta, brief, good
org.qi4j.extension.entitystore-memory(true) -> stable, good, good
org.qi4j.extension.entitystore-mongodb(true) -> stable, brief, good
org.qi4j.extension.entitystore-preferences(true) -> stable, brief, good
org.qi4j.extension.entitystore-redis(true) -> beta, good, good
org.qi4j.extension.entitystore-riak(true) -> beta, good, good
org.qi4j.extension.entitystore-sql(true) -> stable, good, good
org.qi4j.extension.entitystore-voldemort(true) -> beta, good, good
org.qi4j.extension.indexing-elasticsearch(true) -> beta, good, good
org.qi4j.extension.indexing-rdf(true) -> stable, brief, good
org.qi4j.extension.indexing-solr(true) -> stable, brief, some
org.qi4j.extension.indexing-sql(true) -> stable, brief, good
org.qi4j.extension.metrics-yammer(true) -> stable, none, some
org.qi4j.extension.migration(true) -> stable, none, some
org.qi4j.extension.reindexer(true) -> stable, none, some
org.qi4j.extension.valueserialization-jackson(true) -> beta, good, complete
org.qi4j.extension.valueserialization-orgjson(true) -> stable, good, complete
org.qi4j.extension.valueserialization-stax(true) -> beta, good, complete
org.qi4j.library.alarm(true) -> stable, brief, some
org.qi4j.library.circuitbreaker(true) -> stable, good, good
org.qi4j.library.constraints(true) -> stable, good, good
org.qi4j.library.conversion(true) -> stable, brief, some
org.qi4j.library.eventsourcing(false) -> beta, none, some
org.qi4j.library.eventsourcing-jdbm(false) -> beta, none, some
org.qi4j.library.eventsourcing-rest(false) -> beta, none, some
org.qi4j.library.fileconfig(true) -> stable, good, good
org.qi4j.library.http(true) -> stable, good, good
org.qi4j.library.invocation-cache(true) -> stable, brief, none
org.qi4j.library.jmx(true) -> stable, brief, some
org.qi4j.library.lang-groovy(true) -> beta, brief, some
org.qi4j.library.lang-javascript(true) -> beta, brief, some
org.qi4j.library.lang-scala(false) -> beta, none, some
org.qi4j.library.locking(true) -> stable, none, some
org.qi4j.library.logging(true) -> stable, good, good
org.qi4j.library.metrics(false) -> early, brief, none
org.qi4j.library.osgi(true) -> stable, brief, some
org.qi4j.library.rdf(true) -> stable, none, some
org.qi4j.library.rest(true) -> stable, none, none
org.qi4j.library.rest-client(true) -> stable, good, some
org.qi4j.library.rest-common(true) -> stable, none, none
org.qi4j.library.rest-server(true) -> stable, none, none
org.qi4j.library.scheduler(true) -> beta, good, good
org.qi4j.library.scripting(true) -> stable, none, complete
org.qi4j.library.servlet(true) -> stable, good, good
org.qi4j.library.shiro-core(true) -> stable, good, good
org.qi4j.library.shiro-web(true) -> stable, good, good
org.qi4j.library.spring(true) -> beta, brief, some
org.qi4j.library.sql(true) -> stable, good, good
org.qi4j.library.sql-bonecp(true) -> stable, good, good
org.qi4j.library.sql-dbcp(true) -> stable, good, good
org.qi4j.library.sql-liquibase(true) -> stable, good, good
org.qi4j.library.uid(true) -> stable, good, good
org.qi4j.library.uowfile(true) -> stable, good, complete
org.qi4j.tool.envisage(true) -> stable, brief, none
org.qi4j.tool.model-detail(true) -> stable, brief, none
:org.qi4j:honkerCheck
:org.qi4j:rat FAILED
:checkSrcDist FAILED

FAILURE: Build failed with an exception.

* What went wrong:
Execution failed for task ':rat'.
> PermGen space

* Try:
Run with --info or --debug option to get more log output.

* Exception is:
org.gradle.api.tasks.TaskExecutionException: Execution failed for task ':rat'.
	at org.gradle.api.internal.tasks.execution.ExecuteActionsTaskExecuter.executeActions(ExecuteActionsTaskExecuter.java:69)
	at org.gradle.api.internal.tasks.execution.ExecuteActionsTaskExecuter.execute(ExecuteActionsTaskExecuter.java:46)
	at org.gradle.api.internal.tasks.execution.PostExecutionAnalysisTaskExecuter.execute(PostExecutionAnalysisTaskExecuter.java:35)
	at org.gradle.api.internal.tasks.execution.SkipUpToDateTaskExecuter.execute(SkipUpToDateTaskExecuter.java:64)
	at org.gradle.api.internal.tasks.execution.ValidatingTaskExecuter.execute(ValidatingTaskExecuter.java:58)
	at org.gradle.api.internal.tasks.execution.SkipEmptySourceFilesTaskExecuter.execute(SkipEmptySourceFilesTaskExecuter.java:42)
	at org.gradle.api.internal.tasks.execution.SkipTaskWithNoActionsExecuter.execute(SkipTaskWithNoActionsExecuter.java:52)
	at org.gradle.api.internal.tasks.execution.SkipOnlyIfTaskExecuter.execute(SkipOnlyIfTaskExecuter.java:53)
	at org.gradle.api.internal.tasks.execution.ExecuteAtMostOnceTaskExecuter.execute(ExecuteAtMostOnceTaskExecuter.java:43)
	at org.gradle.api.internal.AbstractTask.executeWithoutThrowingTaskFailure(AbstractTask.java:310)
	at org.gradle.execution.taskgraph.AbstractTaskPlanExecutor$TaskExecutorWorker.executeTask(AbstractTaskPlanExecutor.java:79)
	at org.gradle.execution.taskgraph.AbstractTaskPlanExecutor$TaskExecutorWorker.processTask(AbstractTaskPlanExecutor.java:63)
	at org.gradle.execution.taskgraph.AbstractTaskPlanExecutor$TaskExecutorWorker.run(AbstractTaskPlanExecutor.java:51)
	at org.gradle.execution.taskgraph.DefaultTaskPlanExecutor.process(DefaultTaskPlanExecutor.java:23)
	at org.gradle.execution.taskgraph.DefaultTaskGraphExecuter.execute(DefaultTaskGraphExecuter.java:88)
	at org.gradle.execution.SelectedTaskExecutionAction.execute(SelectedTaskExecutionAction.java:37)
	at org.gradle.execution.DefaultBuildExecuter.execute(DefaultBuildExecuter.java:62)
	at org.gradle.execution.DefaultBuildExecuter.access$200(DefaultBuildExecuter.java:23)
	at org.gradle.execution.DefaultBuildExecuter$2.proceed(DefaultBuildExecuter.java:68)
	at org.gradle.execution.DryRunBuildExecutionAction.execute(DryRunBuildExecutionAction.java:32)
	at org.gradle.execution.DefaultBuildExecuter.execute(DefaultBuildExecuter.java:62)
	at org.gradle.execution.DefaultBuildExecuter.execute(DefaultBuildExecuter.java:55)
	at org.gradle.initialization.DefaultGradleLauncher.doBuildStages(DefaultGradleLauncher.java:149)
	at org.gradle.initialization.DefaultGradleLauncher.doBuild(DefaultGradleLauncher.java:106)
	at org.gradle.initialization.DefaultGradleLauncher.run(DefaultGradleLauncher.java:86)
	at org.gradle.api.tasks.GradleBuild.build(GradleBuild.java:117)
	at org.gradle.internal.reflect.JavaMethod.invoke(JavaMethod.java:75)
	at org.gradle.api.internal.project.taskfactory.AnnotationProcessingTaskFactory$StandardTaskAction.doExecute(AnnotationProcessingTaskFactory.java:226)
	at org.gradle.api.internal.project.taskfactory.AnnotationProcessingTaskFactory$StandardTaskAction.execute(AnnotationProcessingTaskFactory.java:219)
	at org.gradle.api.internal.project.taskfactory.AnnotationProcessingTaskFactory$StandardTaskAction.execute(AnnotationProcessingTaskFactory.java:208)
	at org.gradle.api.internal.AbstractTask$TaskActionWrapper.execute(AbstractTask.java:589)
	at org.gradle.api.internal.AbstractTask$TaskActionWrapper.execute(AbstractTask.java:572)
	at org.gradle.api.internal.tasks.execution.ExecuteActionsTaskExecuter.executeAction(ExecuteActionsTaskExecuter.java:80)
	at org.gradle.api.internal.tasks.execution.ExecuteActionsTaskExecuter.executeActions(ExecuteActionsTaskExecuter.java:61)
	at org.gradle.api.internal.tasks.execution.ExecuteActionsTaskExecuter.execute(ExecuteActionsTaskExecuter.java:46)
	at org.gradle.api.internal.tasks.execution.PostExecutionAnalysisTaskExecuter.execute(PostExecutionAnalysisTaskExecuter.java:35)
	at org.gradle.api.internal.tasks.execution.SkipUpToDateTaskExecuter.execute(SkipUpToDateTaskExecuter.java:64)
	at org.gradle.api.internal.tasks.execution.ValidatingTaskExecuter.execute(ValidatingTaskExecuter.java:58)
	at org.gradle.api.internal.tasks.execution.SkipEmptySourceFilesTaskExecuter.execute(SkipEmptySourceFilesTaskExecuter.java:42)
	at org.gradle.api.internal.tasks.execution.SkipTaskWithNoActionsExecuter.execute(SkipTaskWithNoActionsExecuter.java:52)
	at org.gradle.api.internal.tasks.execution.SkipOnlyIfTaskExecuter.execute(SkipOnlyIfTaskExecuter.java:53)
	at org.gradle.api.internal.tasks.execution.ExecuteAtMostOnceTaskExecuter.execute(ExecuteAtMostOnceTaskExecuter.java:43)
	at org.gradle.api.internal.AbstractTask.executeWithoutThrowingTaskFailure(AbstractTask.java:310)
	at org.gradle.execution.taskgraph.AbstractTaskPlanExecutor$TaskExecutorWorker.executeTask(AbstractTaskPlanExecutor.java:79)
	at org.gradle.execution.taskgraph.AbstractTaskPlanExecutor$TaskExecutorWorker.processTask(AbstractTaskPlanExecutor.java:63)
	at org.gradle.execution.taskgraph.AbstractTaskPlanExecutor$TaskExecutorWorker.run(AbstractTaskPlanExecutor.java:51)
	at org.gradle.execution.taskgraph.DefaultTaskPlanExecutor.process(DefaultTaskPlanExecutor.java:23)
	at org.gradle.execution.taskgraph.DefaultTaskGraphExecuter.execute(DefaultTaskGraphExecuter.java:88)
	at org.gradle.execution.SelectedTaskExecutionAction.execute(SelectedTaskExecutionAction.java:37)
	at org.gradle.execution.DefaultBuildExecuter.execute(DefaultBuildExecuter.java:62)
	at org.gradle.execution.DefaultBuildExecuter.access$200(DefaultBuildExecuter.java:23)
	at org.gradle.execution.DefaultBuildExecuter$2.proceed(DefaultBuildExecuter.java:68)
	at org.gradle.execution.DryRunBuildExecutionAction.execute(DryRunBuildExecutionAction.java:32)
	at org.gradle.execution.DefaultBuildExecuter.execute(DefaultBuildExecuter.java:62)
	at org.gradle.execution.DefaultBuildExecuter.execute(DefaultBuildExecuter.java:55)
	at org.gradle.initialization.DefaultGradleLauncher.doBuildStages(DefaultGradleLauncher.java:149)
	at org.gradle.initialization.DefaultGradleLauncher.doBuild(DefaultGradleLauncher.java:106)
	at org.gradle.initialization.DefaultGradleLauncher.run(DefaultGradleLauncher.java:86)
	at org.gradle.launcher.exec.InProcessBuildActionExecuter$DefaultBuildController.run(InProcessBuildActionExecuter.java:90)
	at org.gradle.tooling.internal.provider.ExecuteBuildActionRunner.run(ExecuteBuildActionRunner.java:28)
	at org.gradle.launcher.exec.ChainingBuildActionRunner.run(ChainingBuildActionRunner.java:35)
	at org.gradle.launcher.exec.InProcessBuildActionExecuter.execute(InProcessBuildActionExecuter.java:41)
	at org.gradle.launcher.exec.InProcessBuildActionExecuter.execute(InProcessBuildActionExecuter.java:28)
	at org.gradle.launcher.exec.DaemonUsageSuggestingBuildActionExecuter.execute(DaemonUsageSuggestingBuildActionExecuter.java:50)
	at org.gradle.launcher.exec.DaemonUsageSuggestingBuildActionExecuter.execute(DaemonUsageSuggestingBuildActionExecuter.java:27)
	at org.gradle.launcher.cli.RunBuildAction.run(RunBuildAction.java:40)
	at org.gradle.internal.Actions$RunnableActionAdapter.execute(Actions.java:169)
	at org.gradle.launcher.cli.CommandLineActionFactory$ParseAndBuildAction.execute(CommandLineActionFactory.java:237)
	at org.gradle.launcher.cli.CommandLineActionFactory$ParseAndBuildAction.execute(CommandLineActionFactory.java:210)
	at org.gradle.launcher.cli.JavaRuntimeValidationAction.execute(JavaRuntimeValidationAction.java:35)
	at org.gradle.launcher.cli.JavaRuntimeValidationAction.execute(JavaRuntimeValidationAction.java:24)
	at org.gradle.launcher.cli.CommandLineActionFactory$WithLogging.execute(CommandLineActionFactory.java:206)
	at org.gradle.launcher.cli.CommandLineActionFactory$WithLogging.execute(CommandLineActionFactory.java:169)
	at org.gradle.launcher.cli.ExceptionReportingAction.execute(ExceptionReportingAction.java:33)
	at org.gradle.launcher.cli.ExceptionReportingAction.execute(ExceptionReportingAction.java:22)
	at org.gradle.launcher.Main.doAction(Main.java:33)
	at org.gradle.launcher.bootstrap.EntryPoint.run(EntryPoint.java:45)
	at org.gradle.launcher.bootstrap.ProcessBootstrap.runNoExit(ProcessBootstrap.java:54)
	at org.gradle.launcher.bootstrap.ProcessBootstrap.run(ProcessBootstrap.java:35)
	at org.gradle.launcher.GradleMain.main(GradleMain.java:23)
	at org.gradle.wrapper.BootstrapMainStarter.start(BootstrapMainStarter.java:30)
	at org.gradle.wrapper.WrapperExecutor.execute(WrapperExecutor.java:127)
	at org.gradle.wrapper.GradleWrapperMain.main(GradleWrapperMain.java:55)
Caused by: java.lang.OutOfMemoryError: PermGen space
	at org.apache.tools.ant.Project.initProperties(Project.java:310)
	at org.apache.tools.ant.Project.init(Project.java:297)
	at org.gradle.api.AntBuilder.<init>(AntBuilder.java:23)
	at org.gradle.api.internal.project.ant.BasicAntBuilder.<init>(BasicAntBuilder.java:34)


BUILD FAILED

Total time: 15 mins 42.277 secs
Build step 'Invoke Gradle script' changed build result to FAILURE
Build step 'Invoke Gradle script' marked build as failure
Xvfb stopping
Archiving artifacts
Sending artifact delta relative to Zest-Qi4j - Check 2.1-SNAPSHOT distributions from develop
branch on Java7 (Oracle JDK) #11
Archived 4 artifacts
Archive block size is 32768
Received 5 blocks and 24351594 bytes
Compression is 0.7%
Took 7.1 sec
Recording test results
Publishing Javadoc

Mime
View raw message