polygene-dev mailing list archives

Site index · List index
Message view « Date » · « Thread »
Top « Date » · « Thread »
From Apache Jenkins Server <jenk...@builds.apache.org>
Subject Build failed in Jenkins: Zest-Qi4j - Check develop branch on Java7 (Oracle JDK) #26
Date Mon, 06 Jul 2015 14:32:42 GMT
See <https://builds.apache.org/job/Zest-Qi4j%20-%20Check%20develop%20branch%20on%20Java7%20(Oracle%20JDK)/26/changes>

Changes:

[hedmann] Metrics gets a little bit of care.

[hedmann] Newer ASM

------------------------------------------
[...truncated 415 lines...]
:org.qi4j.tools:classes UP-TO-DATE
:org.qi4j.tools:compileTestJava UP-TO-DATE
:org.qi4j.tools:processTestResources UP-TO-DATE
:org.qi4j.tools:testClasses UP-TO-DATE
:org.qi4j.tools:test UP-TO-DATE
:org.qi4j.tutorials:compileJava UP-TO-DATE
:org.qi4j.tutorials:processResources UP-TO-DATE
:org.qi4j.tutorials:classes UP-TO-DATE
:org.qi4j.tutorials:compileTestJava UP-TO-DATE
:org.qi4j.tutorials:processTestResources UP-TO-DATE
:org.qi4j.tutorials:testClasses UP-TO-DATE
:org.qi4j.tutorials:test UP-TO-DATE
:org.qi4j.core:org.qi4j.core.testsupport:makeVersionClass
:org.qi4j.core:org.qi4j.core.testsupport:compileVersionJava
:org.qi4j.core:org.qi4j.core.testsupport:compileJava
:org.qi4j.core:org.qi4j.core.testsupport:processResources UP-TO-DATE
:org.qi4j.core:org.qi4j.core.testsupport:classes
:org.qi4j.core:org.qi4j.core.testsupport:processVersionResources UP-TO-DATE
:org.qi4j.core:org.qi4j.core.testsupport:versionClasses
:org.qi4j.core:org.qi4j.core.testsupport:jar
:org.qi4j.extensions:org.qi4j.extension.valueserialization-orgjson:makeVersionClass
:org.qi4j.extensions:org.qi4j.extension.valueserialization-orgjson:compileVersionJava
:org.qi4j.extensions:org.qi4j.extension.valueserialization-orgjson:compileJava
:org.qi4j.extensions:org.qi4j.extension.valueserialization-orgjson:processResources UP-TO-DATE
:org.qi4j.extensions:org.qi4j.extension.valueserialization-orgjson:classes
:org.qi4j.extensions:org.qi4j.extension.valueserialization-orgjson:processVersionResources
UP-TO-DATE
:org.qi4j.extensions:org.qi4j.extension.valueserialization-orgjson:versionClasses
:org.qi4j.extensions:org.qi4j.extension.valueserialization-orgjson:jar
:org.qi4j.core:org.qi4j.core.api:compileTestJavaNote: Some input files use unchecked or unsafe
operations.
Note: Recompile with -Xlint:unchecked for details.

:org.qi4j.core:org.qi4j.core.api:processTestResources
:org.qi4j.core:org.qi4j.core.api:testClasses
:org.qi4j.core:org.qi4j.core.api:test
:org.qi4j.core:org.qi4j.core.bootstrap:compileTestJava
:org.qi4j.core:org.qi4j.core.bootstrap:processTestResources UP-TO-DATE
:org.qi4j.core:org.qi4j.core.bootstrap:testClasses
:org.qi4j.core:org.qi4j.core.bootstrap:test
:org.qi4j.core:org.qi4j.core.functional:compileTestJava
:org.qi4j.core:org.qi4j.core.functional:processTestResources UP-TO-DATE
:org.qi4j.core:org.qi4j.core.functional:testClasses
:org.qi4j.core:org.qi4j.core.functional:test
:org.qi4j.core:org.qi4j.core.io:compileTestJava
:org.qi4j.core:org.qi4j.core.io:processTestResources
:org.qi4j.core:org.qi4j.core.io:testClasses
:org.qi4j.core:org.qi4j.core.io:test
:org.qi4j.core:org.qi4j.core.runtime:compileTestJavaNote: Some input files use unchecked or
unsafe operations.
Note: Recompile with -Xlint:unchecked for details.

:org.qi4j.core:org.qi4j.core.runtime:processTestResources
:org.qi4j.core:org.qi4j.core.runtime:testClasses
:org.qi4j.core:org.qi4j.core.runtime:test
:org.qi4j.core:org.qi4j.core.spi:compileTestJavaNote: /x1/jenkins/jenkins-slave/workspace/Zest-Qi4j
- Check develop branch on Java7 (Oracle JDK)/core/spi/src/test/java/org/qi4j/spi/property/DefaultValuesTest.java
uses unchecked or unsafe operations.
Note: Recompile with -Xlint:unchecked for details.

:org.qi4j.core:org.qi4j.core.spi:processTestResources
:org.qi4j.core:org.qi4j.core.spi:testClasses
:org.qi4j.core:org.qi4j.core.spi:test
:org.qi4j.core:org.qi4j.core.testsupport:compileTestJava UP-TO-DATE
:org.qi4j.core:org.qi4j.core.testsupport:processTestResources UP-TO-DATE
:org.qi4j.core:org.qi4j.core.testsupport:testClasses UP-TO-DATE
:org.qi4j.core:org.qi4j.core.testsupport:test UP-TO-DATE
:org.qi4j.extensions:org.qi4j.extension.cache-ehcache:makeVersionClass
:org.qi4j.extensions:org.qi4j.extension.cache-ehcache:compileVersionJava
:org.qi4j.extensions:org.qi4j.extension.cache-ehcache:compileJava/x1/jenkins/jenkins-slave/workspace/Zest-Qi4j
- Check develop branch on Java7 (Oracle JDK)/extensions/cache-ehcache/src/main/java/org/qi4j/cache/ehcache/EhCachePoolMixin.java:165:
warning: [deprecation] maxElementsOnDisk(int) in CacheConfiguration has been deprecated
            cacheConfig.maxElementsOnDisk( maxElementsOnDisk );
                       ^
1 warning

:org.qi4j.extensions:org.qi4j.extension.cache-ehcache:processResources UP-TO-DATE
:org.qi4j.extensions:org.qi4j.extension.cache-ehcache:classes
:org.qi4j.extensions:org.qi4j.extension.cache-ehcache:compileTestJava
:org.qi4j.extensions:org.qi4j.extension.cache-ehcache:processTestResources UP-TO-DATE
:org.qi4j.extensions:org.qi4j.extension.cache-ehcache:testClasses
:org.qi4j.extensions:org.qi4j.extension.cache-ehcache:test
:org.qi4j.extensions:org.qi4j.extension.cache-memcache:makeVersionClass
:org.qi4j.extensions:org.qi4j.extension.cache-memcache:compileVersionJava
:org.qi4j.extensions:org.qi4j.extension.cache-memcache:compileJava
:org.qi4j.extensions:org.qi4j.extension.cache-memcache:processResources UP-TO-DATE
:org.qi4j.extensions:org.qi4j.extension.cache-memcache:classes
:org.qi4j.extensions:org.qi4j.extension.cache-memcache:compileTestJava
:org.qi4j.extensions:org.qi4j.extension.cache-memcache:processTestResources UP-TO-DATE
:org.qi4j.extensions:org.qi4j.extension.cache-memcache:testClasses
:org.qi4j.extensions:org.qi4j.extension.cache-memcache:test
:org.qi4j.extensions:org.qi4j.extension.entitystore-file:makeVersionClass
:org.qi4j.extensions:org.qi4j.extension.entitystore-file:compileVersionJava
:org.qi4j.libraries:org.qi4j.library.fileconfig:makeVersionClass
:org.qi4j.libraries:org.qi4j.library.fileconfig:compileVersionJava
:org.qi4j.libraries:org.qi4j.library.fileconfig:compileJava
:org.qi4j.libraries:org.qi4j.library.fileconfig:processResources
:org.qi4j.libraries:org.qi4j.library.fileconfig:classes
:org.qi4j.libraries:org.qi4j.library.fileconfig:processVersionResources UP-TO-DATE
:org.qi4j.libraries:org.qi4j.library.fileconfig:versionClasses
:org.qi4j.libraries:org.qi4j.library.fileconfig:jar
:org.qi4j.libraries:org.qi4j.library.locking:makeVersionClass
:org.qi4j.libraries:org.qi4j.library.locking:compileVersionJava
:org.qi4j.libraries:org.qi4j.library.locking:compileJava
:org.qi4j.libraries:org.qi4j.library.locking:processResources UP-TO-DATE
:org.qi4j.libraries:org.qi4j.library.locking:classes
:org.qi4j.libraries:org.qi4j.library.locking:processVersionResources UP-TO-DATE
:org.qi4j.libraries:org.qi4j.library.locking:versionClasses
:org.qi4j.libraries:org.qi4j.library.locking:jar
:org.qi4j.extensions:org.qi4j.extension.entitystore-file:compileJava
:org.qi4j.extensions:org.qi4j.extension.entitystore-file:processResources UP-TO-DATE
:org.qi4j.extensions:org.qi4j.extension.entitystore-file:classes
:org.qi4j.extensions:org.qi4j.extension.entitystore-file:compileTestJava
:org.qi4j.extensions:org.qi4j.extension.entitystore-file:processTestResources UP-TO-DATE
:org.qi4j.extensions:org.qi4j.extension.entitystore-file:testClasses
:org.qi4j.extensions:org.qi4j.extension.entitystore-file:test
:org.qi4j.extensions:org.qi4j.extension.entitystore-hazelcast:makeVersionClass
:org.qi4j.extensions:org.qi4j.extension.entitystore-hazelcast:compileVersionJava
:org.qi4j.extensions:org.qi4j.extension.entitystore-hazelcast:compileJava
:org.qi4j.extensions:org.qi4j.extension.entitystore-hazelcast:processResources UP-TO-DATE
:org.qi4j.extensions:org.qi4j.extension.entitystore-hazelcast:classes
:org.qi4j.extensions:org.qi4j.extension.entitystore-hazelcast:compileTestJava
:org.qi4j.extensions:org.qi4j.extension.entitystore-hazelcast:processTestResources
:org.qi4j.extensions:org.qi4j.extension.entitystore-hazelcast:testClasses
:org.qi4j.extensions:org.qi4j.extension.entitystore-hazelcast:test
:org.qi4j.extensions:org.qi4j.extension.entitystore-jclouds:makeVersionClass
:org.qi4j.extensions:org.qi4j.extension.entitystore-jclouds:compileVersionJava
:org.qi4j.extensions:org.qi4j.extension.entitystore-jclouds:compileJava
:org.qi4j.extensions:org.qi4j.extension.entitystore-jclouds:processResources UP-TO-DATE
:org.qi4j.extensions:org.qi4j.extension.entitystore-jclouds:classes
:org.qi4j.extensions:org.qi4j.extension.entitystore-jclouds:compileTestJava
:org.qi4j.extensions:org.qi4j.extension.entitystore-jclouds:processTestResources UP-TO-DATE
:org.qi4j.extensions:org.qi4j.extension.entitystore-jclouds:testClasses
:org.qi4j.extensions:org.qi4j.extension.entitystore-jclouds:test
:org.qi4j.extensions:org.qi4j.extension.entitystore-jdbm:makeVersionClass
:org.qi4j.extensions:org.qi4j.extension.entitystore-jdbm:compileVersionJava
:org.qi4j.extensions:org.qi4j.extension.entitystore-jdbm:compileJavaNote: /x1/jenkins/jenkins-slave/workspace/Zest-Qi4j
- Check develop branch on Java7 (Oracle JDK)/extensions/entitystore-jdbm/src/main/java/org/qi4j/entitystore/jdbm/JdbmEntityStoreMixin.java
uses unchecked or unsafe operations.
Note: Recompile with -Xlint:unchecked for details.

:org.qi4j.extensions:org.qi4j.extension.entitystore-jdbm:processResources UP-TO-DATE
:org.qi4j.extensions:org.qi4j.extension.entitystore-jdbm:classes
:org.qi4j.extensions:org.qi4j.extension.entitystore-jdbm:compileTestJava
:org.qi4j.extensions:org.qi4j.extension.entitystore-jdbm:processTestResources UP-TO-DATE
:org.qi4j.extensions:org.qi4j.extension.entitystore-jdbm:testClasses
:org.qi4j.extensions:org.qi4j.extension.entitystore-jdbm:test
:org.qi4j.extensions:org.qi4j.extension.entitystore-leveldb:makeVersionClass
:org.qi4j.extensions:org.qi4j.extension.entitystore-leveldb:compileVersionJava
:org.qi4j.extensions:org.qi4j.extension.entitystore-leveldb:compileJava
:org.qi4j.extensions:org.qi4j.extension.entitystore-leveldb:processResources UP-TO-DATE
:org.qi4j.extensions:org.qi4j.extension.entitystore-leveldb:classes
:org.qi4j.extensions:org.qi4j.extension.entitystore-leveldb:compileTestJava
:org.qi4j.extensions:org.qi4j.extension.entitystore-leveldb:processTestResources UP-TO-DATE
:org.qi4j.extensions:org.qi4j.extension.entitystore-leveldb:testClasses
:org.qi4j.extensions:org.qi4j.extension.entitystore-leveldb:test
:org.qi4j.extensions:org.qi4j.extension.entitystore-memory:makeVersionClass
:org.qi4j.extensions:org.qi4j.extension.entitystore-memory:compileVersionJava
:org.qi4j.extensions:org.qi4j.extension.entitystore-memory:compileJava
:org.qi4j.extensions:org.qi4j.extension.entitystore-memory:processResources UP-TO-DATE
:org.qi4j.extensions:org.qi4j.extension.entitystore-memory:classes
:org.qi4j.extensions:org.qi4j.extension.entitystore-memory:compileTestJava
:org.qi4j.extensions:org.qi4j.extension.entitystore-memory:processTestResources UP-TO-DATE
:org.qi4j.extensions:org.qi4j.extension.entitystore-memory:testClasses
:org.qi4j.extensions:org.qi4j.extension.entitystore-memory:test
:org.qi4j.extensions:org.qi4j.extension.entitystore-mongodb:makeVersionClass
:org.qi4j.extensions:org.qi4j.extension.entitystore-mongodb:compileVersionJava
:org.qi4j.extensions:org.qi4j.extension.entitystore-mongodb:compileJava
:org.qi4j.extensions:org.qi4j.extension.entitystore-mongodb:processResources UP-TO-DATE
:org.qi4j.extensions:org.qi4j.extension.entitystore-mongodb:classes
:org.qi4j.extensions:org.qi4j.extension.entitystore-mongodb:compileTestJava
:org.qi4j.extensions:org.qi4j.extension.entitystore-mongodb:processTestResources UP-TO-DATE
:org.qi4j.extensions:org.qi4j.extension.entitystore-mongodb:testClasses
:org.qi4j.extensions:org.qi4j.extension.entitystore-mongodb:test
:org.qi4j.extensions:org.qi4j.extension.entitystore-preferences:makeVersionClass
:org.qi4j.extensions:org.qi4j.extension.entitystore-preferences:compileVersionJava
:org.qi4j.extensions:org.qi4j.extension.entitystore-preferences:compileJava
:org.qi4j.extensions:org.qi4j.extension.entitystore-preferences:processResources UP-TO-DATE
:org.qi4j.extensions:org.qi4j.extension.entitystore-preferences:classes
:org.qi4j.extensions:org.qi4j.extension.entitystore-preferences:compileTestJava
:org.qi4j.extensions:org.qi4j.extension.entitystore-preferences:processTestResources UP-TO-DATE
:org.qi4j.extensions:org.qi4j.extension.entitystore-preferences:testClasses
:org.qi4j.extensions:org.qi4j.extension.entitystore-preferences:test
:org.qi4j.extensions:org.qi4j.extension.entitystore-redis:makeVersionClass
:org.qi4j.extensions:org.qi4j.extension.entitystore-redis:compileVersionJava
:org.qi4j.extensions:org.qi4j.extension.entitystore-redis:compileJava
:org.qi4j.extensions:org.qi4j.extension.entitystore-redis:processResources UP-TO-DATE
:org.qi4j.extensions:org.qi4j.extension.entitystore-redis:classes
:org.qi4j.extensions:org.qi4j.extension.entitystore-redis:compileTestJava
:org.qi4j.extensions:org.qi4j.extension.entitystore-redis:processTestResources UP-TO-DATE
:org.qi4j.extensions:org.qi4j.extension.entitystore-redis:testClasses
:org.qi4j.extensions:org.qi4j.extension.entitystore-redis:test
:org.qi4j.extensions:org.qi4j.extension.entitystore-riak:makeVersionClass
:org.qi4j.extensions:org.qi4j.extension.entitystore-riak:compileVersionJava
:org.qi4j.extensions:org.qi4j.extension.entitystore-riak:compileJava/x1/jenkins/jenkins-slave/workspace/Zest-Qi4j
- Check develop branch on Java7 (Oracle JDK)/extensions/entitystore-riak/src/main/java/org/qi4j/entitystore/riak/RiakHttpMapEntityStoreMixin.java:62:
warning: [deprecation] listBuckets() in IRiakClient has been deprecated
        if( !riakClient.listBuckets().contains( bucketKey ) )
                       ^
/x1/jenkins/jenkins-slave/workspace/Zest-Qi4j - Check develop branch on Java7 (Oracle JDK)/extensions/entitystore-riak/src/main/java/org/qi4j/entitystore/riak/RiakProtobufMapEntityStoreMixin.java:82:
warning: [deprecation] listBuckets() in IRiakClient has been deprecated
        if( !riakClient.listBuckets().contains( bucketKey ) )
                       ^
2 warnings

:org.qi4j.extensions:org.qi4j.extension.entitystore-riak:processResources UP-TO-DATE
:org.qi4j.extensions:org.qi4j.extension.entitystore-riak:classes
:org.qi4j.extensions:org.qi4j.extension.entitystore-riak:compileTestJava
:org.qi4j.extensions:org.qi4j.extension.entitystore-riak:processTestResources UP-TO-DATE
:org.qi4j.extensions:org.qi4j.extension.entitystore-riak:testClasses
:org.qi4j.extensions:org.qi4j.extension.entitystore-riak:testUnexpected exception thrown.
org.gradle.messaging.remote.internal.MessageIOException: Could not read message from '/127.0.0.1:39364'.
	at org.gradle.messaging.remote.internal.inet.SocketConnection.receive(SocketConnection.java:79)
	at org.gradle.messaging.remote.internal.hub.MessageHub$ConnectionReceive.run(MessageHub.java:235)
	at org.gradle.internal.concurrent.ExecutorPolicy$CatchAndRecordFailures.onExecute(ExecutorPolicy.java:54)
	at org.gradle.internal.concurrent.StoppableExecutorImpl$1.run(StoppableExecutorImpl.java:40)
	at java.util.concurrent.ThreadPoolExecutor.runWorker(ThreadPoolExecutor.java:1145)
	at java.util.concurrent.ThreadPoolExecutor$Worker.run(ThreadPoolExecutor.java:615)
	at java.lang.Thread.run(Thread.java:724)
Caused by: java.lang.IllegalArgumentException
	at org.gradle.messaging.remote.internal.hub.InterHubMessageSerializer$MessageReader.read(InterHubMessageSerializer.java:77)
	at org.gradle.messaging.remote.internal.hub.InterHubMessageSerializer$MessageReader.read(InterHubMessageSerializer.java:58)
	at org.gradle.messaging.remote.internal.inet.SocketConnection.receive(SocketConnection.java:74)
	... 6 more
org.gradle.messaging.remote.internal.ConnectException: Could not connect to server [96c87916-ef38-428d-b58b-027bd0c3c97a
port:47994, addresses:[/0:0:0:0:0:0:0:1%1, /127.0.0.1]]. Tried addresses: [/0:0:0:0:0:0:0:1%1,
/127.0.0.1].
	at org.gradle.messaging.remote.internal.inet.TcpOutgoingConnector.connect(TcpOutgoingConnector.java:62)
	at org.gradle.messaging.remote.internal.hub.MessageHubBackedClient.getConnection(MessageHubBackedClient.java:35)
	at org.gradle.process.internal.child.ActionExecutionWorker.execute(ActionExecutionWorker.java:58)
	at org.gradle.process.internal.child.ActionExecutionWorker.execute(ActionExecutionWorker.java:37)
	at org.gradle.process.internal.child.ImplementationClassLoaderWorker.execute(ImplementationClassLoaderWorker.java:87)
	at org.gradle.process.internal.child.ImplementationClassLoaderWorker.execute(ImplementationClassLoaderWorker.java:41)
	at org.gradle.process.internal.child.SystemApplicationClassLoaderWorker.call(SystemApplicationClassLoaderWorker.java:49)
	at org.gradle.process.internal.child.SystemApplicationClassLoaderWorker.call(SystemApplicationClassLoaderWorker.java:33)
	at jarjar.org.gradle.process.internal.launcher.GradleWorkerMain.run(GradleWorkerMain.java:69)
	at jarjar.org.gradle.process.internal.launcher.GradleWorkerMain.main(GradleWorkerMain.java:74)
Caused by: java.net.ConnectException: Connection refused
	at sun.nio.ch.Net.connect0(Native Method)
	at sun.nio.ch.Net.connect(Net.java:465)
	at sun.nio.ch.Net.connect(Net.java:457)
	at sun.nio.ch.SocketChannelImpl.connect(SocketChannelImpl.java:639)
	at java.nio.channels.SocketChannel.open(SocketChannel.java:184)
	at org.gradle.messaging.remote.internal.inet.TcpOutgoingConnector.connect(TcpOutgoingConnector.java:53)
	... 9 more
 FAILED

FAILURE: Build failed with an exception.

* What went wrong:
Execution failed for task ':org.qi4j.extensions:org.qi4j.extension.entitystore-riak:test'.
> Process 'Gradle Test Executor 18' finished with non-zero exit value 1

* Try:
Run with --stacktrace option to get the stack trace. Run with --info or --debug option to
get more log output.

BUILD FAILED

Total time: 2 mins 22.11 secs
Build step 'Invoke Gradle script' changed build result to FAILURE
Build step 'Invoke Gradle script' marked build as failure
Xvfb stopping
Recording test results

Mime
View raw message