polygene-dev mailing list archives

Site index · List index
Message view « Date » · « Thread »
Top « Date » · « Thread »
From Apache Jenkins Server <jenk...@builds.apache.org>
Subject Build failed in Jenkins: Zest - Check 2.1-SNAPSHOT distributions from develop branch on Java7 (Oracle JDK) #19
Date Fri, 10 Jul 2015 18:32:33 GMT
See <https://builds.apache.org/job/Zest%20-%20Check%202.1-SNAPSHOT%20distributions%20from%20develop%20branch%20on%20Java7%20(Oracle%20JDK)/19/changes>

Changes:

[paulmerlin] ZEST-55 Rework regressions tests, remove @Ignores, they now pass

[paulmerlin] Build, minor: remove some unused project dependencies

[paulmerlin] Build: always resolve SLF4J to the same version

[hedmann] Bug in AbstractValueCompositeSerializationTest, which invoked the EntityAssembler,
which had a default ValueSerialization service in it, bypassing the one of interest. There
should have been an AmbiguousTypeException as a result, but there weren't, so additional testing
needed.

------------------------------------------
[...truncated 2818 lines...]
Project: org.qi4j.library.rest-server
Project: org.qi4j.library.scheduler
Project: org.qi4j.library.scripting
Project: org.qi4j.library.servlet
Project: org.qi4j.library.shiro-core
Project: org.qi4j.library.shiro-web
Project: org.qi4j.library.spring
Project: org.qi4j.library.sql
Project: org.qi4j.library.sql-bonecp
Project: org.qi4j.library.sql-dbcp
Project: org.qi4j.library.sql-liquibase
Project: org.qi4j.library.uid
Project: org.qi4j.library.uowfile
Project: org.qi4j.extensions
Project: org.qi4j.extension.cache-ehcache
Project: org.qi4j.extension.cache-memcache
Project: org.qi4j.extension.entitystore-memory
Project: org.qi4j.extension.entitystore-file
Project: org.qi4j.extension.entitystore-hazelcast
Project: org.qi4j.extension.entitystore-jclouds
Project: org.qi4j.extension.entitystore-jdbm
Project: org.qi4j.extension.entitystore-leveldb
Project: org.qi4j.extension.entitystore-mongodb
Project: org.qi4j.extension.entitystore-preferences
Project: org.qi4j.extension.entitystore-redis
Project: org.qi4j.extension.entitystore-riak
Project: org.qi4j.extension.entitystore-sql
Project: org.qi4j.extension.entitystore-voldemort
Project: org.qi4j.extension.indexing-elasticsearch
Project: org.qi4j.extension.indexing-rdf
Project: org.qi4j.extension.indexing-solr
Project: org.qi4j.extension.indexing-sql
Project: org.qi4j.extension.metrics-yammer
Project: org.qi4j.extension.migration
Project: org.qi4j.extension.reindexer
Project: org.qi4j.extension.valueserialization-orgjson
Project: org.qi4j.extension.valueserialization-jackson
Project: org.qi4j.extension.valueserialization-stax
Project: org.qi4j.manual
Project: org.qi4j.samples
Project: org.qi4j.sample.dci
Project: org.qi4j.sample.dci-cargo
Project: org.qi4j.sample.dci-cargo.dcisample_a
Project: org.qi4j.sample.dci-cargo.dcisample_b
Project: org.qi4j.sample.forum
Project: org.qi4j.sample.rental
Project: org.qi4j.sample.sql-support
Project: org.qi4j.sample.swing
Project: org.qi4j.tools
Project: org.qi4j.tool.model-detail
Project: org.qi4j.tool.envisage
Project: org.qi4j.tool.shell
Project: org.qi4j.tutorials
Project: org.qi4j.tutorial.cargo
Project: org.qi4j.tutorial.composites
Project: org.qi4j.tutorial.hello
Project: org.qi4j.tutorial.introduction
Project: org.qi4j.tutorial.introduction.twominutes
Project: org.qi4j.tutorial.introduction.tenminutes
Project: org.qi4j.tutorial.introduction.thirtyminutes
Project: org.qi4j.tutorial.services
Project: org.qi4j.tests
Project: org.qi4j.test.regression
Project: org.qi4j.test.performance
:qi4j-sdk-2.1-SNAPSHOT:download
:checkBinDist_goOfflineMaven
Downloading: http://repo1.maven.org/maven2//org/ow2/asm/asm-util/5.0.4/asm-util-5.0.4.pom
2/2K
2K downloaded  (asm-util-5.0.4.pom)
Downloading: http://repo1.maven.org/maven2//org/ow2/asm/asm-tree/5.0.4/asm-tree-5.0.4.pom
2/2K
2K downloaded  (asm-tree-5.0.4.pom)
Downloading: http://repo1.maven.org/maven2//org/ow2/asm/asm-commons/5.0.4/asm-commons-5.0.4.pom
2/2K
2K downloaded  (asm-commons-5.0.4.pom)
Downloading: http://repo1.maven.org/maven2//net/sf/ehcache/ehcache/2.10.0/ehcache-2.10.0.pom
4/18K
8/18K
12/18K
16/18K
18/18K
18K downloaded  (ehcache-2.10.0.pom)
Downloading: http://www.terracotta.org/download/reflector/snapshots/net/sf/ehcache/ehcache-root/2.10.0/ehcache-root-2.10.0.pom
Downloading: http://www.terracotta.org/download/reflector/releases/net/sf/ehcache/ehcache-root/2.10.0/ehcache-root-2.10.0.pom
4/16K
8/16K
12/16K
16/16K
16/16K
16K downloaded  (ehcache-root-2.10.0.pom)
Downloading: http://www.terracotta.org/download/reflector/snapshots/net/sf/ehcache/ehcache-parent/2.17/ehcache-parent-2.17.pom
Downloading: http://www.terracotta.org/download/reflector/releases/net/sf/ehcache/ehcache-parent/2.17/ehcache-parent-2.17.pom
4/16K
8/16K
10/16K
14/16K
16/16K
16K downloaded  (ehcache-parent-2.17.pom)
Downloading: http://repo1.maven.org/maven2//net/spy/spymemcached/2.12.0/spymemcached-2.12.0.pom
1/1K
1K downloaded  (spymemcached-2.12.0.pom)
Downloading: http://repo1.maven.org/maven2//com/hazelcast/hazelcast/3.5/hazelcast-3.5.pom
4/13K
8/13K
12/13K
13/13K
13K downloaded  (hazelcast-3.5.pom)
Downloading: http://repo1.maven.org/maven2//com/hazelcast/hazelcast-root/3.5/hazelcast-root-3.5.pom
4/39K
8/39K
12/39K
15/39K
19/39K
23/39K
27/39K
31/39K
32/39K
36/39K
39/39K
39K downloaded  (hazelcast-root-3.5.pom)
Downloading: http://repo1.maven.org/maven2//com/eclipsesource/minimal-json/minimal-json/0.9.2/minimal-json-0.9.2.pom
3/3K
3K downloaded  (minimal-json-0.9.2.pom)
Downloading: http://repo1.maven.org/maven2//com/hazelcast/hazelcast-code-generator/3.5/hazelcast-code-generator-3.5.pom
1000/1000b
1000b downloaded  (hazelcast-code-generator-3.5.pom)
Downloading: http://repo1.maven.org/maven2//org/freemarker/freemarker/2.3.22/freemarker-2.3.22.pom
1/1K
1K downloaded  (freemarker-2.3.22.pom)
Downloading: http://repo1.maven.org/maven2//org/slf4j/slf4j-api/1.7.12/slf4j-api-1.7.12.pom
2/2K
2K downloaded  (slf4j-api-1.7.12.pom)
Downloading: http://repo1.maven.org/maven2//org/apache/jclouds/jclouds-core/1.9.0/jclouds-core-1.9.0.pom
4/5K
5/5K
5K downloaded  (jclouds-core-1.9.0.pom)
Downloading: http://repo1.maven.org/maven2//org/apache/jclouds/jclouds-project/1.9.0/jclouds-project-1.9.0.pom
4/43K
8/43K
12/43K
16/43K
19/43K
23/43K
27/43K
31/43K
35/43K
39/43K
40/43K
43/43K
43K downloaded  (jclouds-project-1.9.0.pom)
Downloading: http://repo1.maven.org/maven2//com/google/code/gson/gson/2.3/gson-2.3.pom
4/8K
8/8K
8/8K
8K downloaded  (gson-2.3.pom)
[ERROR] BUILD ERROR
:checkBinDist_goOfflineMaven FAILED

FAILURE: Build failed with an exception.

* What went wrong:
Execution failed for task ':checkBinDist_goOfflineMaven'.
> Process 'command 'mvn'' finished with non-zero exit value 1

* Try:
Run with --info or --debug option to get more log output.

* Exception is:
org.gradle.api.tasks.TaskExecutionException: Execution failed for task ':checkBinDist_goOfflineMaven'.
	at org.gradle.api.internal.tasks.execution.ExecuteActionsTaskExecuter.executeActions(ExecuteActionsTaskExecuter.java:69)
	at org.gradle.api.internal.tasks.execution.ExecuteActionsTaskExecuter.execute(ExecuteActionsTaskExecuter.java:46)
	at org.gradle.api.internal.tasks.execution.PostExecutionAnalysisTaskExecuter.execute(PostExecutionAnalysisTaskExecuter.java:35)
	at org.gradle.api.internal.tasks.execution.SkipUpToDateTaskExecuter.execute(SkipUpToDateTaskExecuter.java:64)
	at org.gradle.api.internal.tasks.execution.ValidatingTaskExecuter.execute(ValidatingTaskExecuter.java:58)
	at org.gradle.api.internal.tasks.execution.SkipEmptySourceFilesTaskExecuter.execute(SkipEmptySourceFilesTaskExecuter.java:42)
	at org.gradle.api.internal.tasks.execution.SkipTaskWithNoActionsExecuter.execute(SkipTaskWithNoActionsExecuter.java:52)
	at org.gradle.api.internal.tasks.execution.SkipOnlyIfTaskExecuter.execute(SkipOnlyIfTaskExecuter.java:53)
	at org.gradle.api.internal.tasks.execution.ExecuteAtMostOnceTaskExecuter.execute(ExecuteAtMostOnceTaskExecuter.java:43)
	at org.gradle.api.internal.AbstractTask.executeWithoutThrowingTaskFailure(AbstractTask.java:310)
	at org.gradle.execution.taskgraph.AbstractTaskPlanExecutor$TaskExecutorWorker.executeTask(AbstractTaskPlanExecutor.java:79)
	at org.gradle.execution.taskgraph.AbstractTaskPlanExecutor$TaskExecutorWorker.processTask(AbstractTaskPlanExecutor.java:63)
	at org.gradle.execution.taskgraph.AbstractTaskPlanExecutor$TaskExecutorWorker.run(AbstractTaskPlanExecutor.java:51)
	at org.gradle.execution.taskgraph.DefaultTaskPlanExecutor.process(DefaultTaskPlanExecutor.java:23)
	at org.gradle.execution.taskgraph.DefaultTaskGraphExecuter.execute(DefaultTaskGraphExecuter.java:88)
	at org.gradle.execution.SelectedTaskExecutionAction.execute(SelectedTaskExecutionAction.java:37)
	at org.gradle.execution.DefaultBuildExecuter.execute(DefaultBuildExecuter.java:62)
	at org.gradle.execution.DefaultBuildExecuter.access$200(DefaultBuildExecuter.java:23)
	at org.gradle.execution.DefaultBuildExecuter$2.proceed(DefaultBuildExecuter.java:68)
	at org.gradle.execution.DryRunBuildExecutionAction.execute(DryRunBuildExecutionAction.java:32)
	at org.gradle.execution.DefaultBuildExecuter.execute(DefaultBuildExecuter.java:62)
	at org.gradle.execution.DefaultBuildExecuter.execute(DefaultBuildExecuter.java:55)
	at org.gradle.initialization.DefaultGradleLauncher.doBuildStages(DefaultGradleLauncher.java:149)
	at org.gradle.initialization.DefaultGradleLauncher.doBuild(DefaultGradleLauncher.java:106)
	at org.gradle.initialization.DefaultGradleLauncher.run(DefaultGradleLauncher.java:86)
	at org.gradle.launcher.exec.InProcessBuildActionExecuter$DefaultBuildController.run(InProcessBuildActionExecuter.java:90)
	at org.gradle.tooling.internal.provider.ExecuteBuildActionRunner.run(ExecuteBuildActionRunner.java:28)
	at org.gradle.launcher.exec.ChainingBuildActionRunner.run(ChainingBuildActionRunner.java:35)
	at org.gradle.launcher.exec.InProcessBuildActionExecuter.execute(InProcessBuildActionExecuter.java:41)
	at org.gradle.launcher.exec.InProcessBuildActionExecuter.execute(InProcessBuildActionExecuter.java:28)
	at org.gradle.launcher.exec.DaemonUsageSuggestingBuildActionExecuter.execute(DaemonUsageSuggestingBuildActionExecuter.java:50)
	at org.gradle.launcher.exec.DaemonUsageSuggestingBuildActionExecuter.execute(DaemonUsageSuggestingBuildActionExecuter.java:27)
	at org.gradle.launcher.cli.RunBuildAction.run(RunBuildAction.java:40)
	at org.gradle.internal.Actions$RunnableActionAdapter.execute(Actions.java:169)
	at org.gradle.launcher.cli.CommandLineActionFactory$ParseAndBuildAction.execute(CommandLineActionFactory.java:237)
	at org.gradle.launcher.cli.CommandLineActionFactory$ParseAndBuildAction.execute(CommandLineActionFactory.java:210)
	at org.gradle.launcher.cli.JavaRuntimeValidationAction.execute(JavaRuntimeValidationAction.java:35)
	at org.gradle.launcher.cli.JavaRuntimeValidationAction.execute(JavaRuntimeValidationAction.java:24)
	at org.gradle.launcher.cli.CommandLineActionFactory$WithLogging.execute(CommandLineActionFactory.java:206)
	at org.gradle.launcher.cli.CommandLineActionFactory$WithLogging.execute(CommandLineActionFactory.java:169)
	at org.gradle.launcher.cli.ExceptionReportingAction.execute(ExceptionReportingAction.java:33)
	at org.gradle.launcher.cli.ExceptionReportingAction.execute(ExceptionReportingAction.java:22)
	at org.gradle.launcher.Main.doAction(Main.java:33)
	at org.gradle.launcher.bootstrap.EntryPoint.run(EntryPoint.java:45)
	at org.gradle.launcher.bootstrap.ProcessBootstrap.runNoExit(ProcessBootstrap.java:54)
	at org.gradle.launcher.bootstrap.ProcessBootstrap.run(ProcessBootstrap.java:35)
	at org.gradle.launcher.GradleMain.main(GradleMain.java:23)
	at org.gradle.wrapper.BootstrapMainStarter.start(BootstrapMainStarter.java:30)
	at org.gradle.wrapper.WrapperExecutor.execute(WrapperExecutor.java:127)
	at org.gradle.wrapper.GradleWrapperMain.main(GradleWrapperMain.java:55)
Caused by: org.gradle.process.internal.ExecException: Process 'command 'mvn'' finished with
non-zero exit value 1
	at org.gradle.process.internal.DefaultExecHandle$ExecResultImpl.assertNormalExitValue(DefaultExecHandle.java:365)
	at org.gradle.process.internal.DefaultExecAction.execute(DefaultExecAction.java:31)
	at org.gradle.api.tasks.AbstractExecTask.exec(AbstractExecTask.java:54)
	at org.gradle.internal.reflect.JavaMethod.invoke(JavaMethod.java:75)
	at org.gradle.api.internal.project.taskfactory.AnnotationProcessingTaskFactory$StandardTaskAction.doExecute(AnnotationProcessingTaskFactory.java:226)
	at org.gradle.api.internal.project.taskfactory.AnnotationProcessingTaskFactory$StandardTaskAction.execute(AnnotationProcessingTaskFactory.java:219)
	at org.gradle.api.internal.project.taskfactory.AnnotationProcessingTaskFactory$StandardTaskAction.execute(AnnotationProcessingTaskFactory.java:208)
	at org.gradle.api.internal.AbstractTask$TaskActionWrapper.execute(AbstractTask.java:589)
	at org.gradle.api.internal.AbstractTask$TaskActionWrapper.execute(AbstractTask.java:572)
	at org.gradle.api.internal.tasks.execution.ExecuteActionsTaskExecuter.executeAction(ExecuteActionsTaskExecuter.java:80)
	at org.gradle.api.internal.tasks.execution.ExecuteActionsTaskExecuter.executeActions(ExecuteActionsTaskExecuter.java:61)
	... 49 more


BUILD FAILED

Total time: 14 mins 54.724 secs
Build step 'Invoke Gradle script' changed build result to FAILURE
Build step 'Invoke Gradle script' marked build as failure
Xvfb stopping
Archiving artifacts
Sending artifact delta relative to Zest - Check 2.1-SNAPSHOT distributions from develop branch
on Java7 (Oracle JDK) #18
Archived 4 artifacts
Archive block size is 32768
Received 9 blocks and 36526468 bytes
Compression is 0.8%
Took 7.8 sec
Recording test results
Publishing Javadoc

Mime
View raw message