polygene-dev mailing list archives

Site index · List index
Message view « Date » · « Thread »
Top « Date » · « Thread »
From Apache Jenkins Server <jenk...@builds.apache.org>
Subject Build failed in Jenkins: Zest-Qi4j develop check on Java7 (Oracle JDK) #10
Date Mon, 15 Jun 2015 00:56:59 GMT
See <https://builds.apache.org/job/Zest-Qi4j%20develop%20check%20on%20Java7%20(Oracle%20JDK)/10/changes>

Changes:

[niclas] Have to remove lang-jruby and lang-beanshell due to Licensing restrictions of ASF.

[niclas] Removing CXF Library, as it is very dated and we have no interest in maintain XML
based technologies.

------------------------------------------
[...truncated 1807 lines...]
:org.qi4j.tutorials:org.qi4j.tutorial.hello:makeVersionClass
:org.qi4j.tutorials:org.qi4j.tutorial.hello:compileVersionJava
:org.qi4j.tutorials:org.qi4j.tutorial.hello:compileJava
:org.qi4j.tutorials:org.qi4j.tutorial.hello:processResources UP-TO-DATE
:org.qi4j.tutorials:org.qi4j.tutorial.hello:classes
:org.qi4j.tutorials:org.qi4j.tutorial.hello:compileTestJava
:org.qi4j.tutorials:org.qi4j.tutorial.hello:processTestResources UP-TO-DATE
:org.qi4j.tutorials:org.qi4j.tutorial.hello:testClasses
:org.qi4j.tutorials:org.qi4j.tutorial.hello:test
:org.qi4j.tutorials:org.qi4j.tutorial.introduction:makeVersionClass
:org.qi4j.tutorials:org.qi4j.tutorial.introduction:compileVersionJava
:org.qi4j.tutorials:org.qi4j.tutorial.introduction:compileJava
:org.qi4j.tutorials:org.qi4j.tutorial.introduction:processResources UP-TO-DATE
:org.qi4j.tutorials:org.qi4j.tutorial.introduction:classes
:org.qi4j.tutorials:org.qi4j.tutorial.introduction:compileTestJava UP-TO-DATE
:org.qi4j.tutorials:org.qi4j.tutorial.introduction:processTestResources UP-TO-DATE
:org.qi4j.tutorials:org.qi4j.tutorial.introduction:testClasses UP-TO-DATE
:org.qi4j.tutorials:org.qi4j.tutorial.introduction:test UP-TO-DATE
:org.qi4j.tutorials:org.qi4j.tutorial.services:makeVersionClass
:org.qi4j.tutorials:org.qi4j.tutorial.services:compileVersionJava
:org.qi4j.tutorials:org.qi4j.tutorial.services:compileJava
:org.qi4j.tutorials:org.qi4j.tutorial.services:processResources
:org.qi4j.tutorials:org.qi4j.tutorial.services:classes
:org.qi4j.tutorials:org.qi4j.tutorial.services:compileTestJava
:org.qi4j.tutorials:org.qi4j.tutorial.services:processTestResources UP-TO-DATE
:org.qi4j.tutorials:org.qi4j.tutorial.services:testClasses
:org.qi4j.tutorials:org.qi4j.tutorial.services:test
:org.qi4j.tools:org.qi4j.tool.envisage:processVersionResources UP-TO-DATE
:org.qi4j.tools:org.qi4j.tool.envisage:versionClasses
:org.qi4j.tools:org.qi4j.tool.envisage:jar
:org.qi4j.samples:org.qi4j.sample.dci-cargo:org.qi4j.sample.dci-cargo.dcisample_a:makeVersionClass
:org.qi4j.samples:org.qi4j.sample.dci-cargo:org.qi4j.sample.dci-cargo.dcisample_a:compileVersionJava
:org.qi4j.samples:org.qi4j.sample.dci-cargo:org.qi4j.sample.dci-cargo.dcisample_a:compileJava
Download https://repo1.maven.org/maven2/org/apache/wicket/wicket-core/1.5.8/wicket-core-1.5.8.pom
Download https://repo1.maven.org/maven2/org/apache/wicket/wicket-parent/1.5.8/wicket-parent-1.5.8.pom
Download https://repo1.maven.org/maven2/org/apache/wicket/wicket-datetime/1.5.8/wicket-datetime-1.5.8.pom
Download https://repo1.maven.org/maven2/org/apache/wicket/wicket-extensions/1.5.8/wicket-extensions-1.5.8.pom
Download https://repo1.maven.org/maven2/org/apache/wicket/wicket-devutils/1.5.8/wicket-devutils-1.5.8.pom
Download https://repo1.maven.org/maven2/com/jolira/wicket-stateless/1.5.0/wicket-stateless-1.5.0.pom
Download https://repo1.maven.org/maven2/com/jolira/wicket-stateless-parent/1.5.0/wicket-stateless-parent-1.5.0.pom
Download https://repo1.maven.org/maven2/com/jolira/superpom/1.1.4/superpom-1.1.4.pom
Download https://repo1.maven.org/maven2/org/apache/wicket/wicket-util/1.5.8/wicket-util-1.5.8.pom
Download https://repo1.maven.org/maven2/org/apache/wicket/wicket-request/1.5.8/wicket-request-1.5.8.pom
Download https://repo1.maven.org/maven2/org/apache/wicket/wicket-core/1.5.8/wicket-core-1.5.8.jar
Download https://repo1.maven.org/maven2/org/apache/wicket/wicket-datetime/1.5.8/wicket-datetime-1.5.8.jar
Download https://repo1.maven.org/maven2/org/apache/wicket/wicket-extensions/1.5.8/wicket-extensions-1.5.8.jar
Download https://repo1.maven.org/maven2/org/apache/wicket/wicket-devutils/1.5.8/wicket-devutils-1.5.8.jar
Download https://repo1.maven.org/maven2/com/jolira/wicket-stateless/1.5.0/wicket-stateless-1.5.0.jar
Download https://repo1.maven.org/maven2/org/apache/wicket/wicket-util/1.5.8/wicket-util-1.5.8.jar
Download https://repo1.maven.org/maven2/org/apache/wicket/wicket-request/1.5.8/wicket-request-1.5.8.jar
<https://builds.apache.org/job/Zest-Qi4j%20develop%20check%20on%20Java7%20(Oracle%20JDK)/ws/samples/dci-cargo/dcisample_a/src/main/java/org/qi4j/sample/dcicargo/sample_a/context/shipping/booking/BookNewCargo.java>:22:
warning: [deprecation] DateMidnight in org.joda.time has been deprecated
import org.joda.time.DateMidnight;
                    ^
<https://builds.apache.org/job/Zest-Qi4j%20develop%20check%20on%20Java7%20(Oracle%20JDK)/ws/samples/dci-cargo/dcisample_a/src/main/java/org/qi4j/sample/dcicargo/sample_a/context/shipping/booking/BookNewCargo.java>:242:
warning: [deprecation] DateMidnight in org.joda.time has been deprecated
        Date endOfToday = new DateMidnight().plusDays( 1 ).toDate();
                              ^
2 warnings
:org.qi4j.samples:org.qi4j.sample.dci-cargo:org.qi4j.sample.dci-cargo.dcisample_a:processResources
:org.qi4j.samples:org.qi4j.sample.dci-cargo:org.qi4j.sample.dci-cargo.dcisample_a:classes
:org.qi4j.samples:org.qi4j.sample.dci-cargo:org.qi4j.sample.dci-cargo.dcisample_a:compileTestJava
:org.qi4j.samples:org.qi4j.sample.dci-cargo:org.qi4j.sample.dci-cargo.dcisample_a:processTestResources
UP-TO-DATE
:org.qi4j.samples:org.qi4j.sample.dci-cargo:org.qi4j.sample.dci-cargo.dcisample_a:testClasses
:org.qi4j.samples:org.qi4j.sample.dci-cargo:org.qi4j.sample.dci-cargo.dcisample_a:test
:org.qi4j.samples:org.qi4j.sample.dci-cargo:org.qi4j.sample.dci-cargo.dcisample_b:makeVersionClass
:org.qi4j.samples:org.qi4j.sample.dci-cargo:org.qi4j.sample.dci-cargo.dcisample_b:compileVersionJava
:org.qi4j.samples:org.qi4j.sample.dci-cargo:org.qi4j.sample.dci-cargo.dcisample_b:compileJava<https://builds.apache.org/job/Zest-Qi4j%20develop%20check%20on%20Java7%20(Oracle%20JDK)/ws/samples/dci-cargo/dcisample_b/src/main/java/org/qi4j/sample/dcicargo/sample_b/data/factory/RouteSpecificationFactoryService.java>:21:
warning: [deprecation] DateMidnight in org.joda.time has been deprecated
import org.joda.time.DateMidnight;
                    ^
<https://builds.apache.org/job/Zest-Qi4j%20develop%20check%20on%20Java7%20(Oracle%20JDK)/ws/samples/dci-cargo/dcisample_b/src/main/java/org/qi4j/sample/dcicargo/sample_b/data/factory/RouteSpecificationFactoryService.java>:62:
warning: [deprecation] DateMidnight in org.joda.time has been deprecated
            Date endOfToday = new DateMidnight().plusDays( 1 ).toDate();
                                  ^
2 warnings

:org.qi4j.samples:org.qi4j.sample.dci-cargo:org.qi4j.sample.dci-cargo.dcisample_b:processResources
:org.qi4j.samples:org.qi4j.sample.dci-cargo:org.qi4j.sample.dci-cargo.dcisample_b:classes
:org.qi4j.samples:org.qi4j.sample.dci-cargo:org.qi4j.sample.dci-cargo.dcisample_b:compileTestJava
:org.qi4j.samples:org.qi4j.sample.dci-cargo:org.qi4j.sample.dci-cargo.dcisample_b:processTestResources
UP-TO-DATE
:org.qi4j.samples:org.qi4j.sample.dci-cargo:org.qi4j.sample.dci-cargo.dcisample_b:testClasses
:org.qi4j.samples:org.qi4j.sample.dci-cargo:org.qi4j.sample.dci-cargo.dcisample_b:test
:org.qi4j.tutorials:org.qi4j.tutorial.introduction:org.qi4j.tutorial.introduction.tenminutes:makeVersionClass
:org.qi4j.tutorials:org.qi4j.tutorial.introduction:org.qi4j.tutorial.introduction.tenminutes:compileVersionJava
:org.qi4j.tutorials:org.qi4j.tutorial.introduction:org.qi4j.tutorial.introduction.tenminutes:compileJava
:org.qi4j.tutorials:org.qi4j.tutorial.introduction:org.qi4j.tutorial.introduction.tenminutes:processResources
UP-TO-DATE
:org.qi4j.tutorials:org.qi4j.tutorial.introduction:org.qi4j.tutorial.introduction.tenminutes:classes
:org.qi4j.tutorials:org.qi4j.tutorial.introduction:org.qi4j.tutorial.introduction.tenminutes:compileTestJava
UP-TO-DATE
:org.qi4j.tutorials:org.qi4j.tutorial.introduction:org.qi4j.tutorial.introduction.tenminutes:processTestResources
UP-TO-DATE
:org.qi4j.tutorials:org.qi4j.tutorial.introduction:org.qi4j.tutorial.introduction.tenminutes:testClasses
UP-TO-DATE
:org.qi4j.tutorials:org.qi4j.tutorial.introduction:org.qi4j.tutorial.introduction.tenminutes:test
UP-TO-DATE
:org.qi4j.tutorials:org.qi4j.tutorial.introduction:org.qi4j.tutorial.introduction.tenminutes:processVersionResources
UP-TO-DATE
:org.qi4j.tutorials:org.qi4j.tutorial.introduction:org.qi4j.tutorial.introduction.tenminutes:versionClasses
:org.qi4j.tutorials:org.qi4j.tutorial.introduction:org.qi4j.tutorial.introduction.tenminutes:jar
:org.qi4j.tutorials:org.qi4j.tutorial.introduction:org.qi4j.tutorial.introduction.thirtyminutes:makeVersionClass
:org.qi4j.tutorials:org.qi4j.tutorial.introduction:org.qi4j.tutorial.introduction.thirtyminutes:compileVersionJava
:org.qi4j.tutorials:org.qi4j.tutorial.introduction:org.qi4j.tutorial.introduction.thirtyminutes:compileJavaNote:
<https://builds.apache.org/job/Zest-Qi4j%20develop%20check%20on%20Java7%20(Oracle%20JDK)/ws/tutorials/introduction/thirtyminutes/src/main/java/org/qi4j/demo/thirtyminutes/ThirtyMinutesDocs.java>
uses unchecked or unsafe operations.
Note: Recompile with -Xlint:unchecked for details.

:org.qi4j.tutorials:org.qi4j.tutorial.introduction:org.qi4j.tutorial.introduction.thirtyminutes:processResources
UP-TO-DATE
:org.qi4j.tutorials:org.qi4j.tutorial.introduction:org.qi4j.tutorial.introduction.thirtyminutes:classes
:org.qi4j.tutorials:org.qi4j.tutorial.introduction:org.qi4j.tutorial.introduction.thirtyminutes:compileTestJava
UP-TO-DATE
:org.qi4j.tutorials:org.qi4j.tutorial.introduction:org.qi4j.tutorial.introduction.thirtyminutes:processTestResources
UP-TO-DATE
:org.qi4j.tutorials:org.qi4j.tutorial.introduction:org.qi4j.tutorial.introduction.thirtyminutes:testClasses
UP-TO-DATE
:org.qi4j.tutorials:org.qi4j.tutorial.introduction:org.qi4j.tutorial.introduction.thirtyminutes:test
UP-TO-DATE
:org.qi4j.tutorials:org.qi4j.tutorial.introduction:org.qi4j.tutorial.introduction.twominutes:makeVersionClass
:org.qi4j.tutorials:org.qi4j.tutorial.introduction:org.qi4j.tutorial.introduction.twominutes:compileVersionJava
:org.qi4j.tutorials:org.qi4j.tutorial.introduction:org.qi4j.tutorial.introduction.twominutes:compileJava
:org.qi4j.tutorials:org.qi4j.tutorial.introduction:org.qi4j.tutorial.introduction.twominutes:processResources
UP-TO-DATE
:org.qi4j.tutorials:org.qi4j.tutorial.introduction:org.qi4j.tutorial.introduction.twominutes:classes
:org.qi4j.tutorials:org.qi4j.tutorial.introduction:org.qi4j.tutorial.introduction.twominutes:compileTestJava
UP-TO-DATE
:org.qi4j.tutorials:org.qi4j.tutorial.introduction:org.qi4j.tutorial.introduction.twominutes:processTestResources
UP-TO-DATE
:org.qi4j.tutorials:org.qi4j.tutorial.introduction:org.qi4j.tutorial.introduction.twominutes:testClasses
UP-TO-DATE
:org.qi4j.tutorials:org.qi4j.tutorial.introduction:org.qi4j.tutorial.introduction.twominutes:test
UP-TO-DATE
:globalTestReport
:compileTestJava UP-TO-DATE
:processTestResources UP-TO-DATE
:testClasses UP-TO-DATE
:test UP-TO-DATE
:check UP-TO-DATE
:org.qi4j.core:check UP-TO-DATE
:org.qi4j.extensions:check UP-TO-DATE
:org.qi4j.libraries:check UP-TO-DATE
:org.qi4j.manual:check UP-TO-DATE
:org.qi4j.samples:check UP-TO-DATE
:org.qi4j.tests:check UP-TO-DATE
:org.qi4j.tools:check UP-TO-DATE
:org.qi4j.tutorials:check UP-TO-DATE
:org.qi4j.core:org.qi4j.core.api:check
:org.qi4j.core:org.qi4j.core.bootstrap:check
:org.qi4j.core:org.qi4j.core.functional:check
:org.qi4j.core:org.qi4j.core.io:check
:org.qi4j.core:org.qi4j.core.runtime:check
:org.qi4j.core:org.qi4j.core.spi:check
:org.qi4j.core:org.qi4j.core.testsupport:check UP-TO-DATE
:org.qi4j.extensions:org.qi4j.extension.cache-ehcache:check
:org.qi4j.extensions:org.qi4j.extension.cache-memcache:check
:org.qi4j.extensions:org.qi4j.extension.entitystore-file:check
:org.qi4j.extensions:org.qi4j.extension.entitystore-hazelcast:check
:org.qi4j.extensions:org.qi4j.extension.entitystore-jclouds:check
:org.qi4j.extensions:org.qi4j.extension.entitystore-jdbm:check
:org.qi4j.extensions:org.qi4j.extension.entitystore-leveldb:check
:org.qi4j.extensions:org.qi4j.extension.entitystore-memory:check
:org.qi4j.extensions:org.qi4j.extension.entitystore-mongodb:check
:org.qi4j.extensions:org.qi4j.extension.entitystore-preferences:check
:org.qi4j.extensions:org.qi4j.extension.entitystore-redis:check
:org.qi4j.extensions:org.qi4j.extension.entitystore-riak:check
:org.qi4j.extensions:org.qi4j.extension.entitystore-sql:check
:org.qi4j.extensions:org.qi4j.extension.entitystore-voldemort:check
:org.qi4j.extensions:org.qi4j.extension.indexing-elasticsearch:check
:org.qi4j.extensions:org.qi4j.extension.indexing-rdf:check
:org.qi4j.extensions:org.qi4j.extension.indexing-solr:check
:org.qi4j.extensions:org.qi4j.extension.indexing-sql:check
:org.qi4j.extensions:org.qi4j.extension.metrics-yammer:check
:org.qi4j.extensions:org.qi4j.extension.migration:check
:org.qi4j.extensions:org.qi4j.extension.reindexer:check
:org.qi4j.extensions:org.qi4j.extension.valueserialization-jackson:check
:org.qi4j.extensions:org.qi4j.extension.valueserialization-orgjson:check
:org.qi4j.extensions:org.qi4j.extension.valueserialization-stax:check
:org.qi4j.libraries:org.qi4j.library.alarm:check
:org.qi4j.libraries:org.qi4j.library.circuitbreaker:check
:org.qi4j.libraries:org.qi4j.library.constraints:check
:org.qi4j.libraries:org.qi4j.library.conversion:check
:org.qi4j.libraries:org.qi4j.library.eventsourcing:check
:org.qi4j.libraries:org.qi4j.library.eventsourcing-jdbm:check
:org.qi4j.libraries:org.qi4j.library.eventsourcing-rest:check
:org.qi4j.libraries:org.qi4j.library.fileconfig:check
:org.qi4j.libraries:org.qi4j.library.http:check
:org.qi4j.libraries:org.qi4j.library.invocation-cache:check UP-TO-DATE
:org.qi4j.libraries:org.qi4j.library.jmx:check
:org.qi4j.libraries:org.qi4j.library.lang-groovy:check
:org.qi4j.libraries:org.qi4j.library.lang-javascript:check
:org.qi4j.libraries:org.qi4j.library.lang-scala:check UP-TO-DATE
:org.qi4j.libraries:org.qi4j.library.locking:check
:org.qi4j.libraries:org.qi4j.library.logging:check
:org.qi4j.libraries:org.qi4j.library.metrics:check
:org.qi4j.libraries:org.qi4j.library.osgi:check
:org.qi4j.libraries:org.qi4j.library.rdf:check
:org.qi4j.libraries:org.qi4j.library.rest:check
:org.qi4j.libraries:org.qi4j.library.rest-client:check
:org.qi4j.libraries:org.qi4j.library.rest-common:check UP-TO-DATE
:org.qi4j.libraries:org.qi4j.library.rest-server:check
:org.qi4j.libraries:org.qi4j.library.scheduler:check
:org.qi4j.libraries:org.qi4j.library.scripting:check
:org.qi4j.libraries:org.qi4j.library.servlet:check
:org.qi4j.libraries:org.qi4j.library.shiro-core:check
:org.qi4j.libraries:org.qi4j.library.shiro-web:check
:org.qi4j.libraries:org.qi4j.library.spring:check
:org.qi4j.libraries:org.qi4j.library.sql:check
:org.qi4j.libraries:org.qi4j.library.sql-bonecp:check UP-TO-DATE
:org.qi4j.libraries:org.qi4j.library.sql-c3p0:check UP-TO-DATE
:org.qi4j.libraries:org.qi4j.library.sql-dbcp:check UP-TO-DATE
:org.qi4j.libraries:org.qi4j.library.sql-liquibase:check
:org.qi4j.libraries:org.qi4j.library.struts2-codebehind:check UP-TO-DATE
:org.qi4j.libraries:org.qi4j.library.struts2-convention:check UP-TO-DATE
:org.qi4j.libraries:org.qi4j.library.struts2-plugin:check
:org.qi4j.libraries:org.qi4j.library.uid:check
:org.qi4j.libraries:org.qi4j.library.uowfile:check
:org.qi4j.samples:org.qi4j.sample.dci:check
:org.qi4j.samples:org.qi4j.sample.dci-cargo:check UP-TO-DATE
:org.qi4j.samples:org.qi4j.sample.forum:check
:org.qi4j.samples:org.qi4j.sample.rental:check UP-TO-DATE
:org.qi4j.samples:org.qi4j.sample.sql-support:check UP-TO-DATE
:org.qi4j.samples:org.qi4j.sample.struts2Hello:check UP-TO-DATE
:org.qi4j.samples:org.qi4j.sample.swing:check UP-TO-DATE
:org.qi4j.extensions:org.qi4j.extension.cache-ehcache:processVersionResources UP-TO-DATE
:org.qi4j.extensions:org.qi4j.extension.cache-ehcache:versionClasses
:org.qi4j.extensions:org.qi4j.extension.cache-ehcache:jar
:org.qi4j.extensions:org.qi4j.extension.entitystore-memory:processVersionResources UP-TO-DATE
:org.qi4j.extensions:org.qi4j.extension.entitystore-memory:versionClasses
:org.qi4j.extensions:org.qi4j.extension.entitystore-memory:jar
:org.qi4j.tests:org.qi4j.test.performance:compilePerfJava
:org.qi4j.tests:org.qi4j.test.performance:check
:org.qi4j.tests:org.qi4j.test.regression:check UP-TO-DATE
:org.qi4j.tools:org.qi4j.tool.envisage:check
:org.qi4j.tools:org.qi4j.tool.model-detail:check
:org.qi4j.tools:org.qi4j.tool.shell:check UP-TO-DATE
:org.qi4j.tutorials:org.qi4j.tutorial.cargo:check
:org.qi4j.tutorials:org.qi4j.tutorial.composites:check
:org.qi4j.tutorials:org.qi4j.tutorial.hello:check
:org.qi4j.tutorials:org.qi4j.tutorial.introduction:check UP-TO-DATE
:org.qi4j.tutorials:org.qi4j.tutorial.services:check
:org.qi4j.samples:org.qi4j.sample.dci-cargo:org.qi4j.sample.dci-cargo.dcisample_a:check
:org.qi4j.samples:org.qi4j.sample.dci-cargo:org.qi4j.sample.dci-cargo.dcisample_b:check
:org.qi4j.tutorials:org.qi4j.tutorial.introduction:org.qi4j.tutorial.introduction.tenminutes:check
UP-TO-DATE
:org.qi4j.tutorials:org.qi4j.tutorial.introduction:org.qi4j.tutorial.introduction.thirtyminutes:check
UP-TO-DATE
:org.qi4j.tutorials:org.qi4j.tutorial.introduction:org.qi4j.tutorial.introduction.twominutes:check

Test failures in:
  org.qi4j.tool.envisage

:org.qi4j.tutorials:org.qi4j.tutorial.introduction:org.qi4j.tutorial.introduction.twominutes:check
FAILED

FAILURE: Build failed with an exception.

* Where:
Build file '<https://builds.apache.org/job/Zest-Qi4j%20develop%20check%20on%20Java7%20(Oracle%20JDK)/ws/build.gradle'>
line: 391

* What went wrong:
Execution failed for task ':org.qi4j.tutorials:org.qi4j.tutorial.introduction:org.qi4j.tutorial.introduction.twominutes:check'.
> There was TEST FAILURES!! See list above.

* Try:
Run with --stacktrace option to get the stack trace. Run with --info or --debug option to
get more log output.

BUILD FAILED

Total time: 9 mins 33.864 secs
Build step 'Invoke Gradle script' changed build result to FAILURE
Build step 'Invoke Gradle script' marked build as failure
Xvfb stopping
Recording test results

Mime
View raw message