polygene-dev mailing list archives

Site index · List index
Message view « Date » · « Thread »
Top « Date » · « Thread »
From Apache Jenkins Server <jenk...@builds.apache.org>
Subject Build failed in Jenkins: Zest-qi4j develop on Java7 (Oracle JDK) #7
Date Sat, 13 Jun 2015 20:51:56 GMT
See <https://builds.apache.org/job/Zest-qi4j%20develop%20on%20Java7%20(Oracle%20JDK)/7/changes>

Changes:

[paulmerlin] ZEST-25 Remove spurious `src` subdir in the ’Source SDK’ archive (build)

[paulmerlin] ZEST-27 build: the `release` task now depends on the `rat` task

------------------------------------------
[...truncated 1440 lines...]
:org.qi4j.extensions:org.qi4j.extension.indexing-sql:jar
:org.qi4j.samples:org.qi4j.sample.sql-support:makeVersionClass
:org.qi4j.samples:org.qi4j.sample.sql-support:compileVersionJava
:org.qi4j.samples:org.qi4j.sample.sql-support:compileJava
:org.qi4j.samples:org.qi4j.sample.sql-support:processResources
:org.qi4j.samples:org.qi4j.sample.sql-support:classes
:org.qi4j.samples:org.qi4j.sample.sql-support:compileTestJava UP-TO-DATE
:org.qi4j.samples:org.qi4j.sample.sql-support:processTestResources UP-TO-DATE
:org.qi4j.samples:org.qi4j.sample.sql-support:testClasses UP-TO-DATE
:org.qi4j.samples:org.qi4j.sample.sql-support:test UP-TO-DATE
:org.qi4j.libraries:org.qi4j.library.struts2-codebehind:processVersionResources UP-TO-DATE
:org.qi4j.libraries:org.qi4j.library.struts2-codebehind:versionClasses
:org.qi4j.libraries:org.qi4j.library.struts2-codebehind:jar
:org.qi4j.samples:org.qi4j.sample.struts2Hello:makeVersionClass
:org.qi4j.samples:org.qi4j.sample.struts2Hello:compileVersionJava
:org.qi4j.samples:org.qi4j.sample.struts2Hello:compileJava<https://builds.apache.org/job/Zest-qi4j%20develop%20on%20Java7%20(Oracle%20JDK)/ws/samples/struts2Hello/src/main/java/org/qi4j/library/struts2/example/actions/HelloWorldAction.java>:25:
warning: [deprecation] Validation in com.opensymphony.xwork2.validator.annotations has been
deprecated
import com.opensymphony.xwork2.validator.annotations.Validation;
                                                    ^
<https://builds.apache.org/job/Zest-qi4j%20develop%20on%20Java7%20(Oracle%20JDK)/ws/samples/struts2Hello/src/main/java/org/qi4j/library/struts2/example/actions/HelloWorldAction.java>:31:
warning: [deprecation] Validation in com.opensymphony.xwork2.validator.annotations has been
deprecated
@Validation
 ^
Note: <https://builds.apache.org/job/Zest-qi4j%20develop%20on%20Java7%20(Oracle%20JDK)/ws/samples/struts2Hello/src/main/java/org/qi4j/library/struts2/example/listener/ExampleBootstrapListener.java>
uses unchecked or unsafe operations.
Note: Recompile with -Xlint:unchecked for details.
2 warnings

:org.qi4j.samples:org.qi4j.sample.struts2Hello:processResources
:org.qi4j.samples:org.qi4j.sample.struts2Hello:classes
:org.qi4j.samples:org.qi4j.sample.struts2Hello:compileTestJava UP-TO-DATE
:org.qi4j.samples:org.qi4j.sample.struts2Hello:processTestResources UP-TO-DATE
:org.qi4j.samples:org.qi4j.sample.struts2Hello:testClasses UP-TO-DATE
:org.qi4j.samples:org.qi4j.sample.struts2Hello:test UP-TO-DATE
:org.qi4j.samples:org.qi4j.sample.swing:makeVersionClass
:org.qi4j.samples:org.qi4j.sample.swing:compileVersionJava
:org.qi4j.samples:org.qi4j.sample.swing:compileJavaNote: Some input files use unchecked or
unsafe operations.
Note: Recompile with -Xlint:unchecked for details.

:org.qi4j.samples:org.qi4j.sample.swing:processResources UP-TO-DATE
:org.qi4j.samples:org.qi4j.sample.swing:classes
:org.qi4j.samples:org.qi4j.sample.swing:compileTestJava UP-TO-DATE
:org.qi4j.samples:org.qi4j.sample.swing:processTestResources UP-TO-DATE
:org.qi4j.samples:org.qi4j.sample.swing:testClasses UP-TO-DATE
:org.qi4j.samples:org.qi4j.sample.swing:test UP-TO-DATE
:org.qi4j.tests:org.qi4j.test.performance:makeVersionClass
:org.qi4j.tests:org.qi4j.test.performance:compileVersionJava
:org.qi4j.tests:org.qi4j.test.performance:compileJava
:org.qi4j.tests:org.qi4j.test.performance:processResources UP-TO-DATE
:org.qi4j.tests:org.qi4j.test.performance:classes
:org.qi4j.tests:org.qi4j.test.performance:compileTestJava UP-TO-DATE
:org.qi4j.tests:org.qi4j.test.performance:processTestResources UP-TO-DATE
:org.qi4j.tests:org.qi4j.test.performance:testClasses UP-TO-DATE
:org.qi4j.tests:org.qi4j.test.performance:test UP-TO-DATE
:org.qi4j.tests:org.qi4j.test.regression:makeVersionClass
:org.qi4j.tests:org.qi4j.test.regression:compileVersionJava
:org.qi4j.tests:org.qi4j.test.regression:compileJava
:org.qi4j.tests:org.qi4j.test.regression:processResources UP-TO-DATE
:org.qi4j.tests:org.qi4j.test.regression:classes
:org.qi4j.tests:org.qi4j.test.regression:compileTestJava UP-TO-DATE
:org.qi4j.tests:org.qi4j.test.regression:processTestResources UP-TO-DATE
:org.qi4j.tests:org.qi4j.test.regression:testClasses UP-TO-DATE
:org.qi4j.tests:org.qi4j.test.regression:test UP-TO-DATE
:org.qi4j.tools:org.qi4j.tool.envisage:makeVersionClass
:org.qi4j.tools:org.qi4j.tool.envisage:compileVersionJava
:org.qi4j.tools:org.qi4j.tool.envisage:compileJavaNote: Some input files use unchecked or
unsafe operations.
Note: Recompile with -Xlint:unchecked for details.

:org.qi4j.tools:org.qi4j.tool.envisage:processResources
:org.qi4j.tools:org.qi4j.tool.envisage:classes
:org.qi4j.tools:org.qi4j.tool.envisage:compileTestJava
:org.qi4j.tools:org.qi4j.tool.envisage:processTestResources UP-TO-DATE
:org.qi4j.tools:org.qi4j.tool.envisage:testClasses
:org.qi4j.tools:org.qi4j.tool.envisage:test
:org.qi4j.tools:org.qi4j.tool.model-detail:compileTestJavaNote: <https://builds.apache.org/job/Zest-qi4j%20develop%20on%20Java7%20(Oracle%20JDK)/ws/tools/model-detail/src/test/java/org/qi4j/tools/model/VisitableDetailTest.java>
uses unchecked or unsafe operations.
Note: Recompile with -Xlint:unchecked for details.

:org.qi4j.tools:org.qi4j.tool.model-detail:processTestResources UP-TO-DATE
:org.qi4j.tools:org.qi4j.tool.model-detail:testClasses
:org.qi4j.tools:org.qi4j.tool.model-detail:test
:org.qi4j.tools:org.qi4j.tool.shell:makeVersionClass
:org.qi4j.tools:org.qi4j.tool.shell:compileVersionJava
:org.qi4j.tools:org.qi4j.tool.shell:compileJava
:org.qi4j.tools:org.qi4j.tool.shell:processResources UP-TO-DATE
:org.qi4j.tools:org.qi4j.tool.shell:classes
:org.qi4j.tools:org.qi4j.tool.shell:compileTestJava UP-TO-DATE
:org.qi4j.tools:org.qi4j.tool.shell:processTestResources UP-TO-DATE
:org.qi4j.tools:org.qi4j.tool.shell:testClasses UP-TO-DATE
:org.qi4j.tools:org.qi4j.tool.shell:test UP-TO-DATE
:org.qi4j.tutorials:org.qi4j.tutorial.cargo:makeVersionClass
:org.qi4j.tutorials:org.qi4j.tutorial.cargo:compileVersionJava
:org.qi4j.tutorials:org.qi4j.tutorial.cargo:compileJava
:org.qi4j.tutorials:org.qi4j.tutorial.cargo:processResources UP-TO-DATE
:org.qi4j.tutorials:org.qi4j.tutorial.cargo:classes
:org.qi4j.tutorials:org.qi4j.tutorial.cargo:compileTestJavaNote: <https://builds.apache.org/job/Zest-qi4j%20develop%20on%20Java7%20(Oracle%20JDK)/ws/tutorials/cargo/src/test/java/org/qi4j/tutorials/cargo/step2/SequencingConcernTest.java>
uses unchecked or unsafe operations.
Note: Recompile with -Xlint:unchecked for details.

:org.qi4j.tutorials:org.qi4j.tutorial.cargo:processTestResources UP-TO-DATE
:org.qi4j.tutorials:org.qi4j.tutorial.cargo:testClasses
:org.qi4j.tutorials:org.qi4j.tutorial.cargo:test
:org.qi4j.libraries:org.qi4j.library.lang-jruby:processVersionResources UP-TO-DATE
:org.qi4j.libraries:org.qi4j.library.lang-jruby:versionClasses
:org.qi4j.libraries:org.qi4j.library.lang-jruby:jar
:org.qi4j.tutorials:org.qi4j.tutorial.composites:makeVersionClass
:org.qi4j.tutorials:org.qi4j.tutorial.composites:compileVersionJava
:org.qi4j.tutorials:org.qi4j.tutorial.composites:compileJava
:org.qi4j.tutorials:org.qi4j.tutorial.composites:processResources UP-TO-DATE
:org.qi4j.tutorials:org.qi4j.tutorial.composites:classes
:org.qi4j.tutorials:org.qi4j.tutorial.composites:compileTestJava
:org.qi4j.tutorials:org.qi4j.tutorial.composites:processTestResources UP-TO-DATE
:org.qi4j.tutorials:org.qi4j.tutorial.composites:testClasses
:org.qi4j.tutorials:org.qi4j.tutorial.composites:test
:org.qi4j.tutorials:org.qi4j.tutorial.hello:makeVersionClass
:org.qi4j.tutorials:org.qi4j.tutorial.hello:compileVersionJava
:org.qi4j.tutorials:org.qi4j.tutorial.hello:compileJava
:org.qi4j.tutorials:org.qi4j.tutorial.hello:processResources UP-TO-DATE
:org.qi4j.tutorials:org.qi4j.tutorial.hello:classes
:org.qi4j.tutorials:org.qi4j.tutorial.hello:compileTestJava
:org.qi4j.tutorials:org.qi4j.tutorial.hello:processTestResources UP-TO-DATE
:org.qi4j.tutorials:org.qi4j.tutorial.hello:testClasses
:org.qi4j.tutorials:org.qi4j.tutorial.hello:test
:org.qi4j.tutorials:org.qi4j.tutorial.introduction:makeVersionClass
:org.qi4j.tutorials:org.qi4j.tutorial.introduction:compileVersionJava
:org.qi4j.tutorials:org.qi4j.tutorial.introduction:compileJava
:org.qi4j.tutorials:org.qi4j.tutorial.introduction:processResources UP-TO-DATE
:org.qi4j.tutorials:org.qi4j.tutorial.introduction:classes
:org.qi4j.tutorials:org.qi4j.tutorial.introduction:compileTestJava UP-TO-DATE
:org.qi4j.tutorials:org.qi4j.tutorial.introduction:processTestResources UP-TO-DATE
:org.qi4j.tutorials:org.qi4j.tutorial.introduction:testClasses UP-TO-DATE
:org.qi4j.tutorials:org.qi4j.tutorial.introduction:test UP-TO-DATE
:org.qi4j.tutorials:org.qi4j.tutorial.services:makeVersionClass
:org.qi4j.tutorials:org.qi4j.tutorial.services:compileVersionJava
:org.qi4j.tutorials:org.qi4j.tutorial.services:compileJava
:org.qi4j.tutorials:org.qi4j.tutorial.services:processResources
:org.qi4j.tutorials:org.qi4j.tutorial.services:classes
:org.qi4j.tutorials:org.qi4j.tutorial.services:compileTestJava
:org.qi4j.tutorials:org.qi4j.tutorial.services:processTestResources UP-TO-DATE
:org.qi4j.tutorials:org.qi4j.tutorial.services:testClasses
:org.qi4j.tutorials:org.qi4j.tutorial.services:test
:org.qi4j.tools:org.qi4j.tool.envisage:processVersionResources UP-TO-DATE
:org.qi4j.tools:org.qi4j.tool.envisage:versionClasses
:org.qi4j.tools:org.qi4j.tool.envisage:jar
:org.qi4j.samples:org.qi4j.sample.dci-cargo:org.qi4j.sample.dci-cargo.dcisample_a:makeVersionClass
:org.qi4j.samples:org.qi4j.sample.dci-cargo:org.qi4j.sample.dci-cargo.dcisample_a:compileVersionJava
:org.qi4j.samples:org.qi4j.sample.dci-cargo:org.qi4j.sample.dci-cargo.dcisample_a:compileJava<https://builds.apache.org/job/Zest-qi4j%20develop%20on%20Java7%20(Oracle%20JDK)/ws/samples/dci-cargo/dcisample_a/src/main/java/org/qi4j/sample/dcicargo/sample_a/context/shipping/booking/BookNewCargo.java>:22:
warning: [deprecation] DateMidnight in org.joda.time has been deprecated
import org.joda.time.DateMidnight;
                    ^
<https://builds.apache.org/job/Zest-qi4j%20develop%20on%20Java7%20(Oracle%20JDK)/ws/samples/dci-cargo/dcisample_a/src/main/java/org/qi4j/sample/dcicargo/sample_a/context/shipping/booking/BookNewCargo.java>:242:
warning: [deprecation] DateMidnight in org.joda.time has been deprecated
        Date endOfToday = new DateMidnight().plusDays( 1 ).toDate();
                              ^
2 warnings

:org.qi4j.samples:org.qi4j.sample.dci-cargo:org.qi4j.sample.dci-cargo.dcisample_a:processResources
:org.qi4j.samples:org.qi4j.sample.dci-cargo:org.qi4j.sample.dci-cargo.dcisample_a:classes
:org.qi4j.samples:org.qi4j.sample.dci-cargo:org.qi4j.sample.dci-cargo.dcisample_a:compileTestJava
:org.qi4j.samples:org.qi4j.sample.dci-cargo:org.qi4j.sample.dci-cargo.dcisample_a:processTestResources
UP-TO-DATE
:org.qi4j.samples:org.qi4j.sample.dci-cargo:org.qi4j.sample.dci-cargo.dcisample_a:testClasses
:org.qi4j.samples:org.qi4j.sample.dci-cargo:org.qi4j.sample.dci-cargo.dcisample_a:test
:org.qi4j.samples:org.qi4j.sample.dci-cargo:org.qi4j.sample.dci-cargo.dcisample_b:makeVersionClass
:org.qi4j.samples:org.qi4j.sample.dci-cargo:org.qi4j.sample.dci-cargo.dcisample_b:compileVersionJava
:org.qi4j.samples:org.qi4j.sample.dci-cargo:org.qi4j.sample.dci-cargo.dcisample_b:compileJava<https://builds.apache.org/job/Zest-qi4j%20develop%20on%20Java7%20(Oracle%20JDK)/ws/samples/dci-cargo/dcisample_b/src/main/java/org/qi4j/sample/dcicargo/sample_b/context/interaction/booking/BookNewCargo.java>:21:
warning: [deprecation] DateMidnight in org.joda.time has been deprecated
import org.qi4j.api.common.Optional;
     ^
<https://builds.apache.org/job/Zest-qi4j%20develop%20on%20Java7%20(Oracle%20JDK)/ws/samples/dci-cargo/dcisample_b/src/main/java/org/qi4j/sample/dcicargo/sample_b/data/factory/RouteSpecificationFactoryService.java>:62:
warning: [deprecation] DateMidnight in org.joda.time has been deprecated
            Date endOfToday = new DateMidnight().plusDays( 1 ).toDate();
                                  ^
2 warnings

:org.qi4j.samples:org.qi4j.sample.dci-cargo:org.qi4j.sample.dci-cargo.dcisample_b:processResources
:org.qi4j.samples:org.qi4j.sample.dci-cargo:org.qi4j.sample.dci-cargo.dcisample_b:classes
:org.qi4j.samples:org.qi4j.sample.dci-cargo:org.qi4j.sample.dci-cargo.dcisample_b:compileTestJava
:org.qi4j.samples:org.qi4j.sample.dci-cargo:org.qi4j.sample.dci-cargo.dcisample_b:processTestResources
UP-TO-DATE
:org.qi4j.samples:org.qi4j.sample.dci-cargo:org.qi4j.sample.dci-cargo.dcisample_b:testClasses
:org.qi4j.samples:org.qi4j.sample.dci-cargo:org.qi4j.sample.dci-cargo.dcisample_b:test
:org.qi4j.tutorials:org.qi4j.tutorial.introduction:org.qi4j.tutorial.introduction.tenminutes:makeVersionClass
:org.qi4j.tutorials:org.qi4j.tutorial.introduction:org.qi4j.tutorial.introduction.tenminutes:compileVersionJava
:org.qi4j.tutorials:org.qi4j.tutorial.introduction:org.qi4j.tutorial.introduction.tenminutes:compileJava
:org.qi4j.tutorials:org.qi4j.tutorial.introduction:org.qi4j.tutorial.introduction.tenminutes:processResources
UP-TO-DATE
:org.qi4j.tutorials:org.qi4j.tutorial.introduction:org.qi4j.tutorial.introduction.tenminutes:classes
:org.qi4j.tutorials:org.qi4j.tutorial.introduction:org.qi4j.tutorial.introduction.tenminutes:compileTestJava
UP-TO-DATE
:org.qi4j.tutorials:org.qi4j.tutorial.introduction:org.qi4j.tutorial.introduction.tenminutes:processTestResources
UP-TO-DATE
:org.qi4j.tutorials:org.qi4j.tutorial.introduction:org.qi4j.tutorial.introduction.tenminutes:testClasses
UP-TO-DATE
:org.qi4j.tutorials:org.qi4j.tutorial.introduction:org.qi4j.tutorial.introduction.tenminutes:test
UP-TO-DATE
:org.qi4j.tutorials:org.qi4j.tutorial.introduction:org.qi4j.tutorial.introduction.tenminutes:processVersionResources
UP-TO-DATE
:org.qi4j.tutorials:org.qi4j.tutorial.introduction:org.qi4j.tutorial.introduction.tenminutes:versionClasses
:org.qi4j.tutorials:org.qi4j.tutorial.introduction:org.qi4j.tutorial.introduction.tenminutes:jar
:org.qi4j.tutorials:org.qi4j.tutorial.introduction:org.qi4j.tutorial.introduction.thirtyminutes:makeVersionClass
:org.qi4j.tutorials:org.qi4j.tutorial.introduction:org.qi4j.tutorial.introduction.thirtyminutes:compileVersionJava
:org.qi4j.tutorials:org.qi4j.tutorial.introduction:org.qi4j.tutorial.introduction.thirtyminutes:compileJavaNote:
<https://builds.apache.org/job/Zest-qi4j%20develop%20on%20Java7%20(Oracle%20JDK)/ws/tutorials/introduction/thirtyminutes/src/main/java/org/qi4j/demo/thirtyminutes/ThirtyMinutesDocs.java>
uses unchecked or unsafe operations.
Note: Recompile with -Xlint:unchecked for details.

:org.qi4j.tutorials:org.qi4j.tutorial.introduction:org.qi4j.tutorial.introduction.thirtyminutes:processResources
UP-TO-DATE
:org.qi4j.tutorials:org.qi4j.tutorial.introduction:org.qi4j.tutorial.introduction.thirtyminutes:classes
:org.qi4j.tutorials:org.qi4j.tutorial.introduction:org.qi4j.tutorial.introduction.thirtyminutes:compileTestJava
UP-TO-DATE
:org.qi4j.tutorials:org.qi4j.tutorial.introduction:org.qi4j.tutorial.introduction.thirtyminutes:processTestResources
UP-TO-DATE
:org.qi4j.tutorials:org.qi4j.tutorial.introduction:org.qi4j.tutorial.introduction.thirtyminutes:testClasses
UP-TO-DATE
:org.qi4j.tutorials:org.qi4j.tutorial.introduction:org.qi4j.tutorial.introduction.thirtyminutes:test
UP-TO-DATE
:org.qi4j.tutorials:org.qi4j.tutorial.introduction:org.qi4j.tutorial.introduction.twominutes:makeVersionClass
:org.qi4j.tutorials:org.qi4j.tutorial.introduction:org.qi4j.tutorial.introduction.twominutes:compileVersionJava
:org.qi4j.tutorials:org.qi4j.tutorial.introduction:org.qi4j.tutorial.introduction.twominutes:compileJava
:org.qi4j.tutorials:org.qi4j.tutorial.introduction:org.qi4j.tutorial.introduction.twominutes:processResources
UP-TO-DATE
:org.qi4j.tutorials:org.qi4j.tutorial.introduction:org.qi4j.tutorial.introduction.twominutes:classes
:org.qi4j.tutorials:org.qi4j.tutorial.introduction:org.qi4j.tutorial.introduction.twominutes:compileTestJava
UP-TO-DATE
:org.qi4j.tutorials:org.qi4j.tutorial.introduction:org.qi4j.tutorial.introduction.twominutes:processTestResources
UP-TO-DATE
:org.qi4j.tutorials:org.qi4j.tutorial.introduction:org.qi4j.tutorial.introduction.twominutes:testClasses
UP-TO-DATE
:org.qi4j.tutorials:org.qi4j.tutorial.introduction:org.qi4j.tutorial.introduction.twominutes:test
UP-TO-DATE
:globalTestReport
:compileTestJava UP-TO-DATE
:processTestResources UP-TO-DATE
:testClasses UP-TO-DATE
:test UP-TO-DATE
:org.qi4j.core:jar
:org.qi4j.core:assemble
:org.qi4j.core:dependencyReport
:org.qi4j.extensions:jar
:org.qi4j.extensions:assemble
:org.qi4j.extensions:dependencyReport
:org.qi4j.libraries:jar
:org.qi4j.libraries:assemble
:org.qi4j.libraries:dependencyReport
:org.qi4j.manual:processVersionResources UP-TO-DATE
:org.qi4j.manual:versionClasses
:org.qi4j.manual:jar
:org.qi4j.core:org.qi4j.core.functional:javadoc
:org.qi4j.core:org.qi4j.core.io:javadoc
:org.qi4j.core:org.qi4j.core.api:javadoc
:org.qi4j.core:org.qi4j.core.spi:javadoc<https://builds.apache.org/job/Zest-qi4j%20develop%20on%20Java7%20(Oracle%20JDK)/ws/core/spi/src/main/java/org/qi4j/spi/value/ValueSerializerAdapter.java>:86:
warning - Tag @link: reference not found: Options

1 warning
:org.qi4j.core:org.qi4j.core.bootstrap:javadoc
:org.qi4j.libraries:org.qi4j.library.constraints:javadoc
:org.qi4j.libraries:org.qi4j.library.logging:javadoc
:org.qi4j.manual:javadoc
:org.qi4j.manual:javadocJar
:org.qi4j.manual:sourceJar
:org.qi4j.manual:testSourceJar
:org.qi4j.manual:signArchives FAILED

FAILURE: Build failed with an exception.

* What went wrong:
Execution failed for task ':org.qi4j.manual:signArchives'.
> Cannot perform signing task ':org.qi4j.manual:signArchives' because it has no configured
signatory

* Try:
Run with --stacktrace option to get the stack trace. Run with --info or --debug option to
get more log output.

BUILD FAILED

Total time: 12 mins 50.11 secs
Build step 'Invoke Gradle script' changed build result to FAILURE
Build step 'Invoke Gradle script' marked build as failure

Mime
View raw message