poi-dev mailing list archives

Site index · List index
Message view « Date » · « Thread »
Top « Date » · « Thread »
From Apache Jenkins Server <jenk...@builds.apache.org>
Subject Build failed in Jenkins: POI-DSL-1.10 #5
Date Sun, 08 Apr 2018 06:16:38 GMT
See <https://builds.apache.org/job/POI-DSL-1.10/5/display/redirect?page=changes>

Changes:

[centic] Bug 61898: Adjust quick-guide some more

[centic] Close resources correctly when opening encrypted documents in the TextExtractor

[centic] Bug 62165: Do not close stream when opening succeeds

[centic] Create some directories if not existing in testcoveragereport

[centic] Try to avoid one NPE that popped up in commoncrawl-corpus tests

[fanningpj] fix error message

[fanningpj] [bug-62254] update offset function to support optional offset values

[centic] Add unit tests to include more required classes in poi-ooxml-schemas, add test for
bug 62174 so additional schema-classes are included

[centic] OOXMLLite: IDE warnings and add an additional listener to print out progress during
running tests

[centic] Close resources in tests and in case of Exceptions and use try-with-resources. Close
the socket-connection during encrpyting/decrypting as soon as it is not needed any more.

[centic] Update excludes in OOXMLLite

[centic] Bug 61267: detect Word v2 files and report that they are not supported in Apache
POI

[fanningpj] [bug-62216] add test case

[fanningpj] [bug-62216] Fix issue with SXSSF error cells

[fanningpj] [bug-62121] Fixed Power function of negative numbers. Thanks to Bob van den Berge.
This closes #104

[fanningpj] [github-103] take latest changes

------------------------------------------
[...truncated 703.78 KB...]
     [java] 	at org.junit.runners.ParentRunner$3.run(ParentRunner.java:290)
     [java] 	at org.junit.runners.ParentRunner$1.schedule(ParentRunner.java:71)
     [java] 	at org.junit.runners.ParentRunner.runChildren(ParentRunner.java:288)
     [java] 	at org.junit.runners.ParentRunner.access$000(ParentRunner.java:58)
     [java] 	at org.junit.runners.ParentRunner$2.evaluate(ParentRunner.java:268)
     [java] 	at org.junit.runners.ParentRunner.run(ParentRunner.java:363)
     [java] 	at org.junit.runners.Suite.runChild(Suite.java:128)
     [java] 	at org.junit.runners.Suite.runChild(Suite.java:27)
     [java] 	at org.junit.runners.ParentRunner$3.run(ParentRunner.java:290)
     [java] 	at org.junit.runners.ParentRunner$1.schedule(ParentRunner.java:71)
     [java] 	at org.junit.runners.ParentRunner.runChildren(ParentRunner.java:288)
     [java] 	at org.junit.runners.ParentRunner.access$000(ParentRunner.java:58)
     [java] 	at org.junit.runners.ParentRunner$2.evaluate(ParentRunner.java:268)
     [java] 	at org.junit.runners.ParentRunner.run(ParentRunner.java:363)
     [java] 	at org.junit.runner.JUnitCore.run(JUnitCore.java:137)
     [java] 	at org.junit.runner.JUnitCore.run(JUnitCore.java:115)
     [java] 	at org.junit.runner.JUnitCore.run(JUnitCore.java:105)
     [java] 	at org.junit.runner.JUnitCore.run(JUnitCore.java:94)
     [java] 	at org.apache.poi.util.OOXMLLite.build(OOXMLLite.java:179)
     [java] 	at org.apache.poi.util.OOXMLLite.main(OOXMLLite.java:102)
     [java] Caused by: java.lang.ClassCastException: org.apache.poi.openxml4j.util.ZipSecureFile$ThresholdInputStream
cannot be cast to java.base/java.util.zip.ZipFile$ZipFileInputStream
     [java] 	at java.base/java.util.zip.ZipFile$ZipFileInflaterInputStream.available(ZipFile.java:478)
     [java] 	at org.apache.poi.openxml4j.util.ZipSecureFile$ThresholdInputStream.available(ZipSecureFile.java:317)
     [java] 	at org.apache.poi.openxml4j.opc.internal.marshallers.ZipPartMarshaller.marshall(ZipPartMarshaller.java:85)
     [java] 	at org.apache.poi.openxml4j.opc.ZipPackagePart.save(ZipPackagePart.java:124)
     [java] 	at org.apache.poi.openxml4j.opc.internal.marshallers.DefaultMarshaller.marshall(DefaultMarshaller.java:43)
     [java] 	at org.apache.poi.openxml4j.opc.ZipPackage.saveImpl(ZipPackage.java:585)
     [java] 	... 41 more
     [java] 
     [java] 	at org.hamcrest.MatcherAssert.assertThat(MatcherAssert.java:20)
     [java] 	at org.junit.Assert.assertThat(Assert.java:956)
     [java] 	at org.junit.Assert.assertThat(Assert.java:923)
     [java] 	at org.junit.rules.ExpectedException.handleException(ExpectedException.java:252)
     [java] 	at org.junit.rules.ExpectedException.access$000(ExpectedException.java:106)
     [java] 	at org.junit.rules.ExpectedException$ExpectedExceptionStatement.evaluate(ExpectedException.java:241)
     [java] 	at org.junit.rules.RunRules.evaluate(RunRules.java:20)
     [java] 	at org.junit.runners.ParentRunner.runLeaf(ParentRunner.java:325)
     [java] 	at org.junit.runners.BlockJUnit4ClassRunner.runChild(BlockJUnit4ClassRunner.java:78)
     [java] 	at org.junit.runners.BlockJUnit4ClassRunner.runChild(BlockJUnit4ClassRunner.java:57)
     [java] 	at org.junit.runners.ParentRunner$3.run(ParentRunner.java:290)
     [java] 	at org.junit.runners.ParentRunner$1.schedule(ParentRunner.java:71)
     [java] 	at org.junit.runners.ParentRunner.runChildren(ParentRunner.java:288)
     [java] 	at org.junit.runners.ParentRunner.access$000(ParentRunner.java:58)
     [java] 	at org.junit.runners.ParentRunner$2.evaluate(ParentRunner.java:268)
     [java] 	at org.junit.runners.ParentRunner.run(ParentRunner.java:363)
     [java] 	at org.junit.runners.Suite.runChild(Suite.java:128)
     [java] 	at org.junit.runners.Suite.runChild(Suite.java:27)
     [java] 	at org.junit.runners.ParentRunner$3.run(ParentRunner.java:290)
     [java] 	at org.junit.runners.ParentRunner$1.schedule(ParentRunner.java:71)
     [java] 	at org.junit.runners.ParentRunner.runChildren(ParentRunner.java:288)
     [java] 	at org.junit.runners.ParentRunner.access$000(ParentRunner.java:58)
     [java] 	at org.junit.runners.ParentRunner$2.evaluate(ParentRunner.java:268)
     [java] 	at org.junit.runners.ParentRunner.run(ParentRunner.java:363)
     [java] 	at org.junit.runner.JUnitCore.run(JUnitCore.java:137)
     [java] 	at org.junit.runner.JUnitCore.run(JUnitCore.java:115)
     [java] 	at org.junit.runner.JUnitCore.run(JUnitCore.java:105)
     [java] 	at org.junit.runner.JUnitCore.run(JUnitCore.java:94)
     [java] 	at org.apache.poi.util.OOXMLLite.build(OOXMLLite.java:179)
     [java] 	at org.apache.poi.util.OOXMLLite.main(OOXMLLite.java:102)
     [java] 32) testFactoryFromProtectedFile(org.apache.poi.xslf.usermodel.TestXSLFSlideShowFactory)
     [java] java.io.IOException: java.lang.IllegalArgumentException: malformed input off :
12, length : 3
     [java] 	at org.apache.poi.sl.usermodel.SlideShowFactory.createSlideShow(SlideShowFactory.java:255)
     [java] 	at org.apache.poi.sl.usermodel.SlideShowFactory.createXSLFSlideShow(SlideShowFactory.java:227)
     [java] 	at org.apache.poi.sl.usermodel.SlideShowFactory.create(SlideShowFactory.java:71)
     [java] 	at org.apache.poi.sl.usermodel.SlideShowFactory.create(SlideShowFactory.java:212)
     [java] 	at org.apache.poi.sl.usermodel.SlideShowFactory.create(SlideShowFactory.java:184)
     [java] 	at org.apache.poi.sl.usermodel.BaseTestSlideShowFactory.testFactoryFromProtectedFile(BaseTestSlideShowFactory.java:80)
     [java] 	at org.apache.poi.xslf.usermodel.TestXSLFSlideShowFactory.testFactoryFromProtectedFile(TestXSLFSlideShowFactory.java:80)
     [java] 	at java.base/jdk.internal.reflect.NativeMethodAccessorImpl.invoke0(Native Method)
     [java] 	at java.base/jdk.internal.reflect.NativeMethodAccessorImpl.invoke(NativeMethodAccessorImpl.java:62)
     [java] 	at java.base/jdk.internal.reflect.DelegatingMethodAccessorImpl.invoke(DelegatingMethodAccessorImpl.java:43)
     [java] 	at java.base/java.lang.reflect.Method.invoke(Method.java:564)
     [java] 	at org.junit.runners.model.FrameworkMethod$1.runReflectiveCall(FrameworkMethod.java:50)
     [java] 	at org.junit.internal.runners.model.ReflectiveCallable.run(ReflectiveCallable.java:12)
     [java] 	at org.junit.runners.model.FrameworkMethod.invokeExplosively(FrameworkMethod.java:47)
     [java] 	at org.junit.internal.runners.statements.InvokeMethod.evaluate(InvokeMethod.java:17)
     [java] 	at org.junit.rules.ExpectedException$ExpectedExceptionStatement.evaluate(ExpectedException.java:239)
     [java] 	at org.junit.rules.RunRules.evaluate(RunRules.java:20)
     [java] 	at org.junit.runners.ParentRunner.runLeaf(ParentRunner.java:325)
     [java] 	at org.junit.runners.BlockJUnit4ClassRunner.runChild(BlockJUnit4ClassRunner.java:78)
     [java] 	at org.junit.runners.BlockJUnit4ClassRunner.runChild(BlockJUnit4ClassRunner.java:57)
     [java] 	at org.junit.runners.ParentRunner$3.run(ParentRunner.java:290)
     [java] 	at org.junit.runners.ParentRunner$1.schedule(ParentRunner.java:71)
     [java] 	at org.junit.runners.ParentRunner.runChildren(ParentRunner.java:288)
     [java] 	at org.junit.runners.ParentRunner.access$000(ParentRunner.java:58)
     [java] 	at org.junit.runners.ParentRunner$2.evaluate(ParentRunner.java:268)
     [java] 	at org.junit.runners.ParentRunner.run(ParentRunner.java:363)
     [java] 	at org.junit.runners.Suite.runChild(Suite.java:128)
     [java] 	at org.junit.runners.Suite.runChild(Suite.java:27)
     [java] 	at org.junit.runners.ParentRunner$3.run(ParentRunner.java:290)
     [java] 	at org.junit.runners.ParentRunner$1.schedule(ParentRunner.java:71)
     [java] 	at org.junit.runners.ParentRunner.runChildren(ParentRunner.java:288)
     [java] 	at org.junit.runners.ParentRunner.access$000(ParentRunner.java:58)
     [java] 	at org.junit.runners.ParentRunner$2.evaluate(ParentRunner.java:268)
     [java] 	at org.junit.runners.ParentRunner.run(ParentRunner.java:363)
     [java] 	at org.junit.runner.JUnitCore.run(JUnitCore.java:137)
     [java] 	at org.junit.runner.JUnitCore.run(JUnitCore.java:115)
     [java] 	at org.junit.runner.JUnitCore.run(JUnitCore.java:105)
     [java] 	at org.junit.runner.JUnitCore.run(JUnitCore.java:94)
     [java] 	at org.apache.poi.util.OOXMLLite.build(OOXMLLite.java:179)
     [java] 	at org.apache.poi.util.OOXMLLite.main(OOXMLLite.java:102)
     [java] Caused by: java.lang.IllegalArgumentException: malformed input off : 12, length
: 3
     [java] 	at java.base/java.lang.StringCoding.throwMalformed(StringCoding.java:676)
     [java] 	at java.base/java.lang.StringCoding.decodeUTF8_0(StringCoding.java:765)
     [java] 	at java.base/java.lang.StringCoding.newStringUTF8NoRepl(StringCoding.java:940)
     [java] 	at java.base/java.lang.System$2.newStringUTF8NoRepl(System.java:2197)
     [java] 	at java.base/java.util.zip.ZipCoder$UTF8.toString(ZipCoder.java:60)
     [java] 	at java.base/java.util.zip.ZipCoder.toStringUTF8(ZipCoder.java:117)
     [java] 	at java.base/java.util.zip.ZipInputStream.readLOC(ZipInputStream.java:300)
     [java] 	at java.base/java.util.zip.ZipInputStream.getNextEntry(ZipInputStream.java:123)
     [java] 	at org.apache.poi.openxml4j.util.ZipSecureFile$ThresholdInputStream.getNextEntry(ZipSecureFile.java:280)
     [java] 	at org.apache.poi.openxml4j.util.ZipInputStreamZipEntrySource.<init>(ZipInputStreamZipEntrySource.java:52)
     [java] 	at org.apache.poi.openxml4j.opc.ZipPackage.<init>(ZipPackage.java:100)
     [java] 	at org.apache.poi.openxml4j.opc.OPCPackage.open(OPCPackage.java:318)
     [java] 	at org.apache.poi.xslf.usermodel.XSLFSlideShowFactory.createSlideShow(XSLFSlideShowFactory.java:96)
     [java] 	at java.base/jdk.internal.reflect.NativeMethodAccessorImpl.invoke0(Native Method)
     [java] 	at java.base/jdk.internal.reflect.NativeMethodAccessorImpl.invoke(NativeMethodAccessorImpl.java:62)
     [java] 	at java.base/jdk.internal.reflect.DelegatingMethodAccessorImpl.invoke(DelegatingMethodAccessorImpl.java:43)
     [java] 	at java.base/java.lang.reflect.Method.invoke(Method.java:564)
     [java] 	at org.apache.poi.sl.usermodel.SlideShowFactory.createSlideShow(SlideShowFactory.java:245)
     [java] 	... 39 more
     [java] 33) testFactoryFromStream(org.apache.poi.xslf.usermodel.TestXSLFSlideShowFactory)
     [java] java.io.IOException: Failed to read zip entry source
     [java] 	at org.apache.poi.openxml4j.opc.ZipPackage.<init>(ZipPackage.java:103)
     [java] 	at org.apache.poi.openxml4j.opc.OPCPackage.open(OPCPackage.java:318)
     [java] 	at org.apache.poi.xslf.usermodel.XSLFSlideShowFactory.createSlideShow(XSLFSlideShowFactory.java:96)
     [java] 	at java.base/jdk.internal.reflect.NativeMethodAccessorImpl.invoke0(Native Method)
     [java] 	at java.base/jdk.internal.reflect.NativeMethodAccessorImpl.invoke(NativeMethodAccessorImpl.java:62)
     [java] 	at java.base/jdk.internal.reflect.DelegatingMethodAccessorImpl.invoke(DelegatingMethodAccessorImpl.java:43)
     [java] 	at java.base/java.lang.reflect.Method.invoke(Method.java:564)
     [java] 	at org.apache.poi.sl.usermodel.SlideShowFactory.createSlideShow(SlideShowFactory.java:245)
     [java] 	at org.apache.poi.sl.usermodel.SlideShowFactory.createXSLFSlideShow(SlideShowFactory.java:227)
     [java] 	at org.apache.poi.sl.usermodel.SlideShowFactory.create(SlideShowFactory.java:145)
     [java] 	at org.apache.poi.sl.usermodel.SlideShowFactory.create(SlideShowFactory.java:113)
     [java] 	at org.apache.poi.sl.usermodel.BaseTestSlideShowFactory.testFactoryFromStream(BaseTestSlideShowFactory.java:50)
     [java] 	at org.apache.poi.xslf.usermodel.TestXSLFSlideShowFactory.testFactoryFromStream(TestXSLFSlideShowFactory.java:64)
     [java] 	at java.base/jdk.internal.reflect.NativeMethodAccessorImpl.invoke0(Native Method)
     [java] 	at java.base/jdk.internal.reflect.NativeMethodAccessorImpl.invoke(NativeMethodAccessorImpl.java:62)
     [java] 	at java.base/jdk.internal.reflect.DelegatingMethodAccessorImpl.invoke(DelegatingMethodAccessorImpl.java:43)
     [java] 	at java.base/java.lang.reflect.Method.invoke(Method.java:564)
     [java] 	at org.junit.runners.model.FrameworkMethod$1.runReflectiveCall(FrameworkMethod.java:50)
     [java] 	at org.junit.internal.runners.model.ReflectiveCallable.run(ReflectiveCallable.java:12)
     [java] 	at org.junit.runners.model.FrameworkMethod.invokeExplosively(FrameworkMethod.java:47)
     [java] 	at org.junit.internal.runners.statements.InvokeMethod.evaluate(InvokeMethod.java:17)
     [java] 	at org.junit.rules.ExpectedException$ExpectedExceptionStatement.evaluate(ExpectedException.java:239)
     [java] 	at org.junit.rules.RunRules.evaluate(RunRules.java:20)
     [java] 	at org.junit.runners.ParentRunner.runLeaf(ParentRunner.java:325)
     [java] 	at org.junit.runners.BlockJUnit4ClassRunner.runChild(BlockJUnit4ClassRunner.java:78)
     [java] 	at org.junit.runners.BlockJUnit4ClassRunner.runChild(BlockJUnit4ClassRunner.java:57)
     [java] 	at org.junit.runners.ParentRunner$3.run(ParentRunner.java:290)
     [java] 	at org.junit.runners.ParentRunner$1.schedule(ParentRunner.java:71)
     [java] 	at org.junit.runners.ParentRunner.runChildren(ParentRunner.java:288)
     [java] 	at org.junit.runners.ParentRunner.access$000(ParentRunner.java:58)
     [java] 	at org.junit.runners.ParentRunner$2.evaluate(ParentRunner.java:268)
     [java] 	at org.junit.runners.ParentRunner.run(ParentRunner.java:363)
     [java] 	at org.junit.runners.Suite.runChild(Suite.java:128)
     [java] 	at org.junit.runners.Suite.runChild(Suite.java:27)
     [java] 	at org.junit.runners.ParentRunner$3.run(ParentRunner.java:290)
     [java] 	at org.junit.runners.ParentRunner$1.schedule(ParentRunner.java:71)
     [java] 	at org.junit.runners.ParentRunner.runChildren(ParentRunner.java:288)
     [java] 	at org.junit.runners.ParentRunner.access$000(ParentRunner.java:58)
     [java] 	at org.junit.runners.ParentRunner$2.evaluate(ParentRunner.java:268)
     [java] 	at org.junit.runners.ParentRunner.run(ParentRunner.java:363)
     [java] 	at org.junit.runner.JUnitCore.run(JUnitCore.java:137)
     [java] 	at org.junit.runner.JUnitCore.run(JUnitCore.java:115)
     [java] 	at org.junit.runner.JUnitCore.run(JUnitCore.java:105)
     [java] 	at org.junit.runner.JUnitCore.run(JUnitCore.java:94)
     [java] 	at org.apache.poi.util.OOXMLLite.build(OOXMLLite.java:179)
     [java] 	at org.apache.poi.util.OOXMLLite.main(OOXMLLite.java:102)
     [java] Caused by: java.io.EOFException: Unexpected end of ZLIB input stream
     [java] 	at java.base/java.util.zip.InflaterInputStream.fill(InflaterInputStream.java:245)
     [java] 	at java.base/java.util.zip.InflaterInputStream.read(InflaterInputStream.java:159)
     [java] 	at java.base/java.util.zip.ZipInputStream.read(ZipInputStream.java:195)
     [java] 	at org.apache.poi.openxml4j.util.ZipSecureFile$ThresholdInputStream.read(ZipSecureFile.java:220)
     [java] 	at java.base/java.io.FilterInputStream.read(FilterInputStream.java:107)
     [java] 	at org.apache.poi.openxml4j.util.ZipInputStreamZipEntrySource$FakeZipEntry.<init>(ZipInputStreamZipEntrySource.java:132)
     [java] 	at org.apache.poi.openxml4j.util.ZipInputStreamZipEntrySource.<init>(ZipInputStreamZipEntrySource.java:56)
     [java] 	at org.apache.poi.openxml4j.opc.ZipPackage.<init>(ZipPackage.java:100)
     [java] 	... 45 more
     [java] 34) bug55791b(org.apache.poi.xslf.TestXSLFBugs)
     [java] java.lang.RuntimeException: java.io.IOException: Failed to read zip entry source
     [java] 	at org.apache.poi.xslf.XSLFTestDataSamples.openSampleDocument(XSLFTestDataSamples.java:38)
     [java] 	at org.apache.poi.xslf.TestXSLFBugs.bug55791b(TestXSLFBugs.java:491)
     [java] 	at java.base/jdk.internal.reflect.NativeMethodAccessorImpl.invoke0(Native Method)
     [java] 	at java.base/jdk.internal.reflect.NativeMethodAccessorImpl.invoke(NativeMethodAccessorImpl.java:62)
     [java] 	at java.base/jdk.internal.reflect.DelegatingMethodAccessorImpl.invoke(DelegatingMethodAccessorImpl.java:43)
     [java] 	at java.base/java.lang.reflect.Method.invoke(Method.java:564)
     [java] 	at org.junit.runners.model.FrameworkMethod$1.runReflectiveCall(FrameworkMethod.java:50)
     [java] 	at org.junit.internal.runners.model.ReflectiveCallable.run(ReflectiveCallable.java:12)
     [java] 	at org.junit.runners.model.FrameworkMethod.invokeExplosively(FrameworkMethod.java:47)
     [java] 	at org.junit.internal.runners.statements.InvokeMethod.evaluate(InvokeMethod.java:17)
     [java] 	at org.junit.runners.ParentRunner.runLeaf(ParentRunner.java:325)
     [java] 	at org.junit.runners.BlockJUnit4ClassRunner.runChild(BlockJUnit4ClassRunner.java:78)
     [java] 	at org.junit.runners.BlockJUnit4ClassRunner.runChild(BlockJUnit4ClassRunner.java:57)
     [java] 	at org.junit.runners.ParentRunner$3.run(ParentRunner.java:290)
     [java] 	at org.junit.runners.ParentRunner$1.schedule(ParentRunner.java:71)
     [java] 	at org.junit.runners.ParentRunner.runChildren(ParentRunner.java:288)
     [java] 	at org.junit.runners.ParentRunner.access$000(ParentRunner.java:58)
     [java] 	at org.junit.runners.ParentRunner$2.evaluate(ParentRunner.java:268)
     [java] 	at org.junit.runners.ParentRunner.run(ParentRunner.java:363)
     [java] 	at org.junit.runners.Suite.runChild(Suite.java:128)
     [java] 	at org.junit.runners.Suite.runChild(Suite.java:27)
     [java] 	at org.junit.runners.ParentRunner$3.run(ParentRunner.java:290)
     [java] 	at org.junit.runners.ParentRunner$1.schedule(ParentRunner.java:71)
     [java] 	at org.junit.runners.ParentRunner.runChildren(ParentRunner.java:288)
     [java] 	at org.junit.runners.ParentRunner.access$000(ParentRunner.java:58)
     [java] 	at org.junit.runners.ParentRunner$2.evaluate(ParentRunner.java:268)
     [java] 	at org.junit.runners.ParentRunner.run(ParentRunner.java:363)
     [java] 	at org.junit.runner.JUnitCore.run(JUnitCore.java:137)
     [java] 	at org.junit.runner.JUnitCore.run(JUnitCore.java:115)
     [java] 	at org.junit.runner.JUnitCore.run(JUnitCore.java:105)
     [java] 	at org.junit.runner.JUnitCore.run(JUnitCore.java:94)
     [java] 	at org.apache.poi.util.OOXMLLite.build(OOXMLLite.java:179)
     [java] 	at org.apache.poi.util.OOXMLLite.main(OOXMLLite.java:102)
     [java] Caused by: java.io.IOException: Failed to read zip entry source
     [java] 	at org.apache.poi.openxml4j.opc.ZipPackage.<init>(ZipPackage.java:103)
     [java] 	at org.apache.poi.openxml4j.opc.OPCPackage.open(OPCPackage.java:318)
     [java] 	at org.apache.poi.xslf.XSLFTestDataSamples.openSampleDocument(XSLFTestDataSamples.java:36)
     [java] 	... 32 more
     [java] Caused by: java.io.EOFException: Unexpected end of ZLIB input stream
     [java] 	at java.base/java.util.zip.InflaterInputStream.fill(InflaterInputStream.java:245)
     [java] 	at java.base/java.util.zip.InflaterInputStream.read(InflaterInputStream.java:159)
     [java] 	at java.base/java.util.zip.ZipInputStream.read(ZipInputStream.java:195)
     [java] 	at org.apache.poi.openxml4j.util.ZipSecureFile$ThresholdInputStream.read(ZipSecureFile.java:220)
     [java] 	at java.base/java.io.FilterInputStream.read(FilterInputStream.java:107)
     [java] 	at org.apache.poi.openxml4j.util.ZipInputStreamZipEntrySource$FakeZipEntry.<init>(ZipInputStreamZipEntrySource.java:132)
     [java] 	at org.apache.poi.openxml4j.util.ZipInputStreamZipEntrySource.<init>(ZipInputStreamZipEntrySource.java:56)
     [java] 	at org.apache.poi.openxml4j.opc.ZipPackage.<init>(ZipPackage.java:100)
     [java] 	... 34 more
     [java] 
     [java] FAILURES!!!
     [java] Tests run: 2403,  Failures: 34
     [java] 
     [java] Exception in thread "main" java.lang.RuntimeException: Tests did not succeed,
cannot build ooxml-lite jar
     [java] 	at org.apache.poi.util.OOXMLLite.build(OOXMLLite.java:181)
     [java] 	at org.apache.poi.util.OOXMLLite.main(OOXMLLite.java:102)

BUILD FAILED
<https://builds.apache.org/job/POI-DSL-1.10/ws/build.xml>:1548: Java returned: 1

Total time: 6 minutes 21 seconds
Build step 'Invoke Ant' marked build as failure
Skipping publisher since build result is FAILURE
Archiving artifacts
[Fast Archiver] No prior successful build to compare, so performing full copy of artifacts
Skipping publisher since build result is FAILURE
Recording test results
ERROR: Step ?Publish JUnit test result report? failed: No test report files were found. Configuration
error?


---------------------------------------------------------------------
To unsubscribe, e-mail: dev-unsubscribe@poi.apache.org
For additional commands, e-mail: dev-help@poi.apache.org


Mime
View raw message