poi-dev mailing list archives

Site index · List index
Message view « Date » · « Thread »
Top « Date » · « Thread »
From bugzi...@apache.org
Subject [Bug 62042] New: gradle build fails
Date Wed, 24 Jan 2018 09:47:43 GMT
https://bz.apache.org/bugzilla/show_bug.cgi?id=62042

            Bug ID: 62042
           Summary: gradle build fails
           Product: POI
           Version: 4.0-dev
          Hardware: PC
                OS: Mac OS X 10.1
            Status: NEW
          Severity: normal
          Priority: P2
         Component: POI Overall
          Assignee: dev@poi.apache.org
          Reporter: wf@bitplan.com
  Target Milestone: ---

org.apache.poi.hssf.usermodel.AllUserModelTests >
org.apache.poi.hssf.usermodel.TestHSSFDataFormat.test58532 FAILED
    org.junit.ComparisonFailure at TestHSSFDataFormat.java:76

org.apache.poi.hssf.usermodel.AllUserModelTests >
org.apache.poi.hssf.usermodel.TestHSSFDataFormat.test58536 FAILED
    org.junit.ComparisonFailure

16502 tests completed, 2 failed, 839 skipped
:main:test FAILED

-- 
You are receiving this mail because:
You are the assignee for the bug.
---------------------------------------------------------------------
To unsubscribe, e-mail: dev-unsubscribe@poi.apache.org
For additional commands, e-mail: dev-help@poi.apache.org


Mime
View raw message