poi-dev mailing list archives

Site index · List index
Message view « Date » · « Thread »
Top « Date » · « Thread »
From Apache Jenkins Server <jenk...@builds.apache.org>
Subject Build failed in Jenkins: POI-DSL-API-Check #267
Date Tue, 30 Jan 2018 03:39:55 GMT
See <https://builds.apache.org/job/POI-DSL-API-Check/267/display/redirect>

------------------------------------------
[...truncated 19.91 KB...]
org.tmatesoft.svn.core.SVNException: svn: E200030: FULL
	at org.tmatesoft.svn.core.internal.wc.SVNErrorManager.error(SVNErrorManager.java:70)
	at org.tmatesoft.svn.core.internal.wc.SVNErrorManager.error(SVNErrorManager.java:57)
	at org.tmatesoft.svn.core.internal.db.SVNSqlJetDb.createSqlJetError(SVNSqlJetDb.java:195)
	at org.tmatesoft.svn.core.internal.db.SVNSqlJetDb.beginTransaction(SVNSqlJetDb.java:211)
	at org.tmatesoft.svn.core.internal.db.SVNSqlJetDb.runTransaction(SVNSqlJetDb.java:257)
	at org.tmatesoft.svn.core.internal.db.SVNSqlJetDb.runTransaction(SVNSqlJetDb.java:252)
	at org.tmatesoft.svn.core.internal.wc17.db.SVNWCDb.obtainWCLock(SVNWCDb.java:5867)
	at org.tmatesoft.svn.core.internal.wc17.SVNWCContext.acquireWriteLock(SVNWCContext.java:1646)
	at org.tmatesoft.svn.core.internal.wc2.ng.SvnNgAbstractUpdate.update(SvnNgAbstractUpdate.java:106)
	at org.tmatesoft.svn.core.internal.wc2.ng.SvnNgUpdate.run(SvnNgUpdate.java:40)
	at org.tmatesoft.svn.core.internal.wc2.ng.SvnNgUpdate.run(SvnNgUpdate.java:18)
	at org.tmatesoft.svn.core.internal.wc2.ng.SvnNgOperationRunner.run(SvnNgOperationRunner.java:20)
	at org.tmatesoft.svn.core.internal.wc2.SvnOperationRunner.run(SvnOperationRunner.java:21)
	at org.tmatesoft.svn.core.wc2.SvnOperationFactory.run(SvnOperationFactory.java:1235)
	at org.tmatesoft.svn.core.wc2.SvnOperation.run(SvnOperation.java:294)
	at org.tmatesoft.svn.core.wc.SVNUpdateClient.doUpdate(SVNUpdateClient.java:311)
	at org.tmatesoft.svn.core.wc.SVNUpdateClient.doUpdate(SVNUpdateClient.java:291)
	at org.tmatesoft.svn.core.wc.SVNUpdateClient.doUpdate(SVNUpdateClient.java:387)
	at hudson.scm.subversion.UpdateUpdater$TaskImpl.perform(UpdateUpdater.java:160)
	at hudson.scm.subversion.WorkspaceUpdater$UpdateTask.delegateTo(WorkspaceUpdater.java:168)
	at hudson.scm.SubversionSCM$CheckOutTask.perform(SubversionSCM.java:1030)
	at hudson.scm.SubversionSCM$CheckOutTask.invoke(SubversionSCM.java:1006)
	at hudson.scm.SubversionSCM$CheckOutTask.invoke(SubversionSCM.java:979)
	at hudson.FilePath$FileCallableWrapper.call(FilePath.java:2760)
	at hudson.remoting.UserRequest.perform(UserRequest.java:207)
	at hudson.remoting.UserRequest.perform(UserRequest.java:53)
	at hudson.remoting.Request$2.run(Request.java:358)
	at hudson.remoting.InterceptingExecutorService$1.call(InterceptingExecutorService.java:72)
	at java.util.concurrent.FutureTask.run(FutureTask.java:266)
	at java.util.concurrent.ThreadPoolExecutor.runWorker(ThreadPoolExecutor.java:1142)
	at java.util.concurrent.ThreadPoolExecutor$Worker.run(ThreadPoolExecutor.java:617)
	at java.lang.Thread.run(Thread.java:748)
Caused by: org.tmatesoft.sqljet.core.SqlJetException: FULL: error code is FULL
	at org.tmatesoft.sqljet.core.internal.pager.SqlJetPager.openJournal(SqlJetPager.java:3051)
	at org.tmatesoft.sqljet.core.internal.pager.SqlJetPager.begin(SqlJetPager.java:2782)
	at org.tmatesoft.sqljet.core.internal.btree.SqlJetBtree.beginTrans(SqlJetBtree.java:931)
	at org.tmatesoft.sqljet.core.table.engine.SqlJetEngine.doBeginTransaction(SqlJetEngine.java:561)
	at org.tmatesoft.sqljet.core.table.engine.SqlJetEngine.access$100(SqlJetEngine.java:55)
	at org.tmatesoft.sqljet.core.table.engine.SqlJetEngine$9.runSynchronized(SqlJetEngine.java:475)
	at org.tmatesoft.sqljet.core.table.engine.SqlJetEngine.runSynchronized(SqlJetEngine.java:217)
	at org.tmatesoft.sqljet.core.table.engine.SqlJetEngine.beginTransaction(SqlJetEngine.java:471)
	at org.tmatesoft.svn.core.internal.db.SVNSqlJetDb.beginTransaction(SVNSqlJetDb.java:206)
	... 28 more
ERROR: Subversion update failed
org.tmatesoft.sqljet.core.SqlJetException: FULL: error code is FULL
	at org.tmatesoft.sqljet.core.internal.pager.SqlJetPager.openJournal(SqlJetPager.java:3051)
	at org.tmatesoft.sqljet.core.internal.pager.SqlJetPager.begin(SqlJetPager.java:2782)
	at org.tmatesoft.sqljet.core.internal.btree.SqlJetBtree.beginTrans(SqlJetBtree.java:931)
	at org.tmatesoft.sqljet.core.table.engine.SqlJetEngine.doBeginTransaction(SqlJetEngine.java:561)
	at org.tmatesoft.sqljet.core.table.engine.SqlJetEngine.access$100(SqlJetEngine.java:55)
	at org.tmatesoft.sqljet.core.table.engine.SqlJetEngine$9.runSynchronized(SqlJetEngine.java:475)
	at org.tmatesoft.sqljet.core.table.engine.SqlJetEngine.runSynchronized(SqlJetEngine.java:217)
	at org.tmatesoft.sqljet.core.table.engine.SqlJetEngine.beginTransaction(SqlJetEngine.java:471)
	at org.tmatesoft.svn.core.internal.db.SVNSqlJetDb.beginTransaction(SVNSqlJetDb.java:206)
Caused: org.tmatesoft.svn.core.SVNException: svn: E200030: FULL
	at org.tmatesoft.svn.core.internal.wc.SVNErrorManager.error(SVNErrorManager.java:70)
	at org.tmatesoft.svn.core.internal.wc.SVNErrorManager.error(SVNErrorManager.java:57)
	at org.tmatesoft.svn.core.internal.db.SVNSqlJetDb.createSqlJetError(SVNSqlJetDb.java:195)
	at org.tmatesoft.svn.core.internal.db.SVNSqlJetDb.beginTransaction(SVNSqlJetDb.java:211)
	at org.tmatesoft.svn.core.internal.db.SVNSqlJetDb.runTransaction(SVNSqlJetDb.java:257)
	at org.tmatesoft.svn.core.internal.db.SVNSqlJetDb.runTransaction(SVNSqlJetDb.java:252)
	at org.tmatesoft.svn.core.internal.wc17.db.SVNWCDb.obtainWCLock(SVNWCDb.java:5867)
	at org.tmatesoft.svn.core.internal.wc17.SVNWCContext.acquireWriteLock(SVNWCContext.java:1646)
	at org.tmatesoft.svn.core.internal.wc2.ng.SvnNgAbstractUpdate.update(SvnNgAbstractUpdate.java:106)
	at org.tmatesoft.svn.core.internal.wc2.ng.SvnNgUpdate.run(SvnNgUpdate.java:40)
	at org.tmatesoft.svn.core.internal.wc2.ng.SvnNgUpdate.run(SvnNgUpdate.java:18)
	at org.tmatesoft.svn.core.internal.wc2.ng.SvnNgOperationRunner.run(SvnNgOperationRunner.java:20)
	at org.tmatesoft.svn.core.internal.wc2.SvnOperationRunner.run(SvnOperationRunner.java:21)
	at org.tmatesoft.svn.core.wc2.SvnOperationFactory.run(SvnOperationFactory.java:1235)
	at org.tmatesoft.svn.core.wc2.SvnOperation.run(SvnOperation.java:294)
	at org.tmatesoft.svn.core.wc.SVNUpdateClient.doUpdate(SVNUpdateClient.java:311)
	at org.tmatesoft.svn.core.wc.SVNUpdateClient.doUpdate(SVNUpdateClient.java:291)
	at org.tmatesoft.svn.core.wc.SVNUpdateClient.doUpdate(SVNUpdateClient.java:387)
	at hudson.scm.subversion.UpdateUpdater$TaskImpl.perform(UpdateUpdater.java:160)
Caused: hudson.scm.subversion.UpdaterException: failed to perform svn update
Also:   hudson.remoting.Channel$CallSiteStackTrace: Remote call to H23
		at hudson.remoting.Channel.attachCallSiteStackTrace(Channel.java:1693)
		at hudson.remoting.UserResponse.retrieve(UserRequest.java:310)
		at hudson.remoting.Channel.call(Channel.java:908)
		at hudson.FilePath.act(FilePath.java:986)
		at hudson.FilePath.act(FilePath.java:975)
		at hudson.scm.SubversionSCM.checkout(SubversionSCM.java:928)
		at hudson.scm.SubversionSCM.checkout(SubversionSCM.java:864)
		at hudson.scm.SCM.checkout(SCM.java:495)
		at hudson.model.AbstractProject.checkout(AbstractProject.java:1202)
		at hudson.model.AbstractBuild$AbstractBuildExecution.defaultCheckout(AbstractBuild.java:574)
		at jenkins.scm.SCMCheckoutStrategy.checkout(SCMCheckoutStrategy.java:86)
		at hudson.model.AbstractBuild$AbstractBuildExecution.run(AbstractBuild.java:499)
		at hudson.model.Run.execute(Run.java:1724)
		at hudson.model.FreeStyleBuild.run(FreeStyleBuild.java:43)
		at hudson.model.ResourceController.execute(ResourceController.java:97)
		at hudson.model.Executor.run(Executor.java:421)
Caused: java.io.IOException
	at hudson.scm.subversion.UpdateUpdater$TaskImpl.perform(UpdateUpdater.java:215)
	at hudson.scm.subversion.WorkspaceUpdater$UpdateTask.delegateTo(WorkspaceUpdater.java:168)
	at hudson.scm.SubversionSCM$CheckOutTask.perform(SubversionSCM.java:1030)
	at hudson.scm.SubversionSCM$CheckOutTask.invoke(SubversionSCM.java:1006)
	at hudson.scm.SubversionSCM$CheckOutTask.invoke(SubversionSCM.java:979)
	at hudson.FilePath$FileCallableWrapper.call(FilePath.java:2760)
	at hudson.remoting.UserRequest.perform(UserRequest.java:207)
	at hudson.remoting.UserRequest.perform(UserRequest.java:53)
	at hudson.remoting.Request$2.run(Request.java:358)
	at hudson.remoting.InterceptingExecutorService$1.call(InterceptingExecutorService.java:72)
	at java.util.concurrent.FutureTask.run(FutureTask.java:266)
	at java.util.concurrent.ThreadPoolExecutor.runWorker(ThreadPoolExecutor.java:1142)
	at java.util.concurrent.ThreadPoolExecutor$Worker.run(ThreadPoolExecutor.java:617)
	at java.lang.Thread.run(Thread.java:748)
Caused: java.io.IOException: remote file operation failed: <https://builds.apache.org/job/POI-DSL-API-Check/ws/>
at hudson.remoting.Channel@172a4f92:H23
	at hudson.FilePath.act(FilePath.java:993)
	at hudson.FilePath.act(FilePath.java:975)
	at hudson.scm.SubversionSCM.checkout(SubversionSCM.java:928)
	at hudson.scm.SubversionSCM.checkout(SubversionSCM.java:864)
	at hudson.scm.SCM.checkout(SCM.java:495)
	at hudson.model.AbstractProject.checkout(AbstractProject.java:1202)
	at hudson.model.AbstractBuild$AbstractBuildExecution.defaultCheckout(AbstractBuild.java:574)
	at jenkins.scm.SCMCheckoutStrategy.checkout(SCMCheckoutStrategy.java:86)
	at hudson.model.AbstractBuild$AbstractBuildExecution.run(AbstractBuild.java:499)
	at hudson.model.Run.execute(Run.java:1724)
	at hudson.model.FreeStyleBuild.run(FreeStyleBuild.java:43)
	at hudson.model.ResourceController.execute(ResourceController.java:97)
	at hudson.model.Executor.run(Executor.java:421)
Retrying after 10 seconds
Updating https://svn.apache.org/repos/asf/poi/trunk at revision '2018-01-30T03:33:10.701 +0000'
ERROR: Failed to update https://svn.apache.org/repos/asf/poi/trunk
org.tmatesoft.svn.core.SVNException: svn: E200030: FULL
	at org.tmatesoft.svn.core.internal.wc.SVNErrorManager.error(SVNErrorManager.java:70)
	at org.tmatesoft.svn.core.internal.wc.SVNErrorManager.error(SVNErrorManager.java:57)
	at org.tmatesoft.svn.core.internal.db.SVNSqlJetDb.createSqlJetError(SVNSqlJetDb.java:195)
	at org.tmatesoft.svn.core.internal.db.SVNSqlJetDb.beginTransaction(SVNSqlJetDb.java:211)
	at org.tmatesoft.svn.core.internal.db.SVNSqlJetDb.runTransaction(SVNSqlJetDb.java:257)
	at org.tmatesoft.svn.core.internal.db.SVNSqlJetDb.runTransaction(SVNSqlJetDb.java:252)
	at org.tmatesoft.svn.core.internal.wc17.db.SVNWCDb.obtainWCLock(SVNWCDb.java:5867)
	at org.tmatesoft.svn.core.internal.wc17.SVNWCContext.acquireWriteLock(SVNWCContext.java:1646)
	at org.tmatesoft.svn.core.internal.wc2.ng.SvnNgAbstractUpdate.update(SvnNgAbstractUpdate.java:106)
	at org.tmatesoft.svn.core.internal.wc2.ng.SvnNgUpdate.run(SvnNgUpdate.java:40)
	at org.tmatesoft.svn.core.internal.wc2.ng.SvnNgUpdate.run(SvnNgUpdate.java:18)
	at org.tmatesoft.svn.core.internal.wc2.ng.SvnNgOperationRunner.run(SvnNgOperationRunner.java:20)
	at org.tmatesoft.svn.core.internal.wc2.SvnOperationRunner.run(SvnOperationRunner.java:21)
	at org.tmatesoft.svn.core.wc2.SvnOperationFactory.run(SvnOperationFactory.java:1235)
	at org.tmatesoft.svn.core.wc2.SvnOperation.run(SvnOperation.java:294)
	at org.tmatesoft.svn.core.wc.SVNUpdateClient.doUpdate(SVNUpdateClient.java:311)
	at org.tmatesoft.svn.core.wc.SVNUpdateClient.doUpdate(SVNUpdateClient.java:291)
	at org.tmatesoft.svn.core.wc.SVNUpdateClient.doUpdate(SVNUpdateClient.java:387)
	at hudson.scm.subversion.UpdateUpdater$TaskImpl.perform(UpdateUpdater.java:160)
	at hudson.scm.subversion.WorkspaceUpdater$UpdateTask.delegateTo(WorkspaceUpdater.java:168)
	at hudson.scm.SubversionSCM$CheckOutTask.perform(SubversionSCM.java:1030)
	at hudson.scm.SubversionSCM$CheckOutTask.invoke(SubversionSCM.java:1006)
	at hudson.scm.SubversionSCM$CheckOutTask.invoke(SubversionSCM.java:979)
	at hudson.FilePath$FileCallableWrapper.call(FilePath.java:2760)
	at hudson.remoting.UserRequest.perform(UserRequest.java:207)
	at hudson.remoting.UserRequest.perform(UserRequest.java:53)
	at hudson.remoting.Request$2.run(Request.java:358)
	at hudson.remoting.InterceptingExecutorService$1.call(InterceptingExecutorService.java:72)
	at java.util.concurrent.FutureTask.run(FutureTask.java:266)
	at java.util.concurrent.ThreadPoolExecutor.runWorker(ThreadPoolExecutor.java:1142)
	at java.util.concurrent.ThreadPoolExecutor$Worker.run(ThreadPoolExecutor.java:617)
	at java.lang.Thread.run(Thread.java:748)
Caused by: org.tmatesoft.sqljet.core.SqlJetException: FULL: error code is FULL
	at org.tmatesoft.sqljet.core.internal.pager.SqlJetPager.openJournal(SqlJetPager.java:3051)
	at org.tmatesoft.sqljet.core.internal.pager.SqlJetPager.begin(SqlJetPager.java:2782)
	at org.tmatesoft.sqljet.core.internal.btree.SqlJetBtree.beginTrans(SqlJetBtree.java:931)
	at org.tmatesoft.sqljet.core.table.engine.SqlJetEngine.doBeginTransaction(SqlJetEngine.java:561)
	at org.tmatesoft.sqljet.core.table.engine.SqlJetEngine.access$100(SqlJetEngine.java:55)
	at org.tmatesoft.sqljet.core.table.engine.SqlJetEngine$9.runSynchronized(SqlJetEngine.java:475)
	at org.tmatesoft.sqljet.core.table.engine.SqlJetEngine.runSynchronized(SqlJetEngine.java:217)
	at org.tmatesoft.sqljet.core.table.engine.SqlJetEngine.beginTransaction(SqlJetEngine.java:471)
	at org.tmatesoft.svn.core.internal.db.SVNSqlJetDb.beginTransaction(SVNSqlJetDb.java:206)
	... 28 more
ERROR: Subversion update failed
org.tmatesoft.sqljet.core.SqlJetException: FULL: error code is FULL
	at org.tmatesoft.sqljet.core.internal.pager.SqlJetPager.openJournal(SqlJetPager.java:3051)
	at org.tmatesoft.sqljet.core.internal.pager.SqlJetPager.begin(SqlJetPager.java:2782)
	at org.tmatesoft.sqljet.core.internal.btree.SqlJetBtree.beginTrans(SqlJetBtree.java:931)
	at org.tmatesoft.sqljet.core.table.engine.SqlJetEngine.doBeginTransaction(SqlJetEngine.java:561)
	at org.tmatesoft.sqljet.core.table.engine.SqlJetEngine.access$100(SqlJetEngine.java:55)
	at org.tmatesoft.sqljet.core.table.engine.SqlJetEngine$9.runSynchronized(SqlJetEngine.java:475)
	at org.tmatesoft.sqljet.core.table.engine.SqlJetEngine.runSynchronized(SqlJetEngine.java:217)
	at org.tmatesoft.sqljet.core.table.engine.SqlJetEngine.beginTransaction(SqlJetEngine.java:471)
	at org.tmatesoft.svn.core.internal.db.SVNSqlJetDb.beginTransaction(SVNSqlJetDb.java:206)
Caused: org.tmatesoft.svn.core.SVNException: svn: E200030: FULL
	at org.tmatesoft.svn.core.internal.wc.SVNErrorManager.error(SVNErrorManager.java:70)
	at org.tmatesoft.svn.core.internal.wc.SVNErrorManager.error(SVNErrorManager.java:57)
	at org.tmatesoft.svn.core.internal.db.SVNSqlJetDb.createSqlJetError(SVNSqlJetDb.java:195)
	at org.tmatesoft.svn.core.internal.db.SVNSqlJetDb.beginTransaction(SVNSqlJetDb.java:211)
	at org.tmatesoft.svn.core.internal.db.SVNSqlJetDb.runTransaction(SVNSqlJetDb.java:257)
	at org.tmatesoft.svn.core.internal.db.SVNSqlJetDb.runTransaction(SVNSqlJetDb.java:252)
	at org.tmatesoft.svn.core.internal.wc17.db.SVNWCDb.obtainWCLock(SVNWCDb.java:5867)
	at org.tmatesoft.svn.core.internal.wc17.SVNWCContext.acquireWriteLock(SVNWCContext.java:1646)
	at org.tmatesoft.svn.core.internal.wc2.ng.SvnNgAbstractUpdate.update(SvnNgAbstractUpdate.java:106)
	at org.tmatesoft.svn.core.internal.wc2.ng.SvnNgUpdate.run(SvnNgUpdate.java:40)
	at org.tmatesoft.svn.core.internal.wc2.ng.SvnNgUpdate.run(SvnNgUpdate.java:18)
	at org.tmatesoft.svn.core.internal.wc2.ng.SvnNgOperationRunner.run(SvnNgOperationRunner.java:20)
	at org.tmatesoft.svn.core.internal.wc2.SvnOperationRunner.run(SvnOperationRunner.java:21)
	at org.tmatesoft.svn.core.wc2.SvnOperationFactory.run(SvnOperationFactory.java:1235)
	at org.tmatesoft.svn.core.wc2.SvnOperation.run(SvnOperation.java:294)
	at org.tmatesoft.svn.core.wc.SVNUpdateClient.doUpdate(SVNUpdateClient.java:311)
	at org.tmatesoft.svn.core.wc.SVNUpdateClient.doUpdate(SVNUpdateClient.java:291)
	at org.tmatesoft.svn.core.wc.SVNUpdateClient.doUpdate(SVNUpdateClient.java:387)
	at hudson.scm.subversion.UpdateUpdater$TaskImpl.perform(UpdateUpdater.java:160)
Caused: hudson.scm.subversion.UpdaterException: failed to perform svn update
Also:   hudson.remoting.Channel$CallSiteStackTrace: Remote call to H23
		at hudson.remoting.Channel.attachCallSiteStackTrace(Channel.java:1693)
		at hudson.remoting.UserResponse.retrieve(UserRequest.java:310)
		at hudson.remoting.Channel.call(Channel.java:908)
		at hudson.FilePath.act(FilePath.java:986)
		at hudson.FilePath.act(FilePath.java:975)
		at hudson.scm.SubversionSCM.checkout(SubversionSCM.java:928)
		at hudson.scm.SubversionSCM.checkout(SubversionSCM.java:864)
		at hudson.scm.SCM.checkout(SCM.java:495)
		at hudson.model.AbstractProject.checkout(AbstractProject.java:1202)
		at hudson.model.AbstractBuild$AbstractBuildExecution.defaultCheckout(AbstractBuild.java:574)
		at jenkins.scm.SCMCheckoutStrategy.checkout(SCMCheckoutStrategy.java:86)
		at hudson.model.AbstractBuild$AbstractBuildExecution.run(AbstractBuild.java:499)
		at hudson.model.Run.execute(Run.java:1724)
		at hudson.model.FreeStyleBuild.run(FreeStyleBuild.java:43)
		at hudson.model.ResourceController.execute(ResourceController.java:97)
		at hudson.model.Executor.run(Executor.java:421)
Caused: java.io.IOException
	at hudson.scm.subversion.UpdateUpdater$TaskImpl.perform(UpdateUpdater.java:215)
	at hudson.scm.subversion.WorkspaceUpdater$UpdateTask.delegateTo(WorkspaceUpdater.java:168)
	at hudson.scm.SubversionSCM$CheckOutTask.perform(SubversionSCM.java:1030)
	at hudson.scm.SubversionSCM$CheckOutTask.invoke(SubversionSCM.java:1006)
	at hudson.scm.SubversionSCM$CheckOutTask.invoke(SubversionSCM.java:979)
	at hudson.FilePath$FileCallableWrapper.call(FilePath.java:2760)
	at hudson.remoting.UserRequest.perform(UserRequest.java:207)
	at hudson.remoting.UserRequest.perform(UserRequest.java:53)
	at hudson.remoting.Request$2.run(Request.java:358)
	at hudson.remoting.InterceptingExecutorService$1.call(InterceptingExecutorService.java:72)
	at java.util.concurrent.FutureTask.run(FutureTask.java:266)
	at java.util.concurrent.ThreadPoolExecutor.runWorker(ThreadPoolExecutor.java:1142)
	at java.util.concurrent.ThreadPoolExecutor$Worker.run(ThreadPoolExecutor.java:617)
	at java.lang.Thread.run(Thread.java:748)
Caused: java.io.IOException: remote file operation failed: <https://builds.apache.org/job/POI-DSL-API-Check/ws/>
at hudson.remoting.Channel@172a4f92:H23
	at hudson.FilePath.act(FilePath.java:993)
	at hudson.FilePath.act(FilePath.java:975)
	at hudson.scm.SubversionSCM.checkout(SubversionSCM.java:928)
	at hudson.scm.SubversionSCM.checkout(SubversionSCM.java:864)
	at hudson.scm.SCM.checkout(SCM.java:495)
	at hudson.model.AbstractProject.checkout(AbstractProject.java:1202)
	at hudson.model.AbstractBuild$AbstractBuildExecution.defaultCheckout(AbstractBuild.java:574)
	at jenkins.scm.SCMCheckoutStrategy.checkout(SCMCheckoutStrategy.java:86)
	at hudson.model.AbstractBuild$AbstractBuildExecution.run(AbstractBuild.java:499)
	at hudson.model.Run.execute(Run.java:1724)
	at hudson.model.FreeStyleBuild.run(FreeStyleBuild.java:43)
	at hudson.model.ResourceController.execute(ResourceController.java:97)
	at hudson.model.Executor.run(Executor.java:421)
Archiving artifacts
[Fast Archiver] Compressed 633.44 KB of artifacts by 96.0% relative to #266

---------------------------------------------------------------------
To unsubscribe, e-mail: dev-unsubscribe@poi.apache.org
For additional commands, e-mail: dev-help@poi.apache.org


Mime
View raw message