poi-dev mailing list archives

Site index · List index
Message view « Date » · « Thread »
Top « Date » · « Thread »
From Apache Jenkins Server <jenk...@builds.apache.org>
Subject Build failed in Jenkins: POI-DSL-Maven #401
Date Wed, 15 Nov 2017 12:10:15 GMT
See <https://builds.apache.org/job/POI-DSL-Maven/401/display/redirect?page=changes>

Changes:

[gwoolsey] Fixes Bug 61764 Conditional formatting rules don't evaluate properly for some multi-range
rule definitions

Fixes Bug 61761 Conditional formatting rule evaluation doesn't like comparing cells of different
types

fixed, with unit tests.

------------------------------------------
[...truncated 1.16 MB...]
Running org.apache.poi.xssf.usermodel.extensions.TestXSSFCellFill
Tests run: 5, Failures: 0, Errors: 0, Skipped: 0, Time elapsed: 0.008 sec - in org.apache.poi.xssf.usermodel.extensions.TestXSSFCellFill
Running org.apache.poi.xssf.usermodel.extensions.TestXSSFSheetComments
Tests run: 1, Failures: 0, Errors: 0, Skipped: 0, Time elapsed: 0 sec - in org.apache.poi.xssf.usermodel.extensions.TestXSSFSheetComments
Running org.apache.poi.xssf.usermodel.TestXSSFSimpleShape
Tests run: 1, Failures: 0, Errors: 0, Skipped: 0, Time elapsed: 0.018 sec - in org.apache.poi.xssf.usermodel.TestXSSFSimpleShape
Running org.apache.poi.xssf.usermodel.TestXSSFDialogSheet
Tests run: 14, Failures: 0, Errors: 0, Skipped: 0, Time elapsed: 0.047 sec - in org.apache.poi.xssf.usermodel.TestXSSFDialogSheet
Running org.apache.poi.xssf.usermodel.TestXSSFChart
Tests run: 3, Failures: 0, Errors: 0, Skipped: 0, Time elapsed: 0.081 sec - in org.apache.poi.xssf.usermodel.TestXSSFChart
Running org.apache.poi.xssf.usermodel.TestSheetHiding
Tests run: 5, Failures: 0, Errors: 0, Skipped: 0, Time elapsed: 0.217 sec - in org.apache.poi.xssf.usermodel.TestSheetHiding
Running org.apache.poi.xssf.usermodel.TestXSSFEvaluationSheet
Tests run: 1, Failures: 0, Errors: 0, Skipped: 0, Time elapsed: 0.001 sec - in org.apache.poi.xssf.usermodel.TestXSSFEvaluationSheet
Running org.apache.poi.xssf.usermodel.TestXSSFTextRun
Tests run: 1, Failures: 0, Errors: 0, Skipped: 0, Time elapsed: 0.011 sec - in org.apache.poi.xssf.usermodel.TestXSSFTextRun
Running org.apache.poi.xssf.usermodel.TestXSSFBugs
Tests run: 139, Failures: 0, Errors: 0, Skipped: 8, Time elapsed: 11.896 sec - in org.apache.poi.xssf.usermodel.TestXSSFBugs
Running org.apache.poi.xssf.usermodel.TestTableStyles
Tests run: 2, Failures: 0, Errors: 0, Skipped: 0, Time elapsed: 0.284 sec - in org.apache.poi.xssf.usermodel.TestTableStyles
Running org.apache.poi.xssf.usermodel.TestSXSSFBugs
Tests run: 39, Failures: 0, Errors: 0, Skipped: 8, Time elapsed: 5.916 sec - in org.apache.poi.xssf.usermodel.TestSXSSFBugs
Running org.apache.poi.xssf.usermodel.TestXSSFPivotTableName
Tests run: 18, Failures: 0, Errors: 0, Skipped: 0, Time elapsed: 0.305 sec - in org.apache.poi.xssf.usermodel.TestXSSFPivotTableName
Running org.apache.poi.xssf.usermodel.TestXSSFRichTextString
Tests run: 18, Failures: 0, Errors: 0, Skipped: 0, Time elapsed: 0.02 sec - in org.apache.poi.xssf.usermodel.TestXSSFRichTextString
Running org.apache.poi.xssf.usermodel.TestXSSFOddHeader
Tests run: 1, Failures: 0, Errors: 0, Skipped: 0, Time elapsed: 0.002 sec - in org.apache.poi.xssf.usermodel.TestXSSFOddHeader
Running org.apache.poi.xssf.usermodel.TestXSSFExternalFunctions
Tests run: 2, Failures: 0, Errors: 0, Skipped: 0, Time elapsed: 0.007 sec - in org.apache.poi.xssf.usermodel.TestXSSFExternalFunctions
Running org.apache.poi.xssf.usermodel.TestXSSFDataValidation
Tests run: 7, Failures: 0, Errors: 0, Skipped: 0, Time elapsed: 0.441 sec - in org.apache.poi.xssf.usermodel.TestXSSFDataValidation
Running org.apache.poi.xssf.usermodel.TestXSSFFont
Tests run: 22, Failures: 0, Errors: 0, Skipped: 0, Time elapsed: 0.052 sec - in org.apache.poi.xssf.usermodel.TestXSSFFont
Running org.apache.poi.xssf.usermodel.TestMultiSheetFormulaEvaluatorOnXSSF
Tests run: 2, Failures: 0, Errors: 0, Skipped: 0, Time elapsed: 0.002 sec - in org.apache.poi.xssf.usermodel.TestMultiSheetFormulaEvaluatorOnXSSF
Running org.apache.poi.xssf.usermodel.helpers.TestHeaderFooterHelper
Tests run: 2, Failures: 0, Errors: 0, Skipped: 0, Time elapsed: 0 sec - in org.apache.poi.xssf.usermodel.helpers.TestHeaderFooterHelper
Running org.apache.poi.xssf.usermodel.helpers.TestColumnHelper
Tests run: 15, Failures: 0, Errors: 0, Skipped: 0, Time elapsed: 0.04 sec - in org.apache.poi.xssf.usermodel.helpers.TestColumnHelper
Running org.apache.poi.xssf.usermodel.TestXSSFForkedEvaluator
Tests run: 2, Failures: 0, Errors: 0, Skipped: 0, Time elapsed: 0.012 sec - in org.apache.poi.xssf.usermodel.TestXSSFForkedEvaluator
Running org.apache.poi.xssf.usermodel.TestXSSFSheetAutosizeColumn
Tests run: 7, Failures: 0, Errors: 0, Skipped: 0, Time elapsed: 0.059 sec - in org.apache.poi.xssf.usermodel.TestXSSFSheetAutosizeColumn
Running org.apache.poi.xssf.usermodel.TestFormulaEvaluatorOnXSSF
Tests run: 369, Failures: 0, Errors: 0, Skipped: 90, Time elapsed: 0.274 sec - in org.apache.poi.xssf.usermodel.TestFormulaEvaluatorOnXSSF
Running org.apache.poi.xssf.usermodel.TestXSSFSheet
Tests run: 95, Failures: 0, Errors: 0, Skipped: 0, Time elapsed: 3.899 sec - in org.apache.poi.xssf.usermodel.TestXSSFSheet
Running org.apache.poi.xssf.model.TestCalculationChain
Tests run: 1, Failures: 0, Errors: 0, Skipped: 0, Time elapsed: 0.313 sec - in org.apache.poi.xssf.model.TestCalculationChain
Running org.apache.poi.xssf.model.TestSharedStringsTable
Tests run: 3, Failures: 0, Errors: 0, Skipped: 0, Time elapsed: 0.057 sec - in org.apache.poi.xssf.model.TestSharedStringsTable
Running org.apache.poi.xssf.model.TestThemesTable
Tests run: 3, Failures: 0, Errors: 0, Skipped: 0, Time elapsed: 0.071 sec - in org.apache.poi.xssf.model.TestThemesTable
Running org.apache.poi.xssf.model.TestCommentsTable
Tests run: 7, Failures: 0, Errors: 0, Skipped: 0, Time elapsed: 0.063 sec - in org.apache.poi.xssf.model.TestCommentsTable
Running org.apache.poi.xssf.model.TestExternalLinksTable
Tests run: 4, Failures: 0, Errors: 0, Skipped: 0, Time elapsed: 0.042 sec - in org.apache.poi.xssf.model.TestExternalLinksTable
Running org.apache.poi.xssf.model.TestStylesTable
Tests run: 13, Failures: 0, Errors: 0, Skipped: 0, Time elapsed: 0.133 sec - in org.apache.poi.xssf.model.TestStylesTable
Running org.apache.poi.xssf.model.TestMapInfo
Tests run: 1, Failures: 0, Errors: 0, Skipped: 0, Time elapsed: 0.017 sec - in org.apache.poi.xssf.model.TestMapInfo
Running org.apache.poi.xssf.TestWorkbookProtection
Tests run: 8, Failures: 0, Errors: 0, Skipped: 0, Time elapsed: 0.501 sec - in org.apache.poi.xssf.TestWorkbookProtection
Running org.apache.poi.xssf.extractor.TestXSSFEventBasedExcelExtractor
Tests run: 12, Failures: 0, Errors: 0, Skipped: 0, Time elapsed: 0.315 sec - in org.apache.poi.xssf.extractor.TestXSSFEventBasedExcelExtractor
Running org.apache.poi.xssf.extractor.TestXSSFExportToXML
Tests run: 17, Failures: 0, Errors: 0, Skipped: 1, Time elapsed: 0.342 sec - in org.apache.poi.xssf.extractor.TestXSSFExportToXML
Running org.apache.poi.xssf.extractor.TestXSSFEventBasedExcelExtractorUsingFactory
Tests run: 12, Failures: 0, Errors: 0, Skipped: 0, Time elapsed: 0.309 sec - in org.apache.poi.xssf.extractor.TestXSSFEventBasedExcelExtractorUsingFactory
Running org.apache.poi.xssf.extractor.TestXSSFExcelExtractor
Tests run: 8, Failures: 0, Errors: 0, Skipped: 0, Time elapsed: 0.362 sec - in org.apache.poi.xssf.extractor.TestXSSFExcelExtractor
Running org.apache.poi.xssf.extractor.TestXSSFBEventBasedExcelExtractor
Tests run: 3, Failures: 0, Errors: 0, Skipped: 0, Time elapsed: 0.016 sec - in org.apache.poi.xssf.extractor.TestXSSFBEventBasedExcelExtractor
Running org.apache.poi.xssf.extractor.TestXSSFExcelExtractorUsingFactory
Tests run: 8, Failures: 0, Errors: 0, Skipped: 0, Time elapsed: 0.35 sec - in org.apache.poi.xssf.extractor.TestXSSFExcelExtractorUsingFactory
Running org.apache.poi.xssf.extractor.TestXSSFImportFromXML
Tests run: 5, Failures: 0, Errors: 0, Skipped: 0, Time elapsed: 5.389 sec - in org.apache.poi.xssf.extractor.TestXSSFImportFromXML
Running org.apache.poi.ss.util.TestXSSFPropertyTemplate
Tests run: 2, Failures: 0, Errors: 0, Skipped: 0, Time elapsed: 0.099 sec - in org.apache.poi.ss.util.TestXSSFPropertyTemplate
Running org.apache.poi.ss.util.TestXSSFCellUtil
Tests run: 13, Failures: 0, Errors: 0, Skipped: 0, Time elapsed: 0.075 sec - in org.apache.poi.ss.util.TestXSSFCellUtil
Running org.apache.poi.ss.util.TestSXSSFCellUtil
Tests run: 13, Failures: 0, Errors: 0, Skipped: 0, Time elapsed: 0.06 sec - in org.apache.poi.ss.util.TestSXSSFCellUtil
Running org.apache.poi.ss.format.TestCellFormatPart
Tests run: 6, Failures: 0, Errors: 0, Skipped: 0, Time elapsed: 0.35 sec - in org.apache.poi.ss.format.TestCellFormatPart
Running org.apache.poi.ss.formula.TestFormulaParser
Tests run: 9, Failures: 0, Errors: 0, Skipped: 0, Time elapsed: 0.029 sec - in org.apache.poi.ss.formula.TestFormulaParser
Running org.apache.poi.ss.formula.functions.TestProper
Tests run: 4, Failures: 0, Errors: 0, Skipped: 0, Time elapsed: 1.766 sec - in org.apache.poi.ss.formula.functions.TestProper
Running org.apache.poi.ss.formula.functions.TestSumifsXSSF
Tests run: 1, Failures: 0, Errors: 0, Skipped: 0, Time elapsed: 0.006 sec - in org.apache.poi.ss.formula.functions.TestSumifsXSSF
Running org.apache.poi.ss.formula.TestStructuredReferences
Tests run: 2, Failures: 0, Errors: 0, Skipped: 0, Time elapsed: 0.008 sec - in org.apache.poi.ss.formula.TestStructuredReferences
Running org.apache.poi.ss.formula.eval.TestXSSFCircularReferences
Tests run: 4, Failures: 0, Errors: 0, Skipped: 0, Time elapsed: 0.05 sec - in org.apache.poi.ss.formula.eval.TestXSSFCircularReferences
Running org.apache.poi.ss.usermodel.TestEmbedOLEPackage
Tests run: 2, Failures: 0, Errors: 0, Skipped: 0, Time elapsed: 0.058 sec - in org.apache.poi.ss.usermodel.TestEmbedOLEPackage
Running org.apache.poi.ss.usermodel.ConditionalFormattingEvalTest
Tests run: 5, Failures: 0, Errors: 0, Skipped: 0, Time elapsed: 0.644 sec - in org.apache.poi.ss.usermodel.ConditionalFormattingEvalTest
Running org.apache.poi.ss.usermodel.TestXSSFBorderStyle
Tests run: 1, Failures: 0, Errors: 0, Skipped: 0, Time elapsed: 0.004 sec - in org.apache.poi.ss.usermodel.TestXSSFBorderStyle
Running org.apache.poi.ss.extractor.TestEmbeddedExtractor
Tests run: 3, Failures: 0, Errors: 0, Skipped: 0, Time elapsed: 0.267 sec - in org.apache.poi.ss.extractor.TestEmbeddedExtractor
Running org.apache.poi.ss.TestWorkbookFactory
Tests run: 8, Failures: 0, Errors: 0, Skipped: 0, Time elapsed: 0.298 sec - in org.apache.poi.ss.TestWorkbookFactory
Running org.apache.poi.TestPOIXMLDocument
Tests run: 10, Failures: 0, Errors: 0, Skipped: 0, Time elapsed: 2.262 sec - in org.apache.poi.TestPOIXMLDocument
Running org.apache.poi.dev.TestOOXMLLister
Tests run: 2, Failures: 0, Errors: 0, Skipped: 0, Time elapsed: 0.01 sec - in org.apache.poi.dev.TestOOXMLLister
Running org.apache.poi.dev.TestOOXMLPrettyPrint
Tests run: 1, Failures: 0, Errors: 0, Skipped: 0, Time elapsed: 0.026 sec - in org.apache.poi.dev.TestOOXMLPrettyPrint
Running org.apache.poi.dev.TestRecordGenerator
Tests run: 3, Failures: 0, Errors: 0, Skipped: 3, Time elapsed: 0 sec - in org.apache.poi.dev.TestRecordGenerator
Running org.apache.poi.TestDetectAsOOXML
Tests run: 3, Failures: 0, Errors: 0, Skipped: 0, Time elapsed: 0.005 sec - in org.apache.poi.TestDetectAsOOXML
Running org.apache.poi.extractor.TestExtractorFactory
Tests run: 11, Failures: 0, Errors: 0, Skipped: 0, Time elapsed: 0.728 sec - in org.apache.poi.extractor.TestExtractorFactory
Running org.apache.poi.openxml4j.opc.TestListParts
Tests run: 1, Failures: 0, Errors: 0, Skipped: 0, Time elapsed: 0.002 sec - in org.apache.poi.openxml4j.opc.TestListParts
Running org.apache.poi.openxml4j.opc.TestPackage
Tests run: 23, Failures: 0, Errors: 0, Skipped: 1, Time elapsed: 0.668 sec - in org.apache.poi.openxml4j.opc.TestPackage
Running org.apache.poi.openxml4j.opc.TestRelationships
Tests run: 9, Failures: 0, Errors: 0, Skipped: 0, Time elapsed: 0.057 sec - in org.apache.poi.openxml4j.opc.TestRelationships
Running org.apache.poi.openxml4j.opc.TestPackagingURIHelper
Tests run: 5, Failures: 0, Errors: 0, Skipped: 0, Time elapsed: 0.001 sec - in org.apache.poi.openxml4j.opc.TestPackagingURIHelper
Running org.apache.poi.openxml4j.opc.internal.TestContentTypeManager
Tests run: 4, Failures: 0, Errors: 0, Skipped: 2, Time elapsed: 0.003 sec - in org.apache.poi.openxml4j.opc.internal.TestContentTypeManager
Running org.apache.poi.openxml4j.opc.internal.marshallers.TestZipPackagePropertiesMarshaller
Tests run: 4, Failures: 0, Errors: 0, Skipped: 0, Time elapsed: 0.001 sec - in org.apache.poi.openxml4j.opc.internal.marshallers.TestZipPackagePropertiesMarshaller
Running org.apache.poi.openxml4j.opc.TestPackageCoreProperties
Tests run: 7, Failures: 0, Errors: 0, Skipped: 0, Time elapsed: 0.054 sec - in org.apache.poi.openxml4j.opc.TestPackageCoreProperties
Running org.apache.poi.openxml4j.opc.TestZipPackage
Tests run: 8, Failures: 0, Errors: 0, Skipped: 0, Time elapsed: 0.587 sec - in org.apache.poi.openxml4j.opc.TestZipPackage
Running org.apache.poi.openxml4j.opc.TestPackageThumbnail
Tests run: 1, Failures: 0, Errors: 0, Skipped: 0, Time elapsed: 0.013 sec - in org.apache.poi.openxml4j.opc.TestPackageThumbnail
Running org.apache.poi.openxml4j.opc.compliance.TestOPCCompliancePartName
Tests run: 10, Failures: 0, Errors: 0, Skipped: 0, Time elapsed: 0.001 sec - in org.apache.poi.openxml4j.opc.compliance.TestOPCCompliancePartName
Running org.apache.poi.openxml4j.opc.compliance.TestOPCComplianceCoreProperties
Tests run: 11, Failures: 0, Errors: 0, Skipped: 0, Time elapsed: 0.075 sec - in org.apache.poi.openxml4j.opc.compliance.TestOPCComplianceCoreProperties
Running org.apache.poi.openxml4j.opc.compliance.TestOPCCompliancePackageModel
Tests run: 5, Failures: 0, Errors: 0, Skipped: 0, Time elapsed: 0.002 sec - in org.apache.poi.openxml4j.opc.compliance.TestOPCCompliancePackageModel
Running org.apache.poi.openxml4j.opc.TestFileHelper
Tests run: 1, Failures: 0, Errors: 0, Skipped: 0, Time elapsed: 0 sec - in org.apache.poi.openxml4j.opc.TestFileHelper
Running org.apache.poi.openxml4j.opc.TestPackagePartName
Tests run: 1, Failures: 0, Errors: 0, Skipped: 0, Time elapsed: 0 sec - in org.apache.poi.openxml4j.opc.TestPackagePartName
Running org.apache.poi.openxml4j.opc.TestContentType
Tests run: 7, Failures: 0, Errors: 0, Skipped: 0, Time elapsed: 0.006 sec - in org.apache.poi.openxml4j.opc.TestContentType
Running org.apache.poi.xslf.TestXSLFSlideShow
Tests run: 5, Failures: 0, Errors: 0, Skipped: 0, Time elapsed: 0.105 sec - in org.apache.poi.xslf.TestXSLFSlideShow
Running org.apache.poi.xslf.usermodel.TestXSLFTextShape
Tests run: 4, Failures: 0, Errors: 0, Skipped: 0, Time elapsed: 0.107 sec - in org.apache.poi.xslf.usermodel.TestXSLFTextShape
Running org.apache.poi.xslf.usermodel.TestXSLFTextRun
Tests run: 1, Failures: 0, Errors: 0, Skipped: 0, Time elapsed: 0.015 sec - in org.apache.poi.xslf.usermodel.TestXSLFTextRun
Running org.apache.poi.xslf.usermodel.TestXSLFFreeformShape
Tests run: 1, Failures: 0, Errors: 0, Skipped: 0, Time elapsed: 0.04 sec - in org.apache.poi.xslf.usermodel.TestXSLFFreeformShape
Running org.apache.poi.xslf.usermodel.TestXMLSlideShow
Tests run: 9, Failures: 0, Errors: 0, Skipped: 0, Time elapsed: 0.22 sec - in org.apache.poi.xslf.usermodel.TestXMLSlideShow
Running org.apache.poi.xslf.usermodel.TestXSLFSlideShowFactory
Tests run: 6, Failures: 0, Errors: 0, Skipped: 0, Time elapsed: 0.533 sec - in org.apache.poi.xslf.usermodel.TestXSLFSlideShowFactory
Running org.apache.poi.xslf.usermodel.TestXSLFAutoShape
Tests run: 4, Failures: 0, Errors: 0, Skipped: 0, Time elapsed: 0.115 sec - in org.apache.poi.xslf.usermodel.TestXSLFAutoShape
Running org.apache.poi.xslf.usermodel.TestXSLFShapeContainer
Tests run: 1, Failures: 0, Errors: 0, Skipped: 0, Time elapsed: 0.029 sec - in org.apache.poi.xslf.usermodel.TestXSLFShapeContainer
Running org.apache.poi.xslf.usermodel.TestXSLFSheet
Tests run: 1, Failures: 0, Errors: 0, Skipped: 0, Time elapsed: 0.051 sec - in org.apache.poi.xslf.usermodel.TestXSLFSheet
Running org.apache.poi.xslf.usermodel.TestXSLFSimpleShape
Tests run: 8, Failures: 0, Errors: 0, Skipped: 0, Time elapsed: 5.75 sec - in org.apache.poi.xslf.usermodel.TestXSLFSimpleShape
Running org.apache.poi.xslf.usermodel.TestXSLFTableStyles
Tests run: 1, Failures: 0, Errors: 0, Skipped: 0, Time elapsed: 0.011 sec - in org.apache.poi.xslf.usermodel.TestXSLFTableStyles
Running org.apache.poi.xslf.usermodel.TestXSLFTextParagraph
Tests run: 5, Failures: 0, Errors: 0, Skipped: 1, Time elapsed: 0.072 sec - in org.apache.poi.xslf.usermodel.TestXSLFTextParagraph
Running org.apache.poi.xslf.usermodel.TestXSLFTheme
Tests run: 1, Failures: 0, Errors: 0, Skipped: 0, Time elapsed: 0.146 sec - in org.apache.poi.xslf.usermodel.TestXSLFTheme
Running org.apache.poi.xslf.usermodel.TestXSLFPictureShape
Tests run: 6, Failures: 0, Errors: 0, Skipped: 0, Time elapsed: 0.302 sec - in org.apache.poi.xslf.usermodel.TestXSLFPictureShape
Running org.apache.poi.xslf.usermodel.TestXSLFHyperlink
Tests run: 3, Failures: 0, Errors: 0, Skipped: 0, Time elapsed: 0.087 sec - in org.apache.poi.xslf.usermodel.TestXSLFHyperlink
Running org.apache.poi.xslf.usermodel.TestXSLFConnectorShape
Tests run: 2, Failures: 0, Errors: 0, Skipped: 0, Time elapsed: 0.047 sec - in org.apache.poi.xslf.usermodel.TestXSLFConnectorShape
Running org.apache.poi.xslf.usermodel.TestXSLFSlide
Tests run: 4, Failures: 0, Errors: 0, Skipped: 0, Time elapsed: 0.706 sec - in org.apache.poi.xslf.usermodel.TestXSLFSlide
Running org.apache.poi.xslf.usermodel.TestXSLFColor
Tests run: 6, Failures: 0, Errors: 0, Skipped: 0, Time elapsed: 0.058 sec - in org.apache.poi.xslf.usermodel.TestXSLFColor
Running org.apache.poi.xslf.usermodel.TestXSLFSlideShow
Tests run: 6, Failures: 0, Errors: 0, Skipped: 0, Time elapsed: 0.191 sec - in org.apache.poi.xslf.usermodel.TestXSLFSlideShow
Running org.apache.poi.xslf.usermodel.TestXSLFNotes
Tests run: 3, Failures: 0, Errors: 0, Skipped: 0, Time elapsed: 0.072 sec - in org.apache.poi.xslf.usermodel.TestXSLFNotes
Running org.apache.poi.xslf.usermodel.TestXSLFChart
Tests run: 1, Failures: 0, Errors: 0, Skipped: 0, Time elapsed: 0.043 sec - in org.apache.poi.xslf.usermodel.TestXSLFChart
Running org.apache.poi.xslf.usermodel.TestPPTX2PNG
Tests run: 10, Failures: 0, Errors: 0, Skipped: 0, Time elapsed: 8.603 sec - in org.apache.poi.xslf.usermodel.TestPPTX2PNG
Running org.apache.poi.xslf.usermodel.TestXSLFShape
Tests run: 2, Failures: 0, Errors: 0, Skipped: 0, Time elapsed: 0.038 sec - in org.apache.poi.xslf.usermodel.TestXSLFShape
Running org.apache.poi.xslf.usermodel.TestXSLFTableRow
Tests run: 7, Failures: 0, Errors: 0, Skipped: 0, Time elapsed: 0.132 sec - in org.apache.poi.xslf.usermodel.TestXSLFTableRow
Running org.apache.poi.xslf.usermodel.TestXSLFTextBox
Tests run: 2, Failures: 0, Errors: 0, Skipped: 0, Time elapsed: 0.03 sec - in org.apache.poi.xslf.usermodel.TestXSLFTextBox
Running org.apache.poi.xslf.usermodel.TestXSLFTable
Tests run: 5, Failures: 0, Errors: 0, Skipped: 0, Time elapsed: 2.781 sec - in org.apache.poi.xslf.usermodel.TestXSLFTable
Running org.apache.poi.xslf.usermodel.TestXSLFGroupShape
Tests run: 2, Failures: 0, Errors: 0, Skipped: 0, Time elapsed: 0.027 sec - in org.apache.poi.xslf.usermodel.TestXSLFGroupShape
Running org.apache.poi.xslf.TestXSLFBugs
Tests run: 22, Failures: 0, Errors: 0, Skipped: 1, Time elapsed: 1.288 sec - in org.apache.poi.xslf.TestXSLFBugs
Running org.apache.poi.xslf.extractor.TestXSLFPowerPointExtractor
Tests run: 5, Failures: 0, Errors: 0, Skipped: 0, Time elapsed: 0.231 sec - in org.apache.poi.xslf.extractor.TestXSLFPowerPointExtractor
Running org.apache.poi.xslf.geom.TestFormulaParser
Tests run: 1, Failures: 0, Errors: 0, Skipped: 0, Time elapsed: 0 sec - in org.apache.poi.xslf.geom.TestFormulaParser

Results :

Failed tests: 
  TestXSSFFormulaEvaluation.testBug61495:442 expected:<D 0,068> but was:<org.apache.poi.ss.usermodel.CellValue
["D 00,68"]>

Tests run: 2354, Failures: 1, Errors: 0, Skipped: 158

[INFO] ------------------------------------------------------------------------
[INFO] Reactor Summary:
[INFO] 
[INFO] Apache POI - the Java API for Microsoft Documents . SUCCESS [  0.003 s]
[INFO] Apache POI Main package ........................... SUCCESS [01:50 min]
[INFO] Apache POI Scratchpad package ..................... SUCCESS [ 19.034 s]
[INFO] Apache POI - Openxmlformats Schema package ........ SUCCESS [01:35 min]
[INFO] Apache POI - Openxmlformats Encryption Schema package  SUCCESS [  0.862 s]
[INFO] Apache POI - Openxmlformats Security-Schema package  SUCCESS [ 10.792 s]
[INFO] Apache POI OOXML package .......................... FAILURE [02:33 min]
[INFO] Apache POI ExcelAnt package ....................... SKIPPED
[INFO] Apache POI Examples package ....................... SKIPPED
[INFO] ------------------------------------------------------------------------
[INFO] BUILD FAILURE
[INFO] ------------------------------------------------------------------------
[INFO] Total time: 06:30 min
[INFO] Finished at: 2017-11-15T12:10:14+00:00
[INFO] Final Memory: 53M/742M
[INFO] ------------------------------------------------------------------------
[ERROR] Failed to execute goal org.apache.maven.plugins:maven-surefire-plugin:2.19.1:test
(default-test) on project poi-ooxml: There are test failures.
[ERROR] 
[ERROR] Please refer to <https://builds.apache.org/job/POI-DSL-Maven/ws/sonar/ooxml/target/surefire-reports>
for the individual test results.
[ERROR] -> [Help 1]
[ERROR] 
[ERROR] To see the full stack trace of the errors, re-run Maven with the -e switch.
[ERROR] Re-run Maven using the -X switch to enable full debug logging.
[ERROR] 
[ERROR] For more information about the errors and possible solutions, please read the following
articles:
[ERROR] [Help 1] http://cwiki.apache.org/confluence/display/MAVEN/MojoFailureException
[ERROR] 
[ERROR] After correcting the problems, you can resume the build with the command
[ERROR]   mvn <goals> -rf :poi-ooxml
Build step 'Invoke top-level Maven targets' marked build as failure

---------------------------------------------------------------------
To unsubscribe, e-mail: dev-unsubscribe@poi.apache.org
For additional commands, e-mail: dev-help@poi.apache.org


Mime
View raw message