poi-dev mailing list archives

Site index · List index
Message view « Date » · « Thread »
Top « Date » · « Thread »
From Apache Jenkins Server <jenk...@builds.apache.org>
Subject Build failed in Jenkins: POI-DSL-OpenJDK #274
Date Sat, 07 Oct 2017 00:43:42 GMT
See <https://builds.apache.org/job/POI-DSL-OpenJDK/274/display/redirect?page=changes>

Changes:

[centic] Bug 61586: Add test which shows that it works as expected

------------------------------------------
[...truncated 607.68 KB...]
     [java] 	at org.apache.poi.hssf.usermodel.HSSFWorkbook.<init>(HSSFWorkbook.java:413)
     [java] 	at org.apache.poi.hssf.usermodel.HSSFWorkbook.<init>(HSSFWorkbook.java:394)
     [java] 	at org.apache.poi.hssf.HSSFTestDataSamples.openSampleWorkbook(HSSFTestDataSamples.java:50)
     [java] 	at org.apache.poi.xssf.usermodel.TestMissingWorkbookOnXSSF.setUp(TestMissingWorkbookOnXSSF.java:35)
     [java] 	at junit.framework.TestCase.runBare(TestCase.java:139)
     [java] 	at junit.framework.TestResult$1.protect(TestResult.java:122)
     [java] 	at junit.framework.TestResult.runProtected(TestResult.java:142)
     [java] 	at junit.framework.TestResult.run(TestResult.java:125)
     [java] 	at junit.framework.TestCase.run(TestCase.java:129)
     [java] 	at junit.framework.TestSuite.runTest(TestSuite.java:252)
     [java] 	at junit.framework.TestSuite.run(TestSuite.java:247)
     [java] 	at org.junit.internal.runners.JUnit38ClassRunner.run(JUnit38ClassRunner.java:86)
     [java] 	at org.junit.runners.Suite.runChild(Suite.java:128)
     [java] 	at org.junit.runners.Suite.runChild(Suite.java:27)
     [java] 	at org.junit.runners.ParentRunner$3.run(ParentRunner.java:290)
     [java] 	at org.junit.runners.ParentRunner$1.schedule(ParentRunner.java:71)
     [java] 	at org.junit.runners.ParentRunner.runChildren(ParentRunner.java:288)
     [java] 	at org.junit.runners.ParentRunner.access$000(ParentRunner.java:58)
     [java] 	at org.junit.runners.ParentRunner$2.evaluate(ParentRunner.java:268)
     [java] 	at org.junit.runners.ParentRunner.run(ParentRunner.java:363)
     [java] 	at org.junit.runner.JUnitCore.run(JUnitCore.java:137)
     [java] 	at org.junit.runner.JUnitCore.run(JUnitCore.java:115)
     [java] 	at org.junit.runner.JUnitCore.run(JUnitCore.java:105)
     [java] 	at org.junit.runner.JUnitCore.run(JUnitCore.java:94)
     [java] 	at org.apache.poi.util.OOXMLLite.build(OOXMLLite.java:149)
     [java] 	at org.apache.poi.util.OOXMLLite.main(OOXMLLite.java:94)
     [java] 146) testMissingWorkbookMissing(org.apache.poi.xssf.usermodel.TestMissingWorkbookOnXSSF)
     [java] java.lang.NoSuchMethodError: java.nio.ByteBuffer.position(I)Ljava/nio/ByteBuffer;
     [java] 	at org.apache.poi.poifs.filesystem.NPOIFSFileSystem.<init>(NPOIFSFileSystem.java:310)
     [java] 	at org.apache.poi.hssf.usermodel.HSSFWorkbook.<init>(HSSFWorkbook.java:413)
     [java] 	at org.apache.poi.hssf.usermodel.HSSFWorkbook.<init>(HSSFWorkbook.java:394)
     [java] 	at org.apache.poi.hssf.HSSFTestDataSamples.openSampleWorkbook(HSSFTestDataSamples.java:50)
     [java] 	at org.apache.poi.xssf.usermodel.TestMissingWorkbookOnXSSF.setUp(TestMissingWorkbookOnXSSF.java:35)
     [java] 	at junit.framework.TestCase.runBare(TestCase.java:139)
     [java] 	at junit.framework.TestResult$1.protect(TestResult.java:122)
     [java] 	at junit.framework.TestResult.runProtected(TestResult.java:142)
     [java] 	at junit.framework.TestResult.run(TestResult.java:125)
     [java] 	at junit.framework.TestCase.run(TestCase.java:129)
     [java] 	at junit.framework.TestSuite.runTest(TestSuite.java:252)
     [java] 	at junit.framework.TestSuite.run(TestSuite.java:247)
     [java] 	at org.junit.internal.runners.JUnit38ClassRunner.run(JUnit38ClassRunner.java:86)
     [java] 	at org.junit.runners.Suite.runChild(Suite.java:128)
     [java] 	at org.junit.runners.Suite.runChild(Suite.java:27)
     [java] 	at org.junit.runners.ParentRunner$3.run(ParentRunner.java:290)
     [java] 	at org.junit.runners.ParentRunner$1.schedule(ParentRunner.java:71)
     [java] 	at org.junit.runners.ParentRunner.runChildren(ParentRunner.java:288)
     [java] 	at org.junit.runners.ParentRunner.access$000(ParentRunner.java:58)
     [java] 	at org.junit.runners.ParentRunner$2.evaluate(ParentRunner.java:268)
     [java] 	at org.junit.runners.ParentRunner.run(ParentRunner.java:363)
     [java] 	at org.junit.runner.JUnitCore.run(JUnitCore.java:137)
     [java] 	at org.junit.runner.JUnitCore.run(JUnitCore.java:115)
     [java] 	at org.junit.runner.JUnitCore.run(JUnitCore.java:105)
     [java] 	at org.junit.runner.JUnitCore.run(JUnitCore.java:94)
     [java] 	at org.apache.poi.util.OOXMLLite.build(OOXMLLite.java:149)
     [java] 	at org.apache.poi.util.OOXMLLite.main(OOXMLLite.java:94)
     [java] 147) testMissingWorkbookMissingOverride(org.apache.poi.xssf.usermodel.TestMissingWorkbookOnXSSF)
     [java] java.lang.NoSuchMethodError: java.nio.ByteBuffer.position(I)Ljava/nio/ByteBuffer;
     [java] 	at org.apache.poi.poifs.filesystem.NPOIFSFileSystem.<init>(NPOIFSFileSystem.java:310)
     [java] 	at org.apache.poi.hssf.usermodel.HSSFWorkbook.<init>(HSSFWorkbook.java:413)
     [java] 	at org.apache.poi.hssf.usermodel.HSSFWorkbook.<init>(HSSFWorkbook.java:394)
     [java] 	at org.apache.poi.hssf.HSSFTestDataSamples.openSampleWorkbook(HSSFTestDataSamples.java:50)
     [java] 	at org.apache.poi.xssf.usermodel.TestMissingWorkbookOnXSSF.setUp(TestMissingWorkbookOnXSSF.java:35)
     [java] 	at junit.framework.TestCase.runBare(TestCase.java:139)
     [java] 	at junit.framework.TestResult$1.protect(TestResult.java:122)
     [java] 	at junit.framework.TestResult.runProtected(TestResult.java:142)
     [java] 	at junit.framework.TestResult.run(TestResult.java:125)
     [java] 	at junit.framework.TestCase.run(TestCase.java:129)
     [java] 	at junit.framework.TestSuite.runTest(TestSuite.java:252)
     [java] 	at junit.framework.TestSuite.run(TestSuite.java:247)
     [java] 	at org.junit.internal.runners.JUnit38ClassRunner.run(JUnit38ClassRunner.java:86)
     [java] 	at org.junit.runners.Suite.runChild(Suite.java:128)
     [java] 	at org.junit.runners.Suite.runChild(Suite.java:27)
     [java] 	at org.junit.runners.ParentRunner$3.run(ParentRunner.java:290)
     [java] 	at org.junit.runners.ParentRunner$1.schedule(ParentRunner.java:71)
     [java] 	at org.junit.runners.ParentRunner.runChildren(ParentRunner.java:288)
     [java] 	at org.junit.runners.ParentRunner.access$000(ParentRunner.java:58)
     [java] 	at org.junit.runners.ParentRunner$2.evaluate(ParentRunner.java:268)
     [java] 	at org.junit.runners.ParentRunner.run(ParentRunner.java:363)
     [java] 	at org.junit.runner.JUnitCore.run(JUnitCore.java:137)
     [java] 	at org.junit.runner.JUnitCore.run(JUnitCore.java:115)
     [java] 	at org.junit.runner.JUnitCore.run(JUnitCore.java:105)
     [java] 	at org.junit.runner.JUnitCore.run(JUnitCore.java:94)
     [java] 	at org.apache.poi.util.OOXMLLite.build(OOXMLLite.java:149)
     [java] 	at org.apache.poi.util.OOXMLLite.main(OOXMLLite.java:94)
     [java] 148) testComparedToOLE2(org.apache.poi.xssf.extractor.TestXSSFExcelExtractorUsingFactory)
     [java] java.lang.NoSuchMethodError: java.nio.ByteBuffer.position(I)Ljava/nio/ByteBuffer;
     [java] 	at org.apache.poi.poifs.filesystem.NPOIFSFileSystem.<init>(NPOIFSFileSystem.java:310)
     [java] 	at org.apache.poi.hssf.usermodel.HSSFWorkbook.<init>(HSSFWorkbook.java:413)
     [java] 	at org.apache.poi.hssf.usermodel.HSSFWorkbook.<init>(HSSFWorkbook.java:394)
     [java] 	at org.apache.poi.hssf.HSSFTestDataSamples.openSampleWorkbook(HSSFTestDataSamples.java:50)
     [java] 	at org.apache.poi.xssf.extractor.TestXSSFExcelExtractor.testComparedToOLE2(TestXSSFExcelExtractor.java:134)
     [java] 	at sun.reflect.NativeMethodAccessorImpl.invoke0(Native Method)
     [java] 	at sun.reflect.NativeMethodAccessorImpl.invoke(NativeMethodAccessorImpl.java:62)
     [java] 	at sun.reflect.DelegatingMethodAccessorImpl.invoke(DelegatingMethodAccessorImpl.java:43)
     [java] 	at java.lang.reflect.Method.invoke(Method.java:498)
     [java] 	at junit.framework.TestCase.runTest(TestCase.java:176)
     [java] 	at junit.framework.TestCase.runBare(TestCase.java:141)
     [java] 	at junit.framework.TestResult$1.protect(TestResult.java:122)
     [java] 	at junit.framework.TestResult.runProtected(TestResult.java:142)
     [java] 	at junit.framework.TestResult.run(TestResult.java:125)
     [java] 	at junit.framework.TestCase.run(TestCase.java:129)
     [java] 	at junit.framework.TestSuite.runTest(TestSuite.java:252)
     [java] 	at junit.framework.TestSuite.run(TestSuite.java:247)
     [java] 	at org.junit.internal.runners.JUnit38ClassRunner.run(JUnit38ClassRunner.java:86)
     [java] 	at org.junit.runners.Suite.runChild(Suite.java:128)
     [java] 	at org.junit.runners.Suite.runChild(Suite.java:27)
     [java] 	at org.junit.runners.ParentRunner$3.run(ParentRunner.java:290)
     [java] 	at org.junit.runners.ParentRunner$1.schedule(ParentRunner.java:71)
     [java] 	at org.junit.runners.ParentRunner.runChildren(ParentRunner.java:288)
     [java] 	at org.junit.runners.ParentRunner.access$000(ParentRunner.java:58)
     [java] 	at org.junit.runners.ParentRunner$2.evaluate(ParentRunner.java:268)
     [java] 	at org.junit.runners.ParentRunner.run(ParentRunner.java:363)
     [java] 	at org.junit.runner.JUnitCore.run(JUnitCore.java:137)
     [java] 	at org.junit.runner.JUnitCore.run(JUnitCore.java:115)
     [java] 	at org.junit.runner.JUnitCore.run(JUnitCore.java:105)
     [java] 	at org.junit.runner.JUnitCore.run(JUnitCore.java:94)
     [java] 	at org.apache.poi.util.OOXMLLite.build(OOXMLLite.java:149)
     [java] 	at org.apache.poi.util.OOXMLLite.main(OOXMLLite.java:94)
     [java] 149) testComparedToOLE2(org.apache.poi.xssf.extractor.TestXSSFEventBasedExcelExtractor)
     [java] java.lang.NoSuchMethodError: java.nio.ByteBuffer.position(I)Ljava/nio/ByteBuffer;
     [java] 	at org.apache.poi.poifs.filesystem.NPOIFSFileSystem.<init>(NPOIFSFileSystem.java:310)
     [java] 	at org.apache.poi.hssf.usermodel.HSSFWorkbook.<init>(HSSFWorkbook.java:413)
     [java] 	at org.apache.poi.hssf.usermodel.HSSFWorkbook.<init>(HSSFWorkbook.java:394)
     [java] 	at org.apache.poi.hssf.HSSFTestDataSamples.openSampleWorkbook(HSSFTestDataSamples.java:50)
     [java] 	at org.apache.poi.xssf.extractor.TestXSSFEventBasedExcelExtractor.testComparedToOLE2(TestXSSFEventBasedExcelExtractor.java:165)
     [java] 	at sun.reflect.NativeMethodAccessorImpl.invoke0(Native Method)
     [java] 	at sun.reflect.NativeMethodAccessorImpl.invoke(NativeMethodAccessorImpl.java:62)
     [java] 	at sun.reflect.DelegatingMethodAccessorImpl.invoke(DelegatingMethodAccessorImpl.java:43)
     [java] 	at java.lang.reflect.Method.invoke(Method.java:498)
     [java] 	at org.junit.runners.model.FrameworkMethod$1.runReflectiveCall(FrameworkMethod.java:50)
     [java] 	at org.junit.internal.runners.model.ReflectiveCallable.run(ReflectiveCallable.java:12)
     [java] 	at org.junit.runners.model.FrameworkMethod.invokeExplosively(FrameworkMethod.java:47)
     [java] 	at org.junit.internal.runners.statements.InvokeMethod.evaluate(InvokeMethod.java:17)
     [java] 	at org.junit.runners.ParentRunner.runLeaf(ParentRunner.java:325)
     [java] 	at org.junit.runners.BlockJUnit4ClassRunner.runChild(BlockJUnit4ClassRunner.java:78)
     [java] 	at org.junit.runners.BlockJUnit4ClassRunner.runChild(BlockJUnit4ClassRunner.java:57)
     [java] 	at org.junit.runners.ParentRunner$3.run(ParentRunner.java:290)
     [java] 	at org.junit.runners.ParentRunner$1.schedule(ParentRunner.java:71)
     [java] 	at org.junit.runners.ParentRunner.runChildren(ParentRunner.java:288)
     [java] 	at org.junit.runners.ParentRunner.access$000(ParentRunner.java:58)
     [java] 	at org.junit.runners.ParentRunner$2.evaluate(ParentRunner.java:268)
     [java] 	at org.junit.runners.ParentRunner.run(ParentRunner.java:363)
     [java] 	at org.junit.runners.Suite.runChild(Suite.java:128)
     [java] 	at org.junit.runners.Suite.runChild(Suite.java:27)
     [java] 	at org.junit.runners.ParentRunner$3.run(ParentRunner.java:290)
     [java] 	at org.junit.runners.ParentRunner$1.schedule(ParentRunner.java:71)
     [java] 	at org.junit.runners.ParentRunner.runChildren(ParentRunner.java:288)
     [java] 	at org.junit.runners.ParentRunner.access$000(ParentRunner.java:58)
     [java] 	at org.junit.runners.ParentRunner$2.evaluate(ParentRunner.java:268)
     [java] 	at org.junit.runners.ParentRunner.run(ParentRunner.java:363)
     [java] 	at org.junit.runner.JUnitCore.run(JUnitCore.java:137)
     [java] 	at org.junit.runner.JUnitCore.run(JUnitCore.java:115)
     [java] 	at org.junit.runner.JUnitCore.run(JUnitCore.java:105)
     [java] 	at org.junit.runner.JUnitCore.run(JUnitCore.java:94)
     [java] 	at org.apache.poi.util.OOXMLLite.build(OOXMLLite.java:149)
     [java] 	at org.apache.poi.util.OOXMLLite.main(OOXMLLite.java:94)
     [java] 150) testComparedToOLE2(org.apache.poi.xssf.extractor.TestXSSFExcelExtractor)
     [java] java.lang.NoSuchMethodError: java.nio.ByteBuffer.position(I)Ljava/nio/ByteBuffer;
     [java] 	at org.apache.poi.poifs.filesystem.NPOIFSFileSystem.<init>(NPOIFSFileSystem.java:310)
     [java] 	at org.apache.poi.hssf.usermodel.HSSFWorkbook.<init>(HSSFWorkbook.java:413)
     [java] 	at org.apache.poi.hssf.usermodel.HSSFWorkbook.<init>(HSSFWorkbook.java:394)
     [java] 	at org.apache.poi.hssf.HSSFTestDataSamples.openSampleWorkbook(HSSFTestDataSamples.java:50)
     [java] 	at org.apache.poi.xssf.extractor.TestXSSFExcelExtractor.testComparedToOLE2(TestXSSFExcelExtractor.java:134)
     [java] 	at sun.reflect.NativeMethodAccessorImpl.invoke0(Native Method)
     [java] 	at sun.reflect.NativeMethodAccessorImpl.invoke(NativeMethodAccessorImpl.java:62)
     [java] 	at sun.reflect.DelegatingMethodAccessorImpl.invoke(DelegatingMethodAccessorImpl.java:43)
     [java] 	at java.lang.reflect.Method.invoke(Method.java:498)
     [java] 	at junit.framework.TestCase.runTest(TestCase.java:176)
     [java] 	at junit.framework.TestCase.runBare(TestCase.java:141)
     [java] 	at junit.framework.TestResult$1.protect(TestResult.java:122)
     [java] 	at junit.framework.TestResult.runProtected(TestResult.java:142)
     [java] 	at junit.framework.TestResult.run(TestResult.java:125)
     [java] 	at junit.framework.TestCase.run(TestCase.java:129)
     [java] 	at junit.framework.TestSuite.runTest(TestSuite.java:252)
     [java] 	at junit.framework.TestSuite.run(TestSuite.java:247)
     [java] 	at org.junit.internal.runners.JUnit38ClassRunner.run(JUnit38ClassRunner.java:86)
     [java] 	at org.junit.runners.Suite.runChild(Suite.java:128)
     [java] 	at org.junit.runners.Suite.runChild(Suite.java:27)
     [java] 	at org.junit.runners.ParentRunner$3.run(ParentRunner.java:290)
     [java] 	at org.junit.runners.ParentRunner$1.schedule(ParentRunner.java:71)
     [java] 	at org.junit.runners.ParentRunner.runChildren(ParentRunner.java:288)
     [java] 	at org.junit.runners.ParentRunner.access$000(ParentRunner.java:58)
     [java] 	at org.junit.runners.ParentRunner$2.evaluate(ParentRunner.java:268)
     [java] 	at org.junit.runners.ParentRunner.run(ParentRunner.java:363)
     [java] 	at org.junit.runner.JUnitCore.run(JUnitCore.java:137)
     [java] 	at org.junit.runner.JUnitCore.run(JUnitCore.java:115)
     [java] 	at org.junit.runner.JUnitCore.run(JUnitCore.java:105)
     [java] 	at org.junit.runner.JUnitCore.run(JUnitCore.java:94)
     [java] 	at org.apache.poi.util.OOXMLLite.build(OOXMLLite.java:149)
     [java] 	at org.apache.poi.util.OOXMLLite.main(OOXMLLite.java:94)
     [java] 151) testComparedToOLE2(org.apache.poi.xssf.extractor.TestXSSFEventBasedExcelExtractorUsingFactory)
     [java] java.lang.NoSuchMethodError: java.nio.ByteBuffer.position(I)Ljava/nio/ByteBuffer;
     [java] 	at org.apache.poi.poifs.filesystem.NPOIFSFileSystem.<init>(NPOIFSFileSystem.java:310)
     [java] 	at org.apache.poi.hssf.usermodel.HSSFWorkbook.<init>(HSSFWorkbook.java:413)
     [java] 	at org.apache.poi.hssf.usermodel.HSSFWorkbook.<init>(HSSFWorkbook.java:394)
     [java] 	at org.apache.poi.hssf.HSSFTestDataSamples.openSampleWorkbook(HSSFTestDataSamples.java:50)
     [java] 	at org.apache.poi.xssf.extractor.TestXSSFEventBasedExcelExtractor.testComparedToOLE2(TestXSSFEventBasedExcelExtractor.java:165)
     [java] 	at sun.reflect.NativeMethodAccessorImpl.invoke0(Native Method)
     [java] 	at sun.reflect.NativeMethodAccessorImpl.invoke(NativeMethodAccessorImpl.java:62)
     [java] 	at sun.reflect.DelegatingMethodAccessorImpl.invoke(DelegatingMethodAccessorImpl.java:43)
     [java] 	at java.lang.reflect.Method.invoke(Method.java:498)
     [java] 	at org.junit.runners.model.FrameworkMethod$1.runReflectiveCall(FrameworkMethod.java:50)
     [java] 	at org.junit.internal.runners.model.ReflectiveCallable.run(ReflectiveCallable.java:12)
     [java] 	at org.junit.runners.model.FrameworkMethod.invokeExplosively(FrameworkMethod.java:47)
     [java] 	at org.junit.internal.runners.statements.InvokeMethod.evaluate(InvokeMethod.java:17)
     [java] 	at org.junit.internal.runners.statements.RunAfters.evaluate(RunAfters.java:27)
     [java] 	at org.junit.runners.ParentRunner.runLeaf(ParentRunner.java:325)
     [java] 	at org.junit.runners.BlockJUnit4ClassRunner.runChild(BlockJUnit4ClassRunner.java:78)
     [java] 	at org.junit.runners.BlockJUnit4ClassRunner.runChild(BlockJUnit4ClassRunner.java:57)
     [java] 	at org.junit.runners.ParentRunner$3.run(ParentRunner.java:290)
     [java] 	at org.junit.runners.ParentRunner$1.schedule(ParentRunner.java:71)
     [java] 	at org.junit.runners.ParentRunner.runChildren(ParentRunner.java:288)
     [java] 	at org.junit.runners.ParentRunner.access$000(ParentRunner.java:58)
     [java] 	at org.junit.runners.ParentRunner$2.evaluate(ParentRunner.java:268)
     [java] 	at org.junit.runners.ParentRunner.run(ParentRunner.java:363)
     [java] 	at org.junit.runners.Suite.runChild(Suite.java:128)
     [java] 	at org.junit.runners.Suite.runChild(Suite.java:27)
     [java] 	at org.junit.runners.ParentRunner$3.run(ParentRunner.java:290)
     [java] 	at org.junit.runners.ParentRunner$1.schedule(ParentRunner.java:71)
     [java] 	at org.junit.runners.ParentRunner.runChildren(ParentRunner.java:288)
     [java] 	at org.junit.runners.ParentRunner.access$000(ParentRunner.java:58)
     [java] 	at org.junit.runners.ParentRunner$2.evaluate(ParentRunner.java:268)
     [java] 	at org.junit.runners.ParentRunner.run(ParentRunner.java:363)
     [java] 	at org.junit.runner.JUnitCore.run(JUnitCore.java:137)
     [java] 	at org.junit.runner.JUnitCore.run(JUnitCore.java:115)
     [java] 	at org.junit.runner.JUnitCore.run(JUnitCore.java:105)
     [java] 	at org.junit.runner.JUnitCore.run(JUnitCore.java:94)
     [java] 	at org.apache.poi.util.OOXMLLite.build(OOXMLLite.java:149)
     [java] 	at org.apache.poi.util.OOXMLLite.main(OOXMLLite.java:94)
     [java] 
     [java] FAILURES!!!
     [java] Tests run: 2285,  Failures: 151
     [java] 
     [java] Exception in thread "main" java.lang.RuntimeException: Tests did not succeed,
cannot build ooxml-lite jar
     [java] 	at org.apache.poi.util.OOXMLLite.build(OOXMLLite.java:151)
     [java] 	at org.apache.poi.util.OOXMLLite.main(OOXMLLite.java:94)

BUILD FAILED
<https://builds.apache.org/job/POI-DSL-OpenJDK/ws/build.xml>:1678: Java returned: 1

Total time: 2 minutes 37 seconds
Build step 'Invoke Ant' marked build as failure
[FINDBUGS] Skipping publisher since build result is FAILURE
Archiving artifacts
[Fast Archiver] Compressed 66.30 MB of artifacts by 65.1% relative to #249
[WARNINGS] Skipping publisher since build result is FAILURE
Recording test results
ERROR: Step ?Publish JUnit test result report? failed: No test report files were found. Configuration
error?


---------------------------------------------------------------------
To unsubscribe, e-mail: dev-unsubscribe@poi.apache.org
For additional commands, e-mail: dev-help@poi.apache.org


Mime
View raw message