poi-dev mailing list archives

Site index · List index
Message view « Date » · « Thread »
Top « Date » · « Thread »
From Apache Jenkins Server <jenk...@builds.apache.org>
Subject Build failed in Jenkins: POI-DSL-1.9 #57
Date Mon, 18 Sep 2017 20:55:11 GMT
See <https://builds.apache.org/job/POI-DSL-1.9/57/display/redirect>

------------------------------------------
[...truncated 982.10 KB...]
 [findbugs]   java.util.zip.GZIPOutputStream
 [findbugs]   java.util.EnumSet
 [findbugs]   java.io.BufferedOutputStream
 [findbugs]   javax.xml.crypto.dom.DOMStructure
 [findbugs]   javax.security.auth.x500.X500Principal
 [findbugs]   java.net.Proxy
 [findbugs]   java.net.Proxy$Type
 [findbugs]   java.net.URL
 [findbugs]   java.net.InetAddress
 [findbugs]   java.net.InetSocketAddress
 [findbugs]   java.net.HttpURLConnection
 [findbugs]   java.lang.CloneNotSupportedException
 [findbugs]   java.awt.Stroke
 [findbugs]   java.awt.image.BufferedImageOp
 [findbugs]   java.awt.Composite
 [findbugs]   java.awt.font.GlyphVector
 [findbugs]   java.awt.image.RenderedImage
 [findbugs]   java.awt.image.renderable.RenderableImage
 [findbugs]   java.awt.geom.GeneralPath
 [findbugs]   java.awt.Polygon
 [findbugs]   java.awt.GraphicsEnvironment
 [findbugs]   java.awt.GraphicsDevice
 [findbugs]   java.util.Deque
 [findbugs]   java.util.concurrent.locks.ReentrantReadWriteLock
 [findbugs]   java.util.concurrent.locks.ReentrantReadWriteLock$WriteLock
 [findbugs]   javax.crypto.CipherInputStream
 [findbugs]   java.lang.IllegalAccessError
 [findbugs]   java.util.SortedSet
 [findbugs]   java.awt.image.RescaleOp
 [findbugs]   java.lang.Error
 [findbugs]   java.lang.CharSequence
 [findbugs]   java.nio.BufferUnderflowException
 [findbugs]   java.util.LinkedHashSet
 [findbugs]   javax.xml.xpath.XPathConstants
 [findbugs]   java.io.StringReader
 [findbugs]   javax.xml.xpath.XPathFactory
 [findbugs]   javax.xml.xpath.XPath
 [findbugs]   java.util.Vector
 [findbugs]   java.io.EOFException
 [findbugs]   java.util.concurrent.TimeUnit
 [findbugs]   java.io.UnsupportedEncodingException
 [findbugs]   java.nio.charset.CharsetEncoder
 [findbugs]   java.util.zip.DeflaterOutputStream
 [findbugs]   javax.xml.crypto.dsig.XMLSignatureException
 [findbugs]   java.text.NumberFormat
 [findbugs]   javax.xml.stream.events.XMLEvent
 [findbugs]   java.lang.StringIndexOutOfBoundsException
 [findbugs]   javax.xml.crypto.KeySelector$Purpose
 [findbugs]   javax.xml.crypto.AlgorithmMethod
 [findbugs]   javax.xml.crypto.KeySelectorException
 [findbugs]   javax.xml.crypto.dsig.keyinfo.KeyInfo
 [findbugs]   javax.xml.crypto.dsig.keyinfo.X509Data
 [findbugs]   java.io.InvalidObjectException
 [findbugs]   java.security.KeyPair
 [findbugs]   java.nio.channels.FileChannel$MapMode
 [findbugs]   java.io.RandomAccessFile
 [findbugs]   java.nio.channels.FileChannel
 [findbugs]   java.nio.channels.Channels
 [findbugs]   java.security.AccessController
 [findbugs]   java.lang.reflect.Array
 [findbugs]   org.xml.sax.SAXParseException
 [findbugs]   javax.xml.validation.SchemaFactory
 [findbugs]   javax.xml.validation.Schema
 [findbugs]   javax.xml.validation.Validator
 [findbugs]   java.net.URISyntaxException
 [findbugs]   javax.xml.xpath.XPathExpression
 [findbugs]   javax.xml.crypto.dsig.dom.DOMValidateContext
 [findbugs]   javax.xml.crypto.dsig.XMLSignature
 [findbugs]   javax.xml.crypto.dsig.SignedInfo
 [findbugs]   javax.xml.crypto.dsig.XMLObject
 [findbugs]   javax.xml.crypto.dsig.Manifest
 [findbugs]   java.security.KeyException
 [findbugs]   javax.xml.crypto.dsig.dom.DOMSignContext
 [findbugs]   javax.xml.crypto.dsig.Reference
 [findbugs]   javax.xml.crypto.dsig.DigestMethod
 [findbugs]   javax.xml.bind.JAXBElement
 [findbugs]   java.awt.geom.RoundRectangle2D$Float
 [findbugs]   java.awt.geom.Ellipse2D$Float
 [findbugs]   java.awt.geom.Arc2D$Float
 [findbugs]   java.awt.geom.Line2D$Float
 [findbugs]   java.nio.channels.ReadableByteChannel
 [findbugs]   javax.xml.stream.XMLEventFactory
 [findbugs]   javax.xml.parsers.SAXParserFactory
 [findbugs]   javax.xml.parsers.SAXParser
 [findbugs]   java.util.jar.JarFile
 [findbugs]   java.util.jar.JarEntry
 [findbugs]   java.security.ProtectionDomain
 [findbugs]   java.security.CodeSource
 [findbugs]   javax.xml.stream.XMLInputFactory
 [findbugs]   javax.xml.stream.XMLEventReader
 [findbugs]   javax.xml.bind.JAXBContext
 [findbugs]   javax.xml.stream.events.StartElement
 [findbugs]   javax.xml.bind.Unmarshaller
 [findbugs]   java.security.InvalidAlgorithmParameterException
 [findbugs]   javax.xml.crypto.dsig.TransformException
 [findbugs]   javax.xml.crypto.dsig.XMLSignContext
 [findbugs]   javax.xml.crypto.dsig.XMLValidateContext
 [findbugs]   java.awt.geom.Line2D
 [findbugs]   java.io.DataInputStream
 [findbugs]   java.io.LineNumberReader
 [findbugs]   javax.imageio.stream.MemoryCacheImageInputStream
 [findbugs]   javax.imageio.ImageTypeSpecifier
 [findbugs]   javax.imageio.ImageReadParam
 [findbugs]   java.awt.image.AffineTransformOp
 [findbugs]   javax.xml.stream.XMLOutputFactory
 [findbugs]   java.util.zip.CRC32
 [findbugs]   java.util.zip.Checksum
 [findbugs]   java.lang.NoSuchFieldError
 [findbugs]   java.lang.NegativeArraySizeException
 [findbugs]   java.lang.UnsatisfiedLinkError
 [findbugs]   java.lang.NoSuchMethodError
 [findbugs]   java.lang.IncompatibleClassChangeError
 [findbugs]   java.lang.AbstractMethodError
 [findbugs]   java.awt.MultipleGradientPaint
 [findbugs]   java.lang.ClassFormatError
 [findbugs]   java.lang.VerifyError
 [findbugs]   java.lang.ExceptionInInitializerError
 [findbugs]   java.lang.NoSuchFieldException
 [findbugs]   java.lang.NoSuchMethodException
 [findbugs]   java.lang.NoClassDefFoundError
 [findbugs]   java.util.zip.Deflater
 [findbugs]   java.text.CharacterIterator
 [findbugs]   javax.xml.XMLConstants
 [findbugs]   java.awt.geom.Ellipse2D
 [findbugs]   javax.xml.crypto.XMLStructure
 [findbugs]   java.awt.geom.Arc2D
 [findbugs]   java.awt.Transparency
 [findbugs]   javax.xml.transform.TransformerException
 [findbugs]   javax.xml.transform.OutputKeys
 [findbugs]   java.nio.charset.UnsupportedCharsetException
 [findbugs]   java.security.DigestException
 [findbugs]   java.util.zip.ZipException
 [findbugs]   java.nio.MappedByteBuffer
 [findbugs]   javax.xml.bind.JAXBException
 [findbugs]   java.security.AccessControlException
 [findbugs]   javax.xml.crypto.dsig.spec.C14NMethodParameterSpec
 [findbugs]   javax.xml.xpath.XPathExpressionException
 [findbugs]   java.text.ParseException
 [findbugs]   org.xml.sax.ContentHandler
 [findbugs]   java.awt.geom.RoundRectangle2D
 [findbugs]   javax.xml.crypto.Data
 [findbugs]   javax.crypto.ShortBufferException
 [findbugs] Warnings generated: 43
 [findbugs] Missing classes: 366
 [findbugs] Calculating exit code...
 [findbugs] Setting 'missing class' flag (2)
 [findbugs] Setting 'bugs found' flag (1)
 [findbugs] Exit code set to: 3
 [findbugs] Java Result: 3
 [findbugs] Classes needed for analysis were missing
 [findbugs] Output saved to build/findbugs.xml
     [xslt] Transforming into <https://builds.apache.org/job/POI-DSL-1.9/ws/build>
     [xslt] Processing <https://builds.apache.org/job/POI-DSL-1.9/ws/build/findbugs.xml>
to <https://builds.apache.org/job/POI-DSL-1.9/57/artifact/build/findbugs.html>
     [xslt] Loading stylesheet jar:<https://builds.apache.org/job/POI-DSL-1.9/ws/build/findbugs/lib/findbugs.jar!/fancy-hist.xsl>

release-notes:
     [copy] Copying 1 file to <https://builds.apache.org/job/POI-DSL-1.9/ws/build/dist>

rat-check:
    [mkdir] Created dir: <https://builds.apache.org/job/POI-DSL-1.9/ws/build/rat>
     [echo] 
     [echo] *****************************************************
     [echo] Summary
     [echo] -------
     [echo] Generated at: 2017-09-18T20:52:35+00:00
     [echo] 
     [echo] Notes: 1
     [echo] Binaries: 119
     [echo] Archives: 0
     [echo] Standards: 3600
     [echo] 
     [echo] Apache Licensed: 3600
     [echo] Generated Documents: 0
     [echo] 
     [echo] JavaDocs are generated, thus a license header is optional.
     [echo] Generated files do not require license headers.
     [echo] 
     [echo] 0 Unknown Licenses
     [echo] 
     [echo] *****************************************************
     [echo]   Files with Apache License headers will be marked AL
     [echo]   Binary files (which do not require any license headers) will be marked B
     [echo]   Compressed archives will be marked A
     [echo]   Notices, licenses etc. will be marked N
     [echo]  
     [echo] *****************************************************

forbidden-apis-check:
[forbiddenapis] Reading bundled API signatures: jdk-unsafe-1.8
[forbiddenapis] Reading bundled API signatures: jdk-deprecated-1.8
[forbiddenapis] Reading bundled API signatures: jdk-internal-1.8
[forbiddenapis] Reading bundled API signatures: jdk-non-portable
[forbiddenapis] Reading bundled API signatures: jdk-reflection
[forbiddenapis] Reading API signatures: <https://builds.apache.org/job/POI-DSL-1.9/ws/src/resources/devtools/forbidden-signatures.txt>
[forbiddenapis] Loading classes to check...
[forbiddenapis] Scanning classes for violations...
[forbiddenapis] Scanned 3984 (and 1851 related) class file(s) for forbidden API invocations
(in 10.31s), 0 error(s).
[forbiddenapis] Reading API signatures: <https://builds.apache.org/job/POI-DSL-1.9/ws/src/resources/devtools/forbidden-signatures-prod.txt>
[forbiddenapis] Loading classes to check...
[forbiddenapis] Scanning classes for violations...
[forbiddenapis] Scanned 3090 (and 1445 related) class file(s) for forbidden API invocations
(in 1.56s), 0 error(s).

jenkins:

BUILD SUCCESSFUL
Total time: 26 minutes 25 seconds
[integrationtest] $ /home/jenkins/tools/ant/apache-ant-1.9.9/bin/ant -file build.xml run -Djava9addmods=--add-modules=java.xml.bind
-Djavadoc9addmods=--add-modules=java.xml.bind -Djava9addmodsvalue=-Dsun.reflect.debugModuleAccessChecks=true
-Djava9addopens1=--add-opens=java.xml/com.sun.org.apache.xerces.internal.util=ALL-UNNAMED
-Djava9addopens2=--add-opens=java.base/java.io=ALL-UNNAMED -Djava9addopens3=--add-opens=java.base/java.nio=ALL-UNNAMED
-Djava9addopens4=--add-opens=java.base/java.lang=ALL-UNNAMED -Djava9addopens5=--add-opens=java.base/jdk.internal.ref=ALL-UNNAMED
-Djava.locale.providers=JRE,CLDR
Buildfile: <https://builds.apache.org/job/POI-DSL-1.9/ws/src/integrationtest/build.xml>

init:

runSourceBuild:
    [mkdir] Created dir: <https://builds.apache.org/job/POI-DSL-1.9/ws/build/distsourcebuild>
     [echo] Found source package at <https://builds.apache.org/job/POI-DSL-1.9/ws/build/dist/poi-src-4.0.0-SNAPSHOT-20170918.zip>
    [unzip] Expanding: <https://builds.apache.org/job/POI-DSL-1.9/ws/build/dist/poi-src-4.0.0-SNAPSHOT-20170918.zip>
into <https://builds.apache.org/job/POI-DSL-1.9/ws/build/distsourcebuild>

BUILD FAILED
<https://builds.apache.org/job/POI-DSL-1.9/ws/src/integrationtest/build.xml>:55: Error
while expanding <https://builds.apache.org/job/POI-DSL-1.9/ws/build/dist/poi-src-4.0.0-SNAPSHOT-20170918.zip>
java.io.IOException: No space left on device
	at java.base/java.io.FileOutputStream.writeBytes(Native Method)
	at java.base/java.io.FileOutputStream.write(FileOutputStream.java:332)
	at org.apache.tools.ant.taskdefs.Expand.extractFile(Expand.java:359)
	at org.apache.tools.ant.taskdefs.Expand.expandFile(Expand.java:193)
	at org.apache.tools.ant.taskdefs.Expand.execute(Expand.java:148)
	at org.apache.tools.ant.UnknownElement.execute(UnknownElement.java:293)
	at java.base/jdk.internal.reflect.NativeMethodAccessorImpl.invoke0(Native Method)
	at java.base/jdk.internal.reflect.NativeMethodAccessorImpl.invoke(NativeMethodAccessorImpl.java:62)
	at java.base/jdk.internal.reflect.DelegatingMethodAccessorImpl.invoke(DelegatingMethodAccessorImpl.java:43)
	at java.base/java.lang.reflect.Method.invoke(Method.java:564)
	at org.apache.tools.ant.dispatch.DispatchUtils.execute(DispatchUtils.java:106)
	at org.apache.tools.ant.Task.perform(Task.java:348)
	at org.apache.tools.ant.Target.execute(Target.java:435)
	at org.apache.tools.ant.Target.performTasks(Target.java:456)
	at org.apache.tools.ant.Project.executeSortedTargets(Project.java:1405)
	at org.apache.tools.ant.Project.executeTarget(Project.java:1376)
	at org.apache.tools.ant.helper.DefaultExecutor.executeTargets(DefaultExecutor.java:41)
	at org.apache.tools.ant.Project.executeTargets(Project.java:1260)
	at org.apache.tools.ant.Main.runBuild(Main.java:857)
	at org.apache.tools.ant.Main.startAnt(Main.java:236)
	at org.apache.tools.ant.launch.Launcher.run(Launcher.java:287)
	at org.apache.tools.ant.launch.Launcher.main(Launcher.java:113)

Total time: 3 seconds
Build step 'Invoke Ant' marked build as failure
Skipping publisher since build result is FAILURE
Archiving artifacts
[Fast Archiver] Compressed 235.69 MB of artifacts by 37.6% relative to #55
Skipping publisher since build result is FAILURE
Recording test results

---------------------------------------------------------------------
To unsubscribe, e-mail: dev-unsubscribe@poi.apache.org
For additional commands, e-mail: dev-help@poi.apache.org


Mime
View raw message