poi-dev mailing list archives

Site index · List index
Message view « Date » · « Thread »
Top « Date » · « Thread »
From Apache Jenkins Server <jenk...@builds.apache.org>
Subject Build failed in Jenkins: POI-DSL-OpenJDK #198
Date Sun, 09 Jul 2017 12:42:06 GMT
See <https://builds.apache.org/job/POI-DSL-OpenJDK/198/display/redirect?page=changes>

Changes:

[kiwiwings] SL Common: narrow generics definition because of tighter java9 checks

------------------------------------------
Started by an SCM change
[EnvInject] - Loading node environment variables.
[EnvInject] - Preparing an environment for the build.
[EnvInject] - Keeping Jenkins system variables.
[EnvInject] - Keeping Jenkins build variables.
[EnvInject] - Injecting as environment variables the properties content 
LANG=en_US.UTF-8

[EnvInject] - Variables injected successfully.
[EnvInject] - Injecting contributions.
Building remotely on ubuntu-6 (ubuntu trusty) in workspace <https://builds.apache.org/job/POI-DSL-OpenJDK/ws/>
Updating https://svn.apache.org/repos/asf/poi/trunk at revision '2017-07-09T12:40:11.470 +0000'
AU        test-data/slideshow/mona.ttf
U         src/integrationtest/org/apache/poi/TestAllFiles.java
U         src/scratchpad/src/org/apache/poi/hslf/usermodel/HSLFTextShape.java
U         src/ooxml/testcases/org/apache/poi/sl/TestTable.java
AU        src/ooxml/testcases/org/apache/poi/sl/SLCommonUtils.java
AU        src/ooxml/testcases/org/apache/poi/sl/TestFonts.java
U         src/ooxml/testcases/org/apache/poi/sl/TestHeadersFooters.java
U         src/ooxml/java/org/apache/poi/xslf/usermodel/XSLFTextShape.java
U         src/ooxml/java/org/apache/poi/xslf/usermodel/XSLFTextRun.java
AU        src/testcases/org/apache/poi/ss/formula/functions/TestMultiOperandNumericFunction.java
U         src/java/org/apache/poi/sl/draw/DrawTextShape.java
U         src/java/org/apache/poi/sl/usermodel/Background.java
U         src/java/org/apache/poi/sl/usermodel/MasterSheet.java
U         src/java/org/apache/poi/sl/usermodel/AutoShape.java
U         src/java/org/apache/poi/sl/usermodel/TextBox.java
U         src/java/org/apache/poi/sl/usermodel/Slide.java
U         src/java/org/apache/poi/sl/usermodel/Shape.java
U         src/java/org/apache/poi/sl/usermodel/SlideShow.java
U         src/java/org/apache/poi/sl/usermodel/GraphicalFrame.java
U         src/java/org/apache/poi/sl/usermodel/GroupShape.java
U         src/java/org/apache/poi/sl/usermodel/Shadow.java
U         src/java/org/apache/poi/sl/usermodel/FreeformShape.java
U         src/java/org/apache/poi/sl/usermodel/Line.java
U         src/java/org/apache/poi/sl/usermodel/TableCell.java
U         src/java/org/apache/poi/sl/usermodel/Notes.java
U         src/java/org/apache/poi/sl/usermodel/PlaceableShape.java
U         src/java/org/apache/poi/sl/usermodel/PictureShape.java
U         src/java/org/apache/poi/sl/usermodel/ShapeContainer.java
U         src/java/org/apache/poi/sl/usermodel/TextShape.java
U         src/java/org/apache/poi/sl/usermodel/Hyperlink.java
U         src/java/org/apache/poi/sl/usermodel/TableShape.java
U         src/java/org/apache/poi/sl/usermodel/Sheet.java
U         src/java/org/apache/poi/sl/usermodel/SimpleShape.java
U         src/java/org/apache/poi/sl/usermodel/ConnectorShape.java
U         build.xml
Fetching 'https://svn.apache.org/repos/asf/poi/site/forrest.properties' at -1 into '<https://builds.apache.org/job/POI-DSL-OpenJDK/ws/forrest.properties'>
At revision 1801372

Fetching 'https://svn.apache.org/repos/asf/poi/site/src/documentation' at -1 into '<https://builds.apache.org/job/POI-DSL-OpenJDK/ws/src/documentation'>
At revision 1801372

At revision 1801372

No changes for https://svn.apache.org/repos/asf/poi/site/forrest.properties since the previous
build
No changes for https://svn.apache.org/repos/asf/poi/site/src/documentation since the previous
build
[POI-DSL-OpenJDK] $ /bin/bash -xe /tmp/hudson7478656662678654193.sh
+ svn status
    X   forrest.properties
X       src/documentation

Performing status on external item at 'src/documentation':
+ echo Java-Home: /usr/lib/jvm/java-6-openjdk-amd64/
Java-Home: /usr/lib/jvm/java-6-openjdk-amd64/
+ ls -al /usr/lib/jvm/java-6-openjdk-amd64//
total 28
drwxr-xr-x 7 root root 4096 Feb 16 06:31 .
drwxr-xr-x 6 root root 4096 May 19 06:53 ..
lrwxrwxrwx 1 root root   22 Feb 14 18:06 ASSEMBLY_EXCEPTION -> jre/ASSEMBLY_EXCEPTION
drwxr-xr-x 2 root root 4096 Feb 16 06:31 bin
lrwxrwxrwx 1 root root   41 Oct 15  2014 docs -> ../../../share/doc/openjdk-6-jre-headless
drwxr-xr-x 3 root root 4096 Feb 16 06:31 include
drwxr-xr-x 5 root root 4096 Feb 16 06:31 jre
drwxr-xr-x 3 root root 4096 Feb 16 06:31 lib
drwxr-xr-x 4 root root 4096 Nov  8  2014 man
lrwxrwxrwx 1 root root   32 Feb 14 18:06 src.zip -> ../java-6-openjdk-common/src.zip
lrwxrwxrwx 1 root root   22 Feb 14 18:06 THIRD_PARTY_README -> jre/THIRD_PARTY_README
+ exit 0
[POI-DSL-OpenJDK] $ /home/jenkins/tools/ant/apache-ant-1.9.9/bin/ant -Dcoverage.enabled=true
clean jenkins
Buildfile: <https://builds.apache.org/job/POI-DSL-OpenJDK/ws/build.xml>

clean:
   [delete] Deleting directory <https://builds.apache.org/job/POI-DSL-OpenJDK/ws/build>

check-jars:

fetch-jars:

check-ooxml-jars:

fetch-ooxml-jars:

init:
    [mkdir] Created dir: <https://builds.apache.org/job/POI-DSL-OpenJDK/ws/build>
    [mkdir] Created dir: <https://builds.apache.org/job/POI-DSL-OpenJDK/ws/build/classes>
    [mkdir] Created dir: <https://builds.apache.org/job/POI-DSL-OpenJDK/ws/build/test-classes>
    [mkdir] Created dir: <https://builds.apache.org/job/POI-DSL-OpenJDK/ws/build/test-results>
    [mkdir] Created dir: <https://builds.apache.org/job/POI-DSL-OpenJDK/ws/build/scratchpad-classes>
    [mkdir] Created dir: <https://builds.apache.org/job/POI-DSL-OpenJDK/ws/build/scratchpad-test-classes>
    [mkdir] Created dir: <https://builds.apache.org/job/POI-DSL-OpenJDK/ws/build/scratchpad-test-results>
    [mkdir] Created dir: <https://builds.apache.org/job/POI-DSL-OpenJDK/ws/build/geometry-java>
    [mkdir] Created dir: <https://builds.apache.org/job/POI-DSL-OpenJDK/ws/build/ooxml-classes>
    [mkdir] Created dir: <https://builds.apache.org/job/POI-DSL-OpenJDK/ws/build/ooxml-test-classes>
    [mkdir] Created dir: <https://builds.apache.org/job/POI-DSL-OpenJDK/ws/build/ooxml-test-results>
    [mkdir] Created dir: <https://builds.apache.org/job/POI-DSL-OpenJDK/ws/build/excelant-classes>
    [mkdir] Created dir: <https://builds.apache.org/job/POI-DSL-OpenJDK/ws/build/excelant-test-classes>
    [mkdir] Created dir: <https://builds.apache.org/job/POI-DSL-OpenJDK/ws/build/excelant-test-results>
    [mkdir] Created dir: <https://builds.apache.org/job/POI-DSL-OpenJDK/ws/build/examples-classes>
    [mkdir] Created dir: <https://builds.apache.org/job/POI-DSL-OpenJDK/ws/build/integration-test-classes>
    [mkdir] Created dir: <https://builds.apache.org/job/POI-DSL-OpenJDK/198/artifact/build/integration-test-results>
    [mkdir] Created dir: <https://builds.apache.org/job/POI-DSL-OpenJDK/ws/build/dist>
    [mkdir] Created dir: <https://builds.apache.org/job/POI-DSL-OpenJDK/ws/build/tmp/site/build/site>
     [echo] Using Ant: Apache Ant(TM) version 1.9.9 compiled on February 2 2017 from /home/jenkins/tools/ant/apache-ant-1.9.9,
Ant detected Java 1.6 (may be different than actual Java sometimes...)
     [echo] Using Java: 1.6.0_41/1.6.0_41-b41/23.41-b41/OpenJDK 64-Bit Server VM from Sun
Microsystems Inc. on Linux: 3.13.0-108-generic
     [echo] Using Findbugs: 2.0.3 for Java 1.6.0_41

compile-main:
    [javac] Compiling 1196 source files to <https://builds.apache.org/job/POI-DSL-OpenJDK/ws/build/classes>
    [javac] <https://builds.apache.org/job/POI-DSL-OpenJDK/ws/src/java/org/apache/poi/sl/usermodel/Shape.java>:25:
type parameter P is not within its bound
    [javac]     P extends TextParagraph<S,P,? extends TextRun>
    [javac]                               ^
    [javac] <https://builds.apache.org/job/POI-DSL-OpenJDK/ws/src/java/org/apache/poi/sl/usermodel/TextShape.java>:26:
type parameter P is not within its bound
    [javac]     P extends TextParagraph<S,P,? extends TextRun>
    [javac]                               ^
    [javac] <https://builds.apache.org/job/POI-DSL-OpenJDK/ws/src/java/org/apache/poi/sl/usermodel/SimpleShape.java>:28:
type parameter P is not within its bound
    [javac]     P extends TextParagraph<S,P,? extends TextRun>
    [javac]                               ^
    [javac] <https://builds.apache.org/job/POI-DSL-OpenJDK/ws/src/java/org/apache/poi/sl/usermodel/PlaceableShape.java>:24:
type parameter P is not within its bound
    [javac]     P extends TextParagraph<S,P,? extends TextRun>
    [javac]                               ^
    [javac] <https://builds.apache.org/job/POI-DSL-OpenJDK/ws/src/java/org/apache/poi/sl/usermodel/AutoShape.java>:22:
type parameter P is not within its bound
    [javac]     P extends TextParagraph<S,P,? extends TextRun>
    [javac]                               ^
    [javac] <https://builds.apache.org/job/POI-DSL-OpenJDK/ws/src/java/org/apache/poi/sl/usermodel/ShapeContainer.java>:25:
type parameter P is not within its bound
    [javac]     P extends TextParagraph<S,P,? extends TextRun>
    [javac]                               ^
    [javac] <https://builds.apache.org/job/POI-DSL-OpenJDK/ws/src/java/org/apache/poi/sl/usermodel/Sheet.java>:28:
type parameter P is not within its bound
    [javac]     P extends TextParagraph<S,P,? extends TextRun>
    [javac]                               ^
    [javac] <https://builds.apache.org/job/POI-DSL-OpenJDK/ws/src/java/org/apache/poi/sl/usermodel/Hyperlink.java>:26:
type parameter P is not within its bound
    [javac]     P extends TextParagraph<S,P,? extends TextRun>
    [javac]                               ^
    [javac] <https://builds.apache.org/job/POI-DSL-OpenJDK/ws/src/java/org/apache/poi/sl/usermodel/Shadow.java>:26:
type parameter P is not within its bound
    [javac] P extends TextParagraph<S,P,? extends TextRun>
    [javac]                           ^
    [javac] <https://builds.apache.org/job/POI-DSL-OpenJDK/ws/src/java/org/apache/poi/sl/usermodel/FreeformShape.java>:24:
type parameter P is not within its bound
    [javac]     P extends TextParagraph<S,P,? extends TextRun>
    [javac]                               ^
    [javac] <https://builds.apache.org/job/POI-DSL-OpenJDK/ws/src/java/org/apache/poi/sl/usermodel/TextBox.java>:29:
type parameter P is not within its bound
    [javac]     P extends TextParagraph<S,P,? extends TextRun>
    [javac]                               ^
    [javac] <https://builds.apache.org/job/POI-DSL-OpenJDK/ws/src/java/org/apache/poi/sl/usermodel/ConnectorShape.java>:22:
type parameter P is not within its bound
    [javac]     P extends TextParagraph<S,P,? extends TextRun>
    [javac]                               ^
    [javac] <https://builds.apache.org/job/POI-DSL-OpenJDK/ws/src/java/org/apache/poi/sl/usermodel/GroupShape.java>:24:
type parameter P is not within its bound
    [javac]     P extends TextParagraph<S,P,? extends TextRun>
    [javac]                               ^
    [javac] <https://builds.apache.org/job/POI-DSL-OpenJDK/ws/src/java/org/apache/poi/sl/usermodel/PictureShape.java>:24:
type parameter P is not within its bound
    [javac]     P extends TextParagraph<S,P,? extends TextRun>
    [javac]                               ^
    [javac] <https://builds.apache.org/job/POI-DSL-OpenJDK/ws/src/java/org/apache/poi/sl/usermodel/TableShape.java>:22:
type parameter P is not within its bound
    [javac]     P extends TextParagraph<S,P,? extends TextRun>
    [javac]                               ^
    [javac] <https://builds.apache.org/job/POI-DSL-OpenJDK/ws/src/java/org/apache/poi/sl/usermodel/SlideShow.java>:32:
type parameter P is not within its bound
    [javac]     P extends TextParagraph<S,P,? extends TextRun>
    [javac]                               ^
    [javac] <https://builds.apache.org/job/POI-DSL-OpenJDK/ws/src/java/org/apache/poi/sl/usermodel/MasterSheet.java>:22:
type parameter P is not within its bound
    [javac]     P extends TextParagraph<S,P,? extends TextRun>
    [javac]                               ^
    [javac] <https://builds.apache.org/job/POI-DSL-OpenJDK/ws/src/java/org/apache/poi/sl/usermodel/Background.java>:22:
type parameter P is not within its bound
    [javac]     P extends TextParagraph<S,P,? extends TextRun>
    [javac]                               ^
    [javac] <https://builds.apache.org/job/POI-DSL-OpenJDK/ws/src/java/org/apache/poi/sl/usermodel/Slide.java>:22:
type parameter P is not within its bound
    [javac]     P extends TextParagraph<S,P,? extends TextRun>
    [javac]                               ^
    [javac] <https://builds.apache.org/job/POI-DSL-OpenJDK/ws/src/java/org/apache/poi/sl/usermodel/TableCell.java>:27:
type parameter P is not within its bound
    [javac]     P extends TextParagraph<S,P,? extends TextRun>
    [javac]                               ^
    [javac] <https://builds.apache.org/job/POI-DSL-OpenJDK/ws/src/java/org/apache/poi/sl/usermodel/Notes.java>:24:
type parameter P is not within its bound
    [javac]     P extends TextParagraph<S,P,? extends TextRun>
    [javac]                               ^
    [javac] <https://builds.apache.org/job/POI-DSL-OpenJDK/ws/src/java/org/apache/poi/sl/usermodel/GraphicalFrame.java>:22:
type parameter P is not within its bound
    [javac]     P extends TextParagraph<S,P,? extends TextRun>
    [javac]                               ^
    [javac] <https://builds.apache.org/job/POI-DSL-OpenJDK/ws/src/java/org/apache/poi/sl/usermodel/Line.java>:30:
type parameter P is not within its bound
    [javac]     P extends TextParagraph<S,P,? extends TextRun>
    [javac]                               ^
    [javac] Note: Some input files use or override a deprecated API.
    [javac] Note: Recompile with -Xlint:deprecation for details.
    [javac] Note: <https://builds.apache.org/job/POI-DSL-OpenJDK/ws/src/java/org/apache/poi/hpsf/CustomProperties.java>
uses unchecked or unsafe operations.
    [javac] Note: Recompile with -Xlint:unchecked for details.
    [javac] 23 errors

BUILD FAILED
<https://builds.apache.org/job/POI-DSL-OpenJDK/ws/build.xml>:921: Compile failed; see
the compiler error output for details.

Total time: 10 seconds
Build step 'Invoke Ant' marked build as failure
Skipping publisher since build result is FAILURE
Archiving artifacts
Compressed 66.31 MB of artifacts by 100.0% relative to #196
Skipping publisher since build result is FAILURE
Recording test results
ERROR: Step ?Publish JUnit test result report? failed: No test report files were found. Configuration
error?


---------------------------------------------------------------------
To unsubscribe, e-mail: dev-unsubscribe@poi.apache.org
For additional commands, e-mail: dev-help@poi.apache.org


Mime
View raw message