poi-dev mailing list archives

Site index · List index
Message view « Date » · « Thread »
Top « Date » · « Thread »
From Apache Jenkins Server <jenk...@builds.apache.org>
Subject Build failed in Jenkins: POI-DSL-1.6 #367
Date Wed, 28 Jun 2017 21:56:38 GMT
See <https://builds.apache.org/job/POI-DSL-1.6/367/display/redirect?page=changes>

Changes:

[kiwiwings] Bug 61182 - Invalid signature created for streamed xslx file

------------------------------------------
[...truncated 23.46 KB...]

generate-geometry:

compile-scratchpad:
    [javac] Compiling 487 source files to <https://builds.apache.org/job/POI-DSL-1.6/ws/build/scratchpad-classes>
    [javac] Note: Some input files use or override a deprecated API.
    [javac] Note: Recompile with -Xlint:deprecation for details.
    [javac] Compiling 190 source files to <https://builds.apache.org/job/POI-DSL-1.6/ws/build/scratchpad-test-classes>
    [javac] Note: Some input files use or override a deprecated API.
    [javac] Note: Recompile with -Xlint:deprecation for details.
     [copy] Copying 2 files to <https://builds.apache.org/job/POI-DSL-1.6/ws/build/scratchpad-classes>

check-compiled-ooxml-xsds:

compile-ooxml-xsds:

compile-ooxml:
    [javac] Compiling 443 source files to <https://builds.apache.org/job/POI-DSL-1.6/ws/build/ooxml-classes>
    [javac] Note: Some input files use or override a deprecated API.
    [javac] Note: Recompile with -Xlint:deprecation for details.
    [javac] Note: <https://builds.apache.org/job/POI-DSL-1.6/ws/src/ooxml/java/org/apache/poi/xssf/eventusermodel/XSSFReader.java>
uses unchecked or unsafe operations.
    [javac] Note: Recompile with -Xlint:unchecked for details.
    [javac] Compiling 230 source files to <https://builds.apache.org/job/POI-DSL-1.6/ws/build/ooxml-test-classes>
    [javac] warning: Unable to read the existing benchmark list, because of UnsupportedOperationException.
Run on JDK 7 or higher.
    [javac] Note: Some input files use or override a deprecated API.
    [javac] Note: Recompile with -Xlint:deprecation for details.
     [copy] Copying 3 files to <https://builds.apache.org/job/POI-DSL-1.6/ws/build/ooxml-classes>

compile-examples:
    [javac] Compiling 147 source files to <https://builds.apache.org/job/POI-DSL-1.6/ws/build/examples-classes>
    [javac] Note: Some input files use or override a deprecated API.
    [javac] Note: Recompile with -Xlint:deprecation for details.
     [copy] Copying 1 file to <https://builds.apache.org/job/POI-DSL-1.6/ws/build/examples-classes>

compile-excelant:
    [javac] Compiling 14 source files to <https://builds.apache.org/job/POI-DSL-1.6/ws/build/excelant-classes>
    [javac] Compiling 13 source files to <https://builds.apache.org/job/POI-DSL-1.6/ws/build/excelant-test-classes>
     [copy] Copying 1 file to <https://builds.apache.org/job/POI-DSL-1.6/ws/build/excelant-classes>

compile:

-compile-ooxml-lite-check:

compile-ooxml-lite:
     [echo] Running ooxml-lite generator
    [mkdir] Created dir: <https://builds.apache.org/job/POI-DSL-1.6/ws/build/ooxml-lite-merged>
      [jar] Building jar: <https://builds.apache.org/job/POI-DSL-1.6/ws/build/ooxml-lite-merged/ooxml-lite-merged.jar>
     [java] Collecting unit tests from <https://builds.apache.org/job/POI-DSL-1.6/ws/build/ooxml-test-classes>
     [java] Inner class org.apache.poi.openxml4j.opc.internal.marshallers.TestZipPackagePropertiesMarshaller$1.class
not included
     [java] Inner class org.apache.poi.xssf.util.TestEvilUnclosedBRFixingInputStream$EvilUnclosedBRFixingInputStream.class
not included
     [java] Inner class org.apache.poi.xssf.streaming.TempFileRecordingSXSSFWorkbookWithCustomZipEntrySource$TempFileRecordingSheetDataWriterWithDecorator.class
not included
     [java] Inner class org.apache.poi.xssf.usermodel.TestFormulaEvaluatorOnXSSF$1.class not
included
     [java] Inner class org.apache.poi.xssf.usermodel.TestMultiSheetFormulaEvaluatorOnXSSF$1.class
not included
     [java] Inner class org.apache.poi.xssf.eventusermodel.TestXSSFBReader$TestSheetHandler.class
not included
     [java] Inner class org.apache.poi.xssf.eventusermodel.TestXSSFBReader$1.class not included
     [java] Inner class org.apache.poi.xslf.usermodel.TestPPTX2PNG$1.class not included
     [java] Class org.apache.poi.benchmark.AddImageBench does not derive from TestCase and
does not have a @Test annotation
     [java] Class org.apache.poi.benchmark.generated.AddImageBench_jmhType_B2 does not derive
from TestCase and does not have a @Test annotation
     [java] Class org.apache.poi.benchmark.generated.AddImageBench_jmhType_B1 does not derive
from TestCase and does not have a @Test annotation
     [java] Class org.apache.poi.benchmark.generated.AddImageBench_jmhType does not derive
from TestCase and does not have a @Test annotation
     [java] Class org.apache.poi.benchmark.generated.AddImageBench_jmhType_B3 does not derive
from TestCase and does not have a @Test annotation
     [java] Class org.apache.poi.benchmark.generated.AddImageBench_benchCreatePicture_jmhTest
does not derive from TestCase and does not have a @Test annotation
     [java] Found 208 classes
     [java] SLF4J: Failed to load class "org.slf4j.impl.StaticLoggerBinder".
     [java] SLF4J: Defaulting to no-operation (NOP) logger implementation
     [java] SLF4J: See http://www.slf4j.org/codes.html#StaticLoggerBinder for further details.
     [java] ................................................................I.................................................I.....................................................................................................I................I..............................................................................................................................................E..............I...........................................Setting
col: 0 and row 0
     [java] Setting col: 1 and row 1
     [java] .......................................................I..I..I.I..................................11
     [java] Calibri
     [java] .........................................................................................................................................................................................................................................................................................................................................................................................................................................................................................................................................................................................................................................................................I.......................................................................RANK(A1,(B1,B2,B3),1)
     [java] ........I.....Cell: 3E-104
     [java] Cell: 5E-104
     [java] Cell: 5E-106
     [java] Cell: 
     [java] .II........I.I........................I........Reading row 0, col 1
     [java] Formula:A1
     [java] Formula Result Type:STRING
     [java] Reading row 1, col 1
     [java] Formula:A1
     [java] Formula Result Type:STRING
     [java] .I.....I......................................................................................Cell
formula evaluation currently unsupported
     [java] Array formulas currently unsupported
     [java] .............................................................................................................................................I..............III.I.I.......I.......I.....I.........................................................I.....I....................................................................................................................................................................................................................................................................................................................................................................I..............................................................................................................................<https://builds.apache.org/job/POI-DSL-1.6/ws/test-data/spreadsheet/Formatting.xlsx>
     [java] 
     [java] /_rels/.rels
     [java] 	application/vnd.openxmlformats-package.relationships+xml
     [java] 	588 bytes
     [java] /docProps/app.xml
     [java] 	application/vnd.openxmlformats-officedocument.extended-properties+xml
     [java] 	839 bytes
     [java] 	0 relations
     [java] /docProps/core.xml
     [java] 	application/vnd.openxmlformats-package.core-properties+xml
     [java] 	0 relations
     [java] /xl/_rels/workbook.xml.rels
     [java] 	application/vnd.openxmlformats-package.relationships+xml
     [java] 	980 bytes
     [java] /xl/sharedStrings.xml
     [java] 	application/vnd.openxmlformats-officedocument.spreadsheetml.sharedStrings+xml
     [java] 	477 bytes
     [java] 	0 relations
     [java] /xl/styles.xml
     [java] 	application/vnd.openxmlformats-officedocument.spreadsheetml.styles+xml
     [java] 	2237 bytes
     [java] 	0 relations
     [java] /xl/theme/theme1.xml
     [java] 	application/vnd.openxmlformats-officedocument.theme+xml
     [java] 	6995 bytes
     [java] 	0 relations
     [java] /xl/workbook.xml
     [java] 	application/vnd.openxmlformats-officedocument.spreadsheetml.sheet.main+xml
     [java] 	624 bytes
     [java] 	6 relations
     [java] 	  Relationship:
     [java] 	  	From: /xl/workbook.xml
     [java] 	  	To:   /xl/worksheets/sheet1.xml
     [java] 	  	ID:   rId1
     [java] 	  	Mode: INTERNAL
     [java] 	  	Type: http://schemas.openxmlformats.org/officeDocument/2006/relationships/worksheet
     [java] 	  Relationship:
     [java] 	  	From: /xl/workbook.xml
     [java] 	  	To:   /xl/worksheets/sheet2.xml
     [java] 	  	ID:   rId2
     [java] 	  	Mode: INTERNAL
     [java] 	  	Type: http://schemas.openxmlformats.org/officeDocument/2006/relationships/worksheet
     [java] 	  Relationship:
     [java] 	  	From: /xl/workbook.xml
     [java] 	  	To:   /xl/worksheets/sheet3.xml
     [java] 	  	ID:   rId3
     [java] 	  	Mode: INTERNAL
     [java] 	  	Type: http://schemas.openxmlformats.org/officeDocument/2006/relationships/worksheet
     [java] 	  Relationship:
     [java] 	  	From: /xl/workbook.xml
     [java] 	  	To:   /xl/theme/theme1.xml
     [java] 	  	ID:   rId4
     [java] 	  	Mode: INTERNAL
     [java] 	  	Type: http://schemas.openxmlformats.org/officeDocument/2006/relationships/theme
     [java] 	  Relationship:
     [java] 	  	From: /xl/workbook.xml
     [java] 	  	To:   /xl/styles.xml
     [java] 	  	ID:   rId5
     [java] 	  	Mode: INTERNAL
     [java] 	  	Type: http://schemas.openxmlformats.org/officeDocument/2006/relationships/styles
     [java] 	  Relationship:
     [java] 	  	From: /xl/workbook.xml
     [java] 	  	To:   /xl/sharedStrings.xml
     [java] 	  	ID:   rId6
     [java] 	  	Mode: INTERNAL
     [java] 	  	Type: http://schemas.openxmlformats.org/officeDocument/2006/relationships/sharedStrings
     [java] /xl/worksheets/sheet1.xml
     [java] 	application/vnd.openxmlformats-officedocument.spreadsheetml.worksheet+xml
     [java] 	1814 bytes
     [java] 	0 relations
     [java] /xl/worksheets/sheet2.xml
     [java] 	application/vnd.openxmlformats-officedocument.spreadsheetml.worksheet+xml
     [java] 	439 bytes
     [java] 	0 relations
     [java] /xl/worksheets/sheet3.xml
     [java] 	application/vnd.openxmlformats-officedocument.spreadsheetml.worksheet+xml
     [java] 	439 bytes
     [java] 	0 relations
     [java] 
     [java] Relationship:
     [java] 	From: /
     [java] 	To:   /xl/workbook.xml
     [java] 	ID:   rId1
     [java] 	Mode: INTERNAL
     [java] 	Type: http://schemas.openxmlformats.org/officeDocument/2006/relationships/officeDocument
     [java] Relationship:
     [java] 	From: /
     [java] 	To:   /docProps/core.xml
     [java] 	ID:   rId2
     [java] 	Mode: INTERNAL
     [java] 	Type: http://schemas.openxmlformats.org/package/2006/relationships/metadata/core-properties
     [java] Relationship:
     [java] 	From: /
     [java] 	To:   /docProps/app.xml
     [java] 	ID:   rId3
     [java] 	Mode: INTERNAL
     [java] 	Type: http://schemas.openxmlformats.org/officeDocument/2006/relationships/extended-properties
     [java] ..Reading zip-file <https://builds.apache.org/job/POI-DSL-1.6/ws/test-data/spreadsheet/Formatting.xlsx>
and writing pretty-printed XML to /tmp/poifiles/Formatting6855463956554256123-pretty.xlsx
     [java] ............
     [java] Done.
     [java] III................Took: 1271ms
     [java] ....................setCellStyleProps start
     [java] setCellStyleProps nearing end
     [java] ..............setCellStyleProps start
     [java] setCellStyleProps nearing end
     [java] ............................................
     [java] Time: 89.333
     [java] There was 1 failure:
     [java] 1) bug61182(org.apache.poi.poifs.crypt.TestSignatureInfo)
     [java] org.junit.ComparisonFailure: expected:<[Lxp2LFa+0YWGOBL8zVdf7SWRQiNK/Tt85W+kmH1bunlua030BKbQc6yWIIk6gN6jCTtrJ1h2eMRbLwymygOUpMdd0MeQY3mMWRSO9qEW87SQvyDqBh71zXWW3ZYET+vJWr3BCNEtXCy8jZvgXqILBGk5vMJW/EYaUEhBcDGjCm0]=>
but was:<[i7NlAfPm/3+MHTwu08wylqYPq0n2KNNSGl6leQfxw6s9/qHlaQhwCoRNdrZjUgUvfGgMv5UE1cYy84kfKf0fb7bfm0f6ooRC6WXgS1zE5yyw3goj2tfFp74IzqjIpfxWiy8cp5ah6/nDDsvuHY0FAWbtkILsPt9qgxdbIQI13lE]=>
     [java] 	at org.junit.Assert.assertEquals(Assert.java:115)
     [java] 	at org.junit.Assert.assertEquals(Assert.java:144)
     [java] 	at org.apache.poi.poifs.crypt.TestSignatureInfo.bug61182(TestSignatureInfo.java:181)
     [java] 	at sun.reflect.NativeMethodAccessorImpl.invoke0(Native Method)
     [java] 	at sun.reflect.NativeMethodAccessorImpl.invoke(NativeMethodAccessorImpl.java:39)
     [java] 	at sun.reflect.DelegatingMethodAccessorImpl.invoke(DelegatingMethodAccessorImpl.java:25)
     [java] 	at java.lang.reflect.Method.invoke(Method.java:597)
     [java] 	at org.junit.runners.model.FrameworkMethod$1.runReflectiveCall(FrameworkMethod.java:50)
     [java] 	at org.junit.internal.runners.model.ReflectiveCallable.run(ReflectiveCallable.java:12)
     [java] 	at org.junit.runners.model.FrameworkMethod.invokeExplosively(FrameworkMethod.java:47)
     [java] 	at org.junit.internal.runners.statements.InvokeMethod.evaluate(InvokeMethod.java:17)
     [java] 	at org.junit.runners.ParentRunner.runLeaf(ParentRunner.java:325)
     [java] 	at org.junit.runners.BlockJUnit4ClassRunner.runChild(BlockJUnit4ClassRunner.java:78)
     [java] 	at org.junit.runners.BlockJUnit4ClassRunner.runChild(BlockJUnit4ClassRunner.java:57)
     [java] 	at org.junit.runners.ParentRunner$3.run(ParentRunner.java:290)
     [java] 	at org.junit.runners.ParentRunner$1.schedule(ParentRunner.java:71)
     [java] 	at org.junit.runners.ParentRunner.runChildren(ParentRunner.java:288)
     [java] 	at org.junit.runners.ParentRunner.access$000(ParentRunner.java:58)
     [java] 	at org.junit.runners.ParentRunner$2.evaluate(ParentRunner.java:268)
     [java] 	at org.junit.internal.runners.statements.RunBefores.evaluate(RunBefores.java:26)
     [java] 	at org.junit.runners.ParentRunner.run(ParentRunner.java:363)
     [java] 	at org.junit.runners.Suite.runChild(Suite.java:128)
     [java] 	at org.junit.runners.Suite.runChild(Suite.java:27)
     [java] 	at org.junit.runners.ParentRunner$3.run(ParentRunner.java:290)
     [java] 	at org.junit.runners.ParentRunner$1.schedule(ParentRunner.java:71)
     [java] 	at org.junit.runners.ParentRunner.runChildren(ParentRunner.java:288)
     [java] 	at org.junit.runners.ParentRunner.access$000(ParentRunner.java:58)
     [java] 	at org.junit.runners.ParentRunner$2.evaluate(ParentRunner.java:268)
     [java] 	at org.junit.runners.ParentRunner.run(ParentRunner.java:363)
     [java] 	at org.junit.runner.JUnitCore.run(JUnitCore.java:137)
     [java] 	at org.junit.runner.JUnitCore.run(JUnitCore.java:115)
     [java] 	at org.junit.runner.JUnitCore.run(JUnitCore.java:105)
     [java] 	at org.junit.runner.JUnitCore.run(JUnitCore.java:94)
     [java] 	at org.apache.poi.util.OOXMLLite.build(OOXMLLite.java:131)
     [java] 	at org.apache.poi.util.OOXMLLite.main(OOXMLLite.java:88)
     [java] 
     [java] FAILURES!!!
     [java] Tests run: 2206,  Failures: 1
     [java] 
     [java] Exception in thread "main" java.lang.RuntimeException: Tests did not succeed,
cannot build ooxml-lite jar
     [java] 	at org.apache.poi.util.OOXMLLite.build(OOXMLLite.java:133)
     [java] 	at org.apache.poi.util.OOXMLLite.main(OOXMLLite.java:88)

BUILD FAILED
<https://builds.apache.org/job/POI-DSL-1.6/ws/build.xml>:1667: Java returned: 1

Total time: 2 minutes 19 seconds
Build step 'Invoke Ant' marked build as failure
Skipping publisher since build result is FAILURE
Archiving artifacts
Compressed 66.31 MB of artifacts by 65.4% relative to #366
Skipping publisher since build result is FAILURE
Recording test results
ERROR: Step ‘Publish JUnit test result report’ failed: No test report files were found.
Configuration error?


---------------------------------------------------------------------
To unsubscribe, e-mail: dev-unsubscribe@poi.apache.org
For additional commands, e-mail: dev-help@poi.apache.org


Mime
View raw message