poi-dev mailing list archives

Site index · List index
Message view « Date » · « Thread »
Top « Date » · « Thread »
From Apache Jenkins Server <jenk...@builds.apache.org>
Subject Build failed in Jenkins: POI-DSL-Maven #239
Date Thu, 29 Jun 2017 00:05:54 GMT
See <https://builds.apache.org/job/POI-DSL-Maven/239/display/redirect?page=changes>

Changes:

[nick] Fix javadoc warnings

[nick] Used deprecated external method removed, so remove internal method

[nick] Used deprecated external method removed, so remove internal method

[kiwiwings] add debugging info to find signature differences

[fanningpj] Ensure SpreadsheetVersion is set for AreaReferences

[kiwiwings] Bug 61182 - Invalid signature created for streamed xslx file

------------------------------------------
[...truncated 136.81 KB...]
Tests run: 4, Failures: 0, Errors: 0, Skipped: 0, Time elapsed: 0 sec - in org.apache.poi.hssf.eventmodel.TestEventRecordFactory
Running org.apache.poi.hssf.record.TestInterfaceEndRecord
Tests run: 2, Failures: 0, Errors: 0, Skipped: 0, Time elapsed: 0 sec - in org.apache.poi.hssf.record.TestInterfaceEndRecord
Running org.apache.poi.hssf.record.TestDrawingRecord
Tests run: 1, Failures: 0, Errors: 0, Skipped: 0, Time elapsed: 0 sec - in org.apache.poi.hssf.record.TestDrawingRecord
Running org.apache.poi.hssf.record.TestLabelRecord
Tests run: 1, Failures: 0, Errors: 0, Skipped: 0, Time elapsed: 0.028 sec - in org.apache.poi.hssf.record.TestLabelRecord
Running org.apache.poi.hssf.record.TestStringRecord
Tests run: 3, Failures: 0, Errors: 0, Skipped: 0, Time elapsed: 0 sec - in org.apache.poi.hssf.record.TestStringRecord
Running org.apache.poi.hssf.record.TestSharedFormulaRecord
Tests run: 5, Failures: 0, Errors: 0, Skipped: 0, Time elapsed: 0.012 sec - in org.apache.poi.hssf.record.TestSharedFormulaRecord
Running org.apache.poi.hssf.record.TestDConRefRecord
Tests run: 8, Failures: 0, Errors: 0, Skipped: 0, Time elapsed: 0 sec - in org.apache.poi.hssf.record.TestDConRefRecord
Running org.apache.poi.hssf.record.TestCommonObjectDataSubRecord
Tests run: 2, Failures: 0, Errors: 0, Skipped: 0, Time elapsed: 0 sec - in org.apache.poi.hssf.record.TestCommonObjectDataSubRecord
Running org.apache.poi.hssf.record.TestSupBookRecord
Tests run: 7, Failures: 0, Errors: 0, Skipped: 0, Time elapsed: 0 sec - in org.apache.poi.hssf.record.TestSupBookRecord
Running org.apache.poi.hssf.record.TestPaneRecord
Tests run: 2, Failures: 0, Errors: 0, Skipped: 0, Time elapsed: 0 sec - in org.apache.poi.hssf.record.TestPaneRecord
Running org.apache.poi.hssf.record.TestRecordFactory
Tests run: 5, Failures: 0, Errors: 0, Skipped: 0, Time elapsed: 0 sec - in org.apache.poi.hssf.record.TestRecordFactory
Running org.apache.poi.hssf.record.TestCFRuleRecord
Tests run: 8, Failures: 0, Errors: 0, Skipped: 0, Time elapsed: 0.208 sec - in org.apache.poi.hssf.record.TestCFRuleRecord
Running org.apache.poi.hssf.record.TestFeatRecord
Tests run: 3, Failures: 0, Errors: 0, Skipped: 0, Time elapsed: 0 sec - in org.apache.poi.hssf.record.TestFeatRecord
Running org.apache.poi.hssf.record.TestTableRecord
Tests run: 2, Failures: 0, Errors: 0, Skipped: 0, Time elapsed: 0 sec - in org.apache.poi.hssf.record.TestTableRecord
Running org.apache.poi.hssf.record.TestFtCblsSubRecord
Tests run: 3, Failures: 0, Errors: 0, Skipped: 0, Time elapsed: 0 sec - in org.apache.poi.hssf.record.TestFtCblsSubRecord
Running org.apache.poi.hssf.record.aggregates.TestCFRecordsAggregate
Tests run: 3, Failures: 0, Errors: 0, Skipped: 0, Time elapsed: 0.001 sec - in org.apache.poi.hssf.record.aggregates.TestCFRecordsAggregate
Running org.apache.poi.hssf.record.aggregates.TestValueRecordsAggregate
Tests run: 10, Failures: 0, Errors: 0, Skipped: 0, Time elapsed: 0 sec - in org.apache.poi.hssf.record.aggregates.TestValueRecordsAggregate
Running org.apache.poi.hssf.record.aggregates.TestPageSettingsBlock
Tests run: 9, Failures: 0, Errors: 0, Skipped: 0, Time elapsed: 0 sec - in org.apache.poi.hssf.record.aggregates.TestPageSettingsBlock
Running org.apache.poi.hssf.record.aggregates.TestColumnInfoRecordsAggregate
Tests run: 3, Failures: 0, Errors: 0, Skipped: 0, Time elapsed: 0 sec - in org.apache.poi.hssf.record.aggregates.TestColumnInfoRecordsAggregate
Running org.apache.poi.hssf.record.aggregates.TestSharedValueManager
Tests run: 4, Failures: 0, Errors: 0, Skipped: 0, Time elapsed: 0.01 sec - in org.apache.poi.hssf.record.aggregates.TestSharedValueManager
Running org.apache.poi.hssf.record.aggregates.TestRowRecordsAggregate
Tests run: 3, Failures: 0, Errors: 0, Skipped: 0, Time elapsed: 0.001 sec - in org.apache.poi.hssf.record.aggregates.TestRowRecordsAggregate
Running org.apache.poi.hssf.record.aggregates.TestFormulaRecordAggregate
Tests run: 3, Failures: 0, Errors: 0, Skipped: 0, Time elapsed: 0 sec - in org.apache.poi.hssf.record.aggregates.TestFormulaRecordAggregate
Running org.apache.poi.hssf.record.TestSSTRecord
Tests run: 9, Failures: 0, Errors: 0, Skipped: 0, Time elapsed: 0.032 sec - in org.apache.poi.hssf.record.TestSSTRecord
Running org.apache.poi.hssf.record.TestColumnInfoRecord
Tests run: 3, Failures: 0, Errors: 0, Skipped: 0, Time elapsed: 0 sec - in org.apache.poi.hssf.record.TestColumnInfoRecord
Running org.apache.poi.hssf.record.TestRecordInputStream
Tests run: 4, Failures: 0, Errors: 0, Skipped: 0, Time elapsed: 0 sec - in org.apache.poi.hssf.record.TestRecordInputStream
Running org.apache.poi.hssf.record.TestWriteAccessRecord
Tests run: 2, Failures: 0, Errors: 0, Skipped: 0, Time elapsed: 0 sec - in org.apache.poi.hssf.record.TestWriteAccessRecord
Running org.apache.poi.hssf.record.TestBoolErrRecord
Tests run: 2, Failures: 0, Errors: 0, Skipped: 0, Time elapsed: 0.001 sec - in org.apache.poi.hssf.record.TestBoolErrRecord
Running org.apache.poi.hssf.record.TestStyleRecord
Tests run: 1, Failures: 0, Errors: 0, Skipped: 0, Time elapsed: 0 sec - in org.apache.poi.hssf.record.TestStyleRecord
Running org.apache.poi.hssf.record.TestBoundSheetRecord
Tests run: 6, Failures: 0, Errors: 0, Skipped: 0, Time elapsed: 0 sec - in org.apache.poi.hssf.record.TestBoundSheetRecord
Running org.apache.poi.hssf.record.TestSSTRecordSizeCalculator
Tests run: 6, Failures: 0, Errors: 0, Skipped: 0, Time elapsed: 0 sec - in org.apache.poi.hssf.record.TestSSTRecordSizeCalculator
Running org.apache.poi.hssf.record.TestEmbeddedObjectRefSubRecord
Tests run: 5, Failures: 0, Errors: 0, Skipped: 0, Time elapsed: 0.001 sec - in org.apache.poi.hssf.record.TestEmbeddedObjectRefSubRecord
Running org.apache.poi.hssf.record.TestDrawingGroupRecord
Tests run: 3, Failures: 0, Errors: 0, Skipped: 0, Time elapsed: 0 sec - in org.apache.poi.hssf.record.TestDrawingGroupRecord
Running org.apache.poi.hssf.record.TestEndSubRecord
Tests run: 2, Failures: 0, Errors: 0, Skipped: 0, Time elapsed: 0 sec - in org.apache.poi.hssf.record.TestEndSubRecord
Running org.apache.poi.hssf.record.common.TestUnicodeString
Tests run: 10, Failures: 0, Errors: 0, Skipped: 0, Time elapsed: 0.003 sec - in org.apache.poi.hssf.record.common.TestUnicodeString
Running org.apache.poi.hssf.record.TestMergeCellsRecord
Tests run: 2, Failures: 0, Errors: 0, Skipped: 0, Time elapsed: 0 sec - in org.apache.poi.hssf.record.TestMergeCellsRecord
Running org.apache.poi.hssf.record.TestCFHeaderRecord
Tests run: 4, Failures: 0, Errors: 0, Skipped: 0, Time elapsed: 0 sec - in org.apache.poi.hssf.record.TestCFHeaderRecord
Running org.apache.poi.hssf.record.TestSubRecord
Tests run: 3, Failures: 0, Errors: 0, Skipped: 0, Time elapsed: 0 sec - in org.apache.poi.hssf.record.TestSubRecord
Running org.apache.poi.hssf.record.TestPaletteRecord
Tests run: 1, Failures: 0, Errors: 0, Skipped: 0, Time elapsed: 0.001 sec - in org.apache.poi.hssf.record.TestPaletteRecord
Running org.apache.poi.hssf.record.TestPLVRecord
Tests run: 1, Failures: 0, Errors: 0, Skipped: 0, Time elapsed: 0 sec - in org.apache.poi.hssf.record.TestPLVRecord
Running org.apache.poi.hssf.record.TestRecordFactoryInputStream
Tests run: 4, Failures: 0, Errors: 0, Skipped: 0, Time elapsed: 0 sec - in org.apache.poi.hssf.record.TestRecordFactoryInputStream
Running org.apache.poi.hssf.record.TestNoteRecord
Tests run: 4, Failures: 0, Errors: 0, Skipped: 0, Time elapsed: 0 sec - in org.apache.poi.hssf.record.TestNoteRecord
Running org.apache.poi.hssf.record.TestRecalcIdRecord
Tests run: 2, Failures: 0, Errors: 0, Skipped: 0, Time elapsed: 0 sec - in org.apache.poi.hssf.record.TestRecalcIdRecord
Running org.apache.poi.hssf.record.TestExternalNameRecord
Tests run: 8, Failures: 0, Errors: 0, Skipped: 0, Time elapsed: 0 sec - in org.apache.poi.hssf.record.TestExternalNameRecord
Running org.apache.poi.hssf.record.TestNoteStructureSubRecord
Tests run: 3, Failures: 0, Errors: 0, Skipped: 0, Time elapsed: 0 sec - in org.apache.poi.hssf.record.TestNoteStructureSubRecord
Running org.apache.poi.hssf.record.TestSSTDeserializer
Tests run: 4, Failures: 0, Errors: 0, Skipped: 0, Time elapsed: 0.004 sec - in org.apache.poi.hssf.record.TestSSTDeserializer
Running org.apache.poi.hssf.record.TestFontRecord
Tests run: 5, Failures: 0, Errors: 0, Skipped: 0, Time elapsed: 0.001 sec - in org.apache.poi.hssf.record.TestFontRecord
Running org.apache.poi.hssf.record.TestNameCommentRecord
Tests run: 1, Failures: 0, Errors: 0, Skipped: 0, Time elapsed: 0 sec - in org.apache.poi.hssf.record.TestNameCommentRecord
Running org.apache.poi.hssf.record.pivot.TestExtendedPivotTableViewFieldsRecord
Tests run: 2, Failures: 0, Errors: 0, Skipped: 0, Time elapsed: 0 sec - in org.apache.poi.hssf.record.pivot.TestExtendedPivotTableViewFieldsRecord
Running org.apache.poi.hssf.record.pivot.TestViewFieldsRecord
Tests run: 2, Failures: 0, Errors: 0, Skipped: 0, Time elapsed: 0 sec - in org.apache.poi.hssf.record.pivot.TestViewFieldsRecord
Running org.apache.poi.hssf.record.pivot.TestPageItemRecord
Tests run: 2, Failures: 0, Errors: 0, Skipped: 0, Time elapsed: 0 sec - in org.apache.poi.hssf.record.pivot.TestPageItemRecord
Running org.apache.poi.hssf.record.TestArrayRecord
Tests run: 2, Failures: 0, Errors: 0, Skipped: 0, Time elapsed: 0.307 sec - in org.apache.poi.hssf.record.TestArrayRecord
Running org.apache.poi.hssf.record.TestExtendedFormatRecord
Tests run: 4, Failures: 0, Errors: 0, Skipped: 0, Time elapsed: 0 sec - in org.apache.poi.hssf.record.TestExtendedFormatRecord
Running org.apache.poi.hssf.record.cf.TestCellRange
Tests run: 8, Failures: 0, Errors: 0, Skipped: 0, Time elapsed: 0 sec - in org.apache.poi.hssf.record.cf.TestCellRange
Running org.apache.poi.hssf.record.TestFormulaRecord
Tests run: 6, Failures: 0, Errors: 0, Skipped: 0, Time elapsed: 0 sec - in org.apache.poi.hssf.record.TestFormulaRecord
Running org.apache.poi.hssf.record.TestUnicodeNameRecord
Tests run: 1, Failures: 0, Errors: 0, Skipped: 0, Time elapsed: 0 sec - in org.apache.poi.hssf.record.TestUnicodeNameRecord
Running org.apache.poi.hssf.record.TestDVALRecord
Tests run: 1, Failures: 0, Errors: 0, Skipped: 0, Time elapsed: 0 sec - in org.apache.poi.hssf.record.TestDVALRecord
Running org.apache.poi.hssf.record.chart.TestCategorySeriesAxisRecord
Tests run: 2, Failures: 0, Errors: 0, Skipped: 0, Time elapsed: 0 sec - in org.apache.poi.hssf.record.chart.TestCategorySeriesAxisRecord
Running org.apache.poi.hssf.record.chart.TestSeriesToChartGroupRecord
Tests run: 2, Failures: 0, Errors: 0, Skipped: 0, Time elapsed: 0 sec - in org.apache.poi.hssf.record.chart.TestSeriesToChartGroupRecord
Running org.apache.poi.hssf.record.chart.TestAxisLineFormatRecord
Tests run: 2, Failures: 0, Errors: 0, Skipped: 0, Time elapsed: 0 sec - in org.apache.poi.hssf.record.chart.TestAxisLineFormatRecord
Running org.apache.poi.hssf.record.chart.TestValueRangeRecord
Tests run: 2, Failures: 0, Errors: 0, Skipped: 0, Time elapsed: 0 sec - in org.apache.poi.hssf.record.chart.TestValueRangeRecord
Running org.apache.poi.hssf.record.chart.TestFrameRecord
Tests run: 2, Failures: 0, Errors: 0, Skipped: 0, Time elapsed: 0 sec - in org.apache.poi.hssf.record.chart.TestFrameRecord
Running org.apache.poi.hssf.record.chart.TestSeriesRecord
Tests run: 2, Failures: 0, Errors: 0, Skipped: 0, Time elapsed: 0 sec - in org.apache.poi.hssf.record.chart.TestSeriesRecord
Running org.apache.poi.hssf.record.chart.TestChartTitleFormatRecord
Tests run: 1, Failures: 0, Errors: 0, Skipped: 0, Time elapsed: 0.001 sec - in org.apache.poi.hssf.record.chart.TestChartTitleFormatRecord
Running org.apache.poi.hssf.record.chart.TestLinkedDataRecord
Tests run: 2, Failures: 0, Errors: 0, Skipped: 0, Time elapsed: 0 sec - in org.apache.poi.hssf.record.chart.TestLinkedDataRecord
Running org.apache.poi.hssf.record.chart.TestLegendRecord
Tests run: 2, Failures: 0, Errors: 0, Skipped: 0, Time elapsed: 0 sec - in org.apache.poi.hssf.record.chart.TestLegendRecord
Running org.apache.poi.hssf.record.chart.TestFontBasisRecord
Tests run: 2, Failures: 0, Errors: 0, Skipped: 0, Time elapsed: 0 sec - in org.apache.poi.hssf.record.chart.TestFontBasisRecord
Running org.apache.poi.hssf.record.chart.TestSeriesTextRecord
Tests run: 3, Failures: 0, Errors: 0, Skipped: 0, Time elapsed: 0 sec - in org.apache.poi.hssf.record.chart.TestSeriesTextRecord
Running org.apache.poi.hssf.record.chart.TestAxisRecord
Tests run: 2, Failures: 0, Errors: 0, Skipped: 0, Time elapsed: 0 sec - in org.apache.poi.hssf.record.chart.TestAxisRecord
Running org.apache.poi.hssf.record.chart.TestNumberFormatIndexRecord
Tests run: 2, Failures: 0, Errors: 0, Skipped: 0, Time elapsed: 0 sec - in org.apache.poi.hssf.record.chart.TestNumberFormatIndexRecord
Running org.apache.poi.hssf.record.chart.TestChartRecord
Tests run: 2, Failures: 0, Errors: 0, Skipped: 0, Time elapsed: 0 sec - in org.apache.poi.hssf.record.chart.TestChartRecord
Running org.apache.poi.hssf.record.chart.TestAxisUsedRecord
Tests run: 2, Failures: 0, Errors: 0, Skipped: 0, Time elapsed: 0 sec - in org.apache.poi.hssf.record.chart.TestAxisUsedRecord
Running org.apache.poi.hssf.record.chart.TestAxisOptionsRecord
Tests run: 2, Failures: 0, Errors: 0, Skipped: 0, Time elapsed: 0.001 sec - in org.apache.poi.hssf.record.chart.TestAxisOptionsRecord
Running org.apache.poi.hssf.record.chart.TestDataFormatRecord
Tests run: 2, Failures: 0, Errors: 0, Skipped: 0, Time elapsed: 0 sec - in org.apache.poi.hssf.record.chart.TestDataFormatRecord
Running org.apache.poi.hssf.record.chart.TestUnitsRecord
Tests run: 2, Failures: 0, Errors: 0, Skipped: 0, Time elapsed: 0 sec - in org.apache.poi.hssf.record.chart.TestUnitsRecord
Running org.apache.poi.hssf.record.chart.TestLineFormatRecord
Tests run: 2, Failures: 0, Errors: 0, Skipped: 0, Time elapsed: 0 sec - in org.apache.poi.hssf.record.chart.TestLineFormatRecord
Running org.apache.poi.hssf.record.chart.TestSeriesLabelsRecord
Tests run: 2, Failures: 0, Errors: 0, Skipped: 0, Time elapsed: 0 sec - in org.apache.poi.hssf.record.chart.TestSeriesLabelsRecord
Running org.apache.poi.hssf.record.chart.TestTickRecord
Tests run: 2, Failures: 0, Errors: 0, Skipped: 0, Time elapsed: 0 sec - in org.apache.poi.hssf.record.chart.TestTickRecord
Running org.apache.poi.hssf.record.chart.TestAreaRecord
Tests run: 2, Failures: 0, Errors: 0, Skipped: 0, Time elapsed: 0 sec - in org.apache.poi.hssf.record.chart.TestAreaRecord
Running org.apache.poi.hssf.record.chart.TestDatRecord
Tests run: 2, Failures: 0, Errors: 0, Skipped: 0, Time elapsed: 0 sec - in org.apache.poi.hssf.record.chart.TestDatRecord
Running org.apache.poi.hssf.record.chart.TestSeriesIndexRecord
Tests run: 2, Failures: 0, Errors: 0, Skipped: 0, Time elapsed: 0 sec - in org.apache.poi.hssf.record.chart.TestSeriesIndexRecord
Running org.apache.poi.hssf.record.chart.TestTextRecord
Tests run: 2, Failures: 0, Errors: 0, Skipped: 0, Time elapsed: 0 sec - in org.apache.poi.hssf.record.chart.TestTextRecord
Running org.apache.poi.hssf.record.chart.TestFontIndexRecord
Tests run: 2, Failures: 0, Errors: 0, Skipped: 0, Time elapsed: 0 sec - in org.apache.poi.hssf.record.chart.TestFontIndexRecord
Running org.apache.poi.hssf.record.chart.TestSeriesChartGroupIndexRecord
Tests run: 2, Failures: 0, Errors: 0, Skipped: 0, Time elapsed: 0 sec - in org.apache.poi.hssf.record.chart.TestSeriesChartGroupIndexRecord
Running org.apache.poi.hssf.record.chart.TestSheetPropertiesRecord
Tests run: 2, Failures: 0, Errors: 0, Skipped: 0, Time elapsed: 0 sec - in org.apache.poi.hssf.record.chart.TestSheetPropertiesRecord
Running org.apache.poi.hssf.record.chart.TestPlotAreaRecord
Tests run: 2, Failures: 0, Errors: 0, Skipped: 0, Time elapsed: 0.001 sec - in org.apache.poi.hssf.record.chart.TestPlotAreaRecord
Running org.apache.poi.hssf.record.chart.TestChartFormatRecord
Tests run: 1, Failures: 0, Errors: 0, Skipped: 0, Time elapsed: 0 sec - in org.apache.poi.hssf.record.chart.TestChartFormatRecord
Running org.apache.poi.hssf.record.chart.TestObjectLinkRecord
Tests run: 2, Failures: 0, Errors: 0, Skipped: 0, Time elapsed: 0 sec - in org.apache.poi.hssf.record.chart.TestObjectLinkRecord
Running org.apache.poi.hssf.record.chart.TestBarRecord
Tests run: 2, Failures: 0, Errors: 0, Skipped: 0, Time elapsed: 0 sec - in org.apache.poi.hssf.record.chart.TestBarRecord
Running org.apache.poi.hssf.record.chart.TestAxisParentRecord
Tests run: 2, Failures: 0, Errors: 0, Skipped: 0, Time elapsed: 0 sec - in org.apache.poi.hssf.record.chart.TestAxisParentRecord
Running org.apache.poi.hssf.record.chart.TestDefaultDataLabelTextPropertiesRecord
Tests run: 2, Failures: 0, Errors: 0, Skipped: 0, Time elapsed: 0 sec - in org.apache.poi.hssf.record.chart.TestDefaultDataLabelTextPropertiesRecord
Running org.apache.poi.hssf.record.chart.TestPlotGrowthRecord
Tests run: 2, Failures: 0, Errors: 0, Skipped: 0, Time elapsed: 0 sec - in org.apache.poi.hssf.record.chart.TestPlotGrowthRecord
Running org.apache.poi.hssf.record.chart.TestAreaFormatRecord
Tests run: 2, Failures: 0, Errors: 0, Skipped: 0, Time elapsed: 0 sec - in org.apache.poi.hssf.record.chart.TestAreaFormatRecord
Running org.apache.poi.hssf.record.chart.TestSeriesListRecord
Tests run: 2, Failures: 0, Errors: 0, Skipped: 0, Time elapsed: 0 sec - in org.apache.poi.hssf.record.chart.TestSeriesListRecord
Running org.apache.poi.hssf.record.TestBOFRecord
Tests run: 1, Failures: 0, Errors: 0, Skipped: 0, Time elapsed: 0 sec - in org.apache.poi.hssf.record.TestBOFRecord
Running org.apache.poi.hssf.record.TestObjRecord
Tests run: 5, Failures: 0, Errors: 0, Skipped: 0, Time elapsed: 0 sec - in org.apache.poi.hssf.record.TestObjRecord
Running org.apache.poi.hssf.record.TestExtSSTRecord
Tests run: 1, Failures: 0, Errors: 0, Skipped: 0, Time elapsed: 0 sec - in org.apache.poi.hssf.record.TestExtSSTRecord
Running org.apache.poi.hssf.record.TestTextObjectRecord
Tests run: 6, Failures: 0, Errors: 0, Skipped: 0, Time elapsed: 0 sec - in org.apache.poi.hssf.record.TestTextObjectRecord
Running org.apache.poi.hssf.record.TestAutoFilterInfoRecord
Tests run: 3, Failures: 0, Errors: 0, Skipped: 0, Time elapsed: 0 sec - in org.apache.poi.hssf.record.TestAutoFilterInfoRecord
Running org.apache.poi.hssf.record.TestSCLRecord
Tests run: 2, Failures: 0, Errors: 0, Skipped: 0, Time elapsed: 0.001 sec - in org.apache.poi.hssf.record.TestSCLRecord
Running org.apache.poi.hssf.record.TestEscherAggregate
Tests run: 2, Failures: 0, Errors: 0, Skipped: 0, Time elapsed: 0 sec - in org.apache.poi.hssf.record.TestEscherAggregate
Running org.apache.poi.hssf.record.TestTextObjectBaseRecord
Tests run: 2, Failures: 0, Errors: 0, Skipped: 0, Time elapsed: 0 sec - in org.apache.poi.hssf.record.TestTextObjectBaseRecord
Running org.apache.poi.hssf.record.TestHyperlinkRecord
Tests run: 15, Failures: 0, Errors: 0, Skipped: 0, Time elapsed: 0 sec - in org.apache.poi.hssf.record.TestHyperlinkRecord
Running org.apache.poi.hssf.record.TestLbsDataSubRecord
Tests run: 4, Failures: 0, Errors: 0, Skipped: 0, Time elapsed: 0 sec - in org.apache.poi.hssf.record.TestLbsDataSubRecord
Running org.apache.poi.hssf.record.TestNameRecord
Tests run: 6, Failures: 0, Errors: 0, Skipped: 0, Time elapsed: 0 sec - in org.apache.poi.hssf.record.TestNameRecord

Results :

Tests in error: 
  TestPOIFSProperties.testFail:62 » FileNotFound no such entry: "SummaryInforma...
  TestPOIFSProperties.testOK:91 » FileNotFound no such entry: "SummaryInformati...

Tests run: 6408, Failures: 0, Errors: 2, Skipped: 768

[INFO] ------------------------------------------------------------------------
[INFO] Reactor Summary:
[INFO] 
[INFO] Apache POI - the Java API for Microsoft Documents . SUCCESS [  0.002 s]
[INFO] Apache POI Main package ........................... FAILURE [01:41 min]
[INFO] Apache POI Scratchpad package ..................... SKIPPED
[INFO] Apache POI - Openxmlformats Schema package ........ SKIPPED
[INFO] Apache POI - Openxmlformats Encryption Schema package  SKIPPED
[INFO] Apache POI - Openxmlformats Security-Schema package  SKIPPED
[INFO] Apache POI OOXML package .......................... SKIPPED
[INFO] Apache POI ExcelAnt package ....................... SKIPPED
[INFO] Apache POI Examples package ....................... SKIPPED
[INFO] ------------------------------------------------------------------------
[INFO] BUILD FAILURE
[INFO] ------------------------------------------------------------------------
[INFO] Total time: 01:41 min
[INFO] Finished at: 2017-06-29T00:05:54+00:00
[INFO] Final Memory: 28M/765M
[INFO] ------------------------------------------------------------------------
[ERROR] Failed to execute goal org.apache.maven.plugins:maven-surefire-plugin:2.19.1:test
(default-test) on project poi-main: There are test failures.
[ERROR] 
[ERROR] Please refer to <https://builds.apache.org/job/POI-DSL-Maven/ws/sonar/main/target/surefire-reports>
for the individual test results.
[ERROR] -> [Help 1]
[ERROR] 
[ERROR] To see the full stack trace of the errors, re-run Maven with the -e switch.
[ERROR] Re-run Maven using the -X switch to enable full debug logging.
[ERROR] 
[ERROR] For more information about the errors and possible solutions, please read the following
articles:
[ERROR] [Help 1] http://cwiki.apache.org/confluence/display/MAVEN/MojoFailureException
[ERROR] 
[ERROR] After correcting the problems, you can resume the build with the command
[ERROR]   mvn <goals> -rf :poi-main
Build step 'Invoke top-level Maven targets' marked build as failure

---------------------------------------------------------------------
To unsubscribe, e-mail: dev-unsubscribe@poi.apache.org
For additional commands, e-mail: dev-help@poi.apache.org


Mime
View raw message