poi-dev mailing list archives

Site index · List index
Message view « Date » · « Thread »
Top « Date » · « Thread »
From Apache Jenkins Server <jenk...@builds.apache.org>
Subject Build failed in Jenkins: POI-DSL-Maven #220
Date Fri, 16 Jun 2017 12:11:38 GMT
See <https://builds.apache.org/job/POI-DSL-Maven/220/display/redirect?page=changes>

Changes:

[centic] Fix some IntelliJ warnings

------------------------------------------
[...truncated 2.00 MB...]
Tests run: 3, Failures: 0, Errors: 0, Skipped: 0, Time elapsed: 0.026 sec - in org.apache.poi.sl.TestHeadersFooters
Running org.apache.poi.sl.draw.TestDrawPictureShape
Tests run: 2, Failures: 0, Errors: 0, Skipped: 0, Time elapsed: 0.029 sec - in org.apache.poi.sl.draw.TestDrawPictureShape
Running org.apache.poi.TestPOIXMLDocument
Tests run: 11, Failures: 0, Errors: 0, Skipped: 0, Time elapsed: 0.245 sec - in org.apache.poi.TestPOIXMLDocument
Running org.apache.poi.ss.extractor.TestEmbeddedExtractor
Tests run: 3, Failures: 0, Errors: 0, Skipped: 0, Time elapsed: 0.362 sec - in org.apache.poi.ss.extractor.TestEmbeddedExtractor
Running org.apache.poi.ss.usermodel.ConditionalFormattingEvalTest
Tests run: 1, Failures: 0, Errors: 0, Skipped: 0, Time elapsed: 0.153 sec - in org.apache.poi.ss.usermodel.ConditionalFormattingEvalTest
Running org.apache.poi.ss.usermodel.TestXSSFBorderStyle
Tests run: 1, Failures: 0, Errors: 0, Skipped: 0, Time elapsed: 0.045 sec - in org.apache.poi.ss.usermodel.TestXSSFBorderStyle
Running org.apache.poi.ss.usermodel.TestEmbedOLEPackage
Tests run: 2, Failures: 0, Errors: 0, Skipped: 0, Time elapsed: 0.049 sec - in org.apache.poi.ss.usermodel.TestEmbedOLEPackage
Running org.apache.poi.ss.format.TestCellFormatPart
Tests run: 6, Failures: 0, Errors: 0, Skipped: 0, Time elapsed: 0.316 sec - in org.apache.poi.ss.format.TestCellFormatPart
Running org.apache.poi.ss.util.TestSXSSFCellUtil
setCellStyleProps start
setCellStyleProps nearing end
Tests run: 14, Failures: 0, Errors: 0, Skipped: 0, Time elapsed: 0.063 sec - in org.apache.poi.ss.util.TestSXSSFCellUtil
Running org.apache.poi.ss.util.TestXSSFCellUtil
setCellStyleProps start
setCellStyleProps nearing end
Tests run: 14, Failures: 0, Errors: 0, Skipped: 0, Time elapsed: 0.063 sec - in org.apache.poi.ss.util.TestXSSFCellUtil
Running org.apache.poi.ss.util.TestXSSFPropertyTemplate
Tests run: 2, Failures: 0, Errors: 0, Skipped: 0, Time elapsed: 0.075 sec - in org.apache.poi.ss.util.TestXSSFPropertyTemplate
Running org.apache.poi.ss.formula.eval.TestXSSFCircularReferences
Tests run: 4, Failures: 0, Errors: 0, Skipped: 0, Time elapsed: 0.008 sec - in org.apache.poi.ss.formula.eval.TestXSSFCircularReferences
Running org.apache.poi.ss.formula.TestFormulaParser
Tests run: 9, Failures: 0, Errors: 0, Skipped: 0, Time elapsed: 0.029 sec - in org.apache.poi.ss.formula.TestFormulaParser
Running org.apache.poi.ss.formula.functions.TestProper
Took: 1434ms
Tests run: 4, Failures: 0, Errors: 0, Skipped: 0, Time elapsed: 1.439 sec - in org.apache.poi.ss.formula.functions.TestProper
Running org.apache.poi.ss.formula.functions.TestSumifsXSSF
Tests run: 1, Failures: 0, Errors: 0, Skipped: 0, Time elapsed: 0.007 sec - in org.apache.poi.ss.formula.functions.TestSumifsXSSF
Running org.apache.poi.ss.formula.TestStructuredReferences
Tests run: 2, Failures: 0, Errors: 0, Skipped: 0, Time elapsed: 0.01 sec - in org.apache.poi.ss.formula.TestStructuredReferences
Running org.apache.poi.ss.TestWorkbookFactory
Tests run: 8, Failures: 0, Errors: 0, Skipped: 0, Time elapsed: 0.287 sec - in org.apache.poi.ss.TestWorkbookFactory
Running org.apache.poi.xdgf.extractor.TestXDGFVisioExtractor
Tests run: 3, Failures: 0, Errors: 0, Skipped: 0, Time elapsed: 0.3 sec - in org.apache.poi.xdgf.extractor.TestXDGFVisioExtractor
Running org.apache.poi.xdgf.usermodel.section.CombinedIteratorTest
Tests run: 7, Failures: 0, Errors: 0, Skipped: 0, Time elapsed: 0.001 sec - in org.apache.poi.xdgf.usermodel.section.CombinedIteratorTest
Running org.apache.poi.TestDetectAsOOXML
Tests run: 3, Failures: 0, Errors: 0, Skipped: 0, Time elapsed: 0.002 sec - in org.apache.poi.TestDetectAsOOXML
Running org.apache.poi.openxml4j.opc.TestPackageThumbnail
Tests run: 1, Failures: 0, Errors: 0, Skipped: 0, Time elapsed: 0.011 sec - in org.apache.poi.openxml4j.opc.TestPackageThumbnail
Running org.apache.poi.openxml4j.opc.TestContentType
Tests run: 7, Failures: 0, Errors: 0, Skipped: 0, Time elapsed: 0.005 sec - in org.apache.poi.openxml4j.opc.TestContentType
Running org.apache.poi.openxml4j.opc.internal.TestContentTypeManager
Tests run: 4, Failures: 0, Errors: 0, Skipped: 2, Time elapsed: 0.002 sec - in org.apache.poi.openxml4j.opc.internal.TestContentTypeManager
Running org.apache.poi.openxml4j.opc.internal.marshallers.TestZipPackagePropertiesMarshaller
Tests run: 4, Failures: 0, Errors: 0, Skipped: 0, Time elapsed: 0 sec - in org.apache.poi.openxml4j.opc.internal.marshallers.TestZipPackagePropertiesMarshaller
Running org.apache.poi.openxml4j.opc.TestListParts
Tests run: 1, Failures: 0, Errors: 0, Skipped: 0, Time elapsed: 0.002 sec - in org.apache.poi.openxml4j.opc.TestListParts
Running org.apache.poi.openxml4j.opc.TestPackagePartName
Tests run: 1, Failures: 0, Errors: 0, Skipped: 0, Time elapsed: 0 sec - in org.apache.poi.openxml4j.opc.TestPackagePartName
Running org.apache.poi.openxml4j.opc.TestPackageCoreProperties
Tests run: 7, Failures: 0, Errors: 0, Skipped: 0, Time elapsed: 0.051 sec - in org.apache.poi.openxml4j.opc.TestPackageCoreProperties
Running org.apache.poi.openxml4j.opc.TestPackagingURIHelper
Tests run: 5, Failures: 0, Errors: 0, Skipped: 0, Time elapsed: 0 sec - in org.apache.poi.openxml4j.opc.TestPackagingURIHelper
Running org.apache.poi.openxml4j.opc.TestRelationships
Tests run: 9, Failures: 0, Errors: 0, Skipped: 0, Time elapsed: 0.044 sec - in org.apache.poi.openxml4j.opc.TestRelationships
Running org.apache.poi.openxml4j.opc.TestFileHelper
Tests run: 1, Failures: 0, Errors: 0, Skipped: 0, Time elapsed: 0 sec - in org.apache.poi.openxml4j.opc.TestFileHelper
Running org.apache.poi.openxml4j.opc.TestZipPackage
Tests run: 8, Failures: 0, Errors: 0, Skipped: 0, Time elapsed: 0.513 sec - in org.apache.poi.openxml4j.opc.TestZipPackage
Running org.apache.poi.openxml4j.opc.TestPackage
Tests run: 22, Failures: 0, Errors: 0, Skipped: 1, Time elapsed: 0.534 sec - in org.apache.poi.openxml4j.opc.TestPackage
Running org.apache.poi.openxml4j.opc.compliance.TestOPCCompliancePartName
Tests run: 10, Failures: 0, Errors: 0, Skipped: 0, Time elapsed: 0.001 sec - in org.apache.poi.openxml4j.opc.compliance.TestOPCCompliancePartName
Running org.apache.poi.openxml4j.opc.compliance.TestOPCComplianceCoreProperties
Tests run: 11, Failures: 0, Errors: 0, Skipped: 0, Time elapsed: 0.081 sec - in org.apache.poi.openxml4j.opc.compliance.TestOPCComplianceCoreProperties
Running org.apache.poi.openxml4j.opc.compliance.TestOPCCompliancePackageModel
Tests run: 5, Failures: 0, Errors: 0, Skipped: 0, Time elapsed: 0.002 sec - in org.apache.poi.openxml4j.opc.compliance.TestOPCCompliancePackageModel
Running org.apache.poi.TestEmbeded
Tests run: 3, Failures: 0, Errors: 0, Skipped: 0, Time elapsed: 0.056 sec - in org.apache.poi.TestEmbeded
Running org.apache.poi.util.TestSAXHelper
Tests run: 1, Failures: 0, Errors: 0, Skipped: 0, Time elapsed: 0 sec - in org.apache.poi.util.TestSAXHelper
Running org.apache.poi.util.TestIdentifierManager
Tests run: 5, Failures: 0, Errors: 0, Skipped: 0, Time elapsed: 0 sec - in org.apache.poi.util.TestIdentifierManager
Running org.apache.poi.poifs.crypt.TestCertificateEncryption
Tests run: 1, Failures: 0, Errors: 0, Skipped: 0, Time elapsed: 0.173 sec - in org.apache.poi.poifs.crypt.TestCertificateEncryption
Running org.apache.poi.poifs.crypt.TestEncryptor
Tests run: 6, Failures: 0, Errors: 0, Skipped: 3, Time elapsed: 0.282 sec - in org.apache.poi.poifs.crypt.TestEncryptor
Running org.apache.poi.poifs.crypt.TestDecryptor
Tests run: 7, Failures: 0, Errors: 0, Skipped: 1, Time elapsed: 0.275 sec - in org.apache.poi.poifs.crypt.TestDecryptor
Running org.apache.poi.poifs.crypt.TestHxxFEncryption
Tests run: 20, Failures: 0, Errors: 0, Skipped: 0, Time elapsed: 0.791 sec - in org.apache.poi.poifs.crypt.TestHxxFEncryption
Running org.apache.poi.poifs.crypt.TestAgileEncryptionParameters
Tests run: 60, Failures: 0, Errors: 0, Skipped: 20, Time elapsed: 7.433 sec - in org.apache.poi.poifs.crypt.TestAgileEncryptionParameters
Running org.apache.poi.poifs.crypt.TestSecureTempZip
Tests run: 2, Failures: 0, Errors: 0, Skipped: 1, Time elapsed: 0.042 sec - in org.apache.poi.poifs.crypt.TestSecureTempZip
Running org.apache.poi.poifs.crypt.TestEncryptionInfo
Tests run: 2, Failures: 0, Errors: 0, Skipped: 0, Time elapsed: 0.152 sec - in org.apache.poi.poifs.crypt.TestEncryptionInfo
Running org.apache.poi.poifs.crypt.TestSignatureInfo
SLF4J: Failed to load class "org.slf4j.impl.StaticLoggerBinder".
SLF4J: Defaulting to no-operation (NOP) logger implementation
SLF4J: See http://www.slf4j.org/codes.html#StaticLoggerBinder for further details.
Tests run: 12, Failures: 0, Errors: 0, Skipped: 0, Time elapsed: 86.39 sec - in org.apache.poi.poifs.crypt.TestSignatureInfo
Running org.apache.poi.TestPOIXMLProperties
Tests run: 6, Failures: 0, Errors: 0, Skipped: 0, Time elapsed: 0.106 sec - in org.apache.poi.TestPOIXMLProperties
Running org.apache.poi.dev.TestRecordGenerator
Tests run: 3, Failures: 0, Errors: 0, Skipped: 3, Time elapsed: 0.001 sec - in org.apache.poi.dev.TestRecordGenerator
Running org.apache.poi.dev.TestOOXMLLister
<https://builds.apache.org/job/POI-DSL-Maven/ws/test-data/spreadsheet/Formatting.xlsx>

/_rels/.rels
	application/vnd.openxmlformats-package.relationships+xml
	588 bytes
/docProps/app.xml
	application/vnd.openxmlformats-officedocument.extended-properties+xml
	839 bytes
	0 relations
/docProps/core.xml
	application/vnd.openxmlformats-package.core-properties+xml
	0 relations
/xl/_rels/workbook.xml.rels
	application/vnd.openxmlformats-package.relationships+xml
	980 bytes
/xl/sharedStrings.xml
	application/vnd.openxmlformats-officedocument.spreadsheetml.sharedStrings+xml
	477 bytes
	0 relations
/xl/styles.xml
	application/vnd.openxmlformats-officedocument.spreadsheetml.styles+xml
	2237 bytes
	0 relations
/xl/theme/theme1.xml
	application/vnd.openxmlformats-officedocument.theme+xml
	6995 bytes
	0 relations
/xl/workbook.xml
	application/vnd.openxmlformats-officedocument.spreadsheetml.sheet.main+xml
	624 bytes
	6 relations
	  Relationship:
	  	From: /xl/workbook.xml
	  	To:   /xl/worksheets/sheet1.xml
	  	ID:   rId1
	  	Mode: INTERNAL
	  	Type: http://schemas.openxmlformats.org/officeDocument/2006/relationships/worksheet
	  Relationship:
	  	From: /xl/workbook.xml
	  	To:   /xl/worksheets/sheet2.xml
	  	ID:   rId2
	  	Mode: INTERNAL
	  	Type: http://schemas.openxmlformats.org/officeDocument/2006/relationships/worksheet
	  Relationship:
	  	From: /xl/workbook.xml
	  	To:   /xl/worksheets/sheet3.xml
	  	ID:   rId3
	  	Mode: INTERNAL
	  	Type: http://schemas.openxmlformats.org/officeDocument/2006/relationships/worksheet
	  Relationship:
	  	From: /xl/workbook.xml
	  	To:   /xl/theme/theme1.xml
	  	ID:   rId4
	  	Mode: INTERNAL
	  	Type: http://schemas.openxmlformats.org/officeDocument/2006/relationships/theme
	  Relationship:
	  	From: /xl/workbook.xml
	  	To:   /xl/styles.xml
	  	ID:   rId5
	  	Mode: INTERNAL
	  	Type: http://schemas.openxmlformats.org/officeDocument/2006/relationships/styles
	  Relationship:
	  	From: /xl/workbook.xml
	  	To:   /xl/sharedStrings.xml
	  	ID:   rId6
	  	Mode: INTERNAL
	  	Type: http://schemas.openxmlformats.org/officeDocument/2006/relationships/sharedStrings
/xl/worksheets/sheet1.xml
	application/vnd.openxmlformats-officedocument.spreadsheetml.worksheet+xml
	1814 bytes
	0 relations
/xl/worksheets/sheet2.xml
	application/vnd.openxmlformats-officedocument.spreadsheetml.worksheet+xml
	439 bytes
	0 relations
/xl/worksheets/sheet3.xml
	application/vnd.openxmlformats-officedocument.spreadsheetml.worksheet+xml
	439 bytes
	0 relations

Relationship:
	From: /
	To:   /xl/workbook.xml
	ID:   rId1
	Mode: INTERNAL
	Type: http://schemas.openxmlformats.org/officeDocument/2006/relationships/officeDocument
Relationship:
	From: /
	To:   /docProps/core.xml
	ID:   rId2
	Mode: INTERNAL
	Type: http://schemas.openxmlformats.org/package/2006/relationships/metadata/core-properties
Relationship:
	From: /
	To:   /docProps/app.xml
	ID:   rId3
	Mode: INTERNAL
	Type: http://schemas.openxmlformats.org/officeDocument/2006/relationships/extended-properties
Tests run: 2, Failures: 0, Errors: 0, Skipped: 0, Time elapsed: 0.012 sec - in org.apache.poi.dev.TestOOXMLLister
Running org.apache.poi.dev.TestOOXMLPrettyPrint
Reading zip-file <https://builds.apache.org/job/POI-DSL-Maven/ws/test-data/spreadsheet/Formatting.xlsx>
and writing pretty-printed XML to /tmp/poifiles/Formatting6898109952139832785-pretty.xlsx
............
Done.
Tests run: 1, Failures: 0, Errors: 0, Skipped: 0, Time elapsed: 0.025 sec - in org.apache.poi.dev.TestOOXMLPrettyPrint

Results :

Tests in error: 
  TestSXSSFWorkbook.test56557:583 » Runtime Sample file '56557.xlsx' not found i...

Tests run: 2234, Failures: 0, Errors: 1, Skipped: 155

[INFO] ------------------------------------------------------------------------
[INFO] Reactor Summary:
[INFO] 
[INFO] Apache POI - the Java API for Microsoft Documents . SUCCESS [  0.002 s]
[INFO] Apache POI Main package ........................... SUCCESS [01:43 min]
[INFO] Apache POI Scratchpad package ..................... SUCCESS [ 18.877 s]
[INFO] Apache POI - Openxmlformats Schema package ........ SUCCESS [01:17 min]
[INFO] Apache POI - Openxmlformats Encryption Schema package  SUCCESS [  0.715 s]
[INFO] Apache POI - Openxmlformats Security-Schema package  SUCCESS [ 27.912 s]
[INFO] Apache POI OOXML package .......................... FAILURE [03:26 min]
[INFO] Apache POI ExcelAnt package ....................... SKIPPED
[INFO] Apache POI Examples package ....................... SKIPPED
[INFO] ------------------------------------------------------------------------
[INFO] BUILD FAILURE
[INFO] ------------------------------------------------------------------------
[INFO] Total time: 07:15 min
[INFO] Finished at: 2017-06-16T12:11:37+00:00
[INFO] Final Memory: 45M/762M
[INFO] ------------------------------------------------------------------------
[ERROR] Failed to execute goal org.apache.maven.plugins:maven-surefire-plugin:2.19.1:test
(default-test) on project poi-ooxml: There are test failures.
[ERROR] 
[ERROR] Please refer to <https://builds.apache.org/job/POI-DSL-Maven/ws/sonar/ooxml/target/surefire-reports>
for the individual test results.
[ERROR] -> [Help 1]
[ERROR] 
[ERROR] To see the full stack trace of the errors, re-run Maven with the -e switch.
[ERROR] Re-run Maven using the -X switch to enable full debug logging.
[ERROR] 
[ERROR] For more information about the errors and possible solutions, please read the following
articles:
[ERROR] [Help 1] http://cwiki.apache.org/confluence/display/MAVEN/MojoFailureException
[ERROR] 
[ERROR] After correcting the problems, you can resume the build with the command
[ERROR]   mvn <goals> -rf :poi-ooxml
Build step 'Invoke top-level Maven targets' marked build as failure

---------------------------------------------------------------------
To unsubscribe, e-mail: dev-unsubscribe@poi.apache.org
For additional commands, e-mail: dev-help@poi.apache.org


Mime
View raw message