poi-dev mailing list archives

Site index · List index
Message view « Date » · « Thread »
Top « Date » · « Thread »
From Apache Jenkins Server <jenk...@builds.apache.org>
Subject Build failed in Jenkins: POI-DSL-Maven #159
Date Sat, 15 Apr 2017 16:04:10 GMT
See <https://builds.apache.org/job/POI-DSL-Maven/159/display/redirect?page=changes>

Changes:

[kiwiwings] add summary info to 3.16 final

[kiwiwings] #60993 - HSLF: Grid and rowspan calculation in table cells is wrong

------------------------------------------
[...truncated 11.90 KB...]
[INFO] --- maven-resources-plugin:3.0.1:copy-resources (copy-resources) @ poi-main ---
[INFO] Using 'ASCII' encoding to copy filtered resources.
[INFO] Copying 4 resources
[INFO] 
[INFO] --- maven-resources-plugin:3.0.1:resources (default-resources) @ poi-main ---
[INFO] Using 'ASCII' encoding to copy filtered resources.
[INFO] Copying 4 resources
[INFO] 
[INFO] --- maven-compiler-plugin:3.5.1:compile (default-compile) @ poi-main ---
[INFO] Changes detected - recompiling the module!
[INFO] Compiling 1210 source files to <https://builds.apache.org/job/POI-DSL-Maven/ws/sonar/main/target/classes>
[WARNING] <https://builds.apache.org/job/POI-DSL-Maven/ws/sonar/main/src/main/java/org/apache/poi/ss/usermodel/DateUtil.java>:[52,34]
unmappable character for encoding US-ASCII
[WARNING] <https://builds.apache.org/job/POI-DSL-Maven/ws/sonar/main/src/main/java/org/apache/poi/ss/usermodel/DateUtil.java>:[52,35]
unmappable character for encoding US-ASCII
[WARNING] <https://builds.apache.org/job/POI-DSL-Maven/ws/sonar/main/src/main/java/org/apache/poi/ss/usermodel/DateUtil.java>:[52,36]
unmappable character for encoding US-ASCII
[WARNING] <https://builds.apache.org/job/POI-DSL-Maven/ws/sonar/main/src/main/java/org/apache/poi/ss/usermodel/DateUtil.java>:[52,37]
unmappable character for encoding US-ASCII
[WARNING] <https://builds.apache.org/job/POI-DSL-Maven/ws/sonar/main/src/main/java/org/apache/poi/ss/usermodel/DateUtil.java>:[52,38]
unmappable character for encoding US-ASCII
[WARNING] <https://builds.apache.org/job/POI-DSL-Maven/ws/sonar/main/src/main/java/org/apache/poi/ss/usermodel/DateUtil.java>:[52,39]
unmappable character for encoding US-ASCII
[WARNING] <https://builds.apache.org/job/POI-DSL-Maven/ws/sonar/main/src/main/java/org/apache/poi/ss/usermodel/DateUtil.java>:[52,40]
unmappable character for encoding US-ASCII
[WARNING] <https://builds.apache.org/job/POI-DSL-Maven/ws/sonar/main/src/main/java/org/apache/poi/ss/usermodel/DateUtil.java>:[52,41]
unmappable character for encoding US-ASCII
[WARNING] <https://builds.apache.org/job/POI-DSL-Maven/ws/sonar/main/src/main/java/org/apache/poi/ss/usermodel/DateUtil.java>:[52,42]
unmappable character for encoding US-ASCII
[WARNING] <https://builds.apache.org/job/POI-DSL-Maven/ws/sonar/main/src/main/java/org/apache/poi/ss/usermodel/DateUtil.java>:[52,43]
unmappable character for encoding US-ASCII
[WARNING] <https://builds.apache.org/job/POI-DSL-Maven/ws/sonar/main/src/main/java/org/apache/poi/ss/usermodel/DateUtil.java>:[52,44]
unmappable character for encoding US-ASCII
[WARNING] <https://builds.apache.org/job/POI-DSL-Maven/ws/sonar/main/src/main/java/org/apache/poi/ss/usermodel/DateUtil.java>:[52,45]
unmappable character for encoding US-ASCII
[WARNING] <https://builds.apache.org/job/POI-DSL-Maven/ws/sonar/main/src/main/java/org/apache/poi/ss/usermodel/DateUtil.java>:[52,46]
unmappable character for encoding US-ASCII
[WARNING] <https://builds.apache.org/job/POI-DSL-Maven/ws/sonar/main/src/main/java/org/apache/poi/ss/usermodel/DateUtil.java>:[52,47]
unmappable character for encoding US-ASCII
[WARNING] <https://builds.apache.org/job/POI-DSL-Maven/ws/sonar/main/src/main/java/org/apache/poi/ss/usermodel/DateUtil.java>:[52,48]
unmappable character for encoding US-ASCII
[WARNING] <https://builds.apache.org/job/POI-DSL-Maven/ws/sonar/main/src/main/java/org/apache/poi/ss/usermodel/DateUtil.java>:[52,87]
unmappable character for encoding US-ASCII
[WARNING] <https://builds.apache.org/job/POI-DSL-Maven/ws/sonar/main/src/main/java/org/apache/poi/ss/usermodel/DateUtil.java>:[52,88]
unmappable character for encoding US-ASCII
[WARNING] <https://builds.apache.org/job/POI-DSL-Maven/ws/sonar/main/src/main/java/org/apache/poi/ss/usermodel/DateUtil.java>:[52,89]
unmappable character for encoding US-ASCII
[WARNING] <https://builds.apache.org/job/POI-DSL-Maven/ws/sonar/main/src/main/java/org/apache/poi/ss/usermodel/DateUtil.java>:[52,91]
unmappable character for encoding US-ASCII
[WARNING] <https://builds.apache.org/job/POI-DSL-Maven/ws/sonar/main/src/main/java/org/apache/poi/ss/usermodel/DateUtil.java>:[52,92]
unmappable character for encoding US-ASCII
[WARNING] <https://builds.apache.org/job/POI-DSL-Maven/ws/sonar/main/src/main/java/org/apache/poi/ss/usermodel/DateUtil.java>:[52,93]
unmappable character for encoding US-ASCII
[WARNING] <https://builds.apache.org/job/POI-DSL-Maven/ws/sonar/main/src/main/java/org/apache/poi/ss/usermodel/DateUtil.java>:[52,95]
unmappable character for encoding US-ASCII
[WARNING] <https://builds.apache.org/job/POI-DSL-Maven/ws/sonar/main/src/main/java/org/apache/poi/ss/usermodel/DateUtil.java>:[52,96]
unmappable character for encoding US-ASCII
[WARNING] <https://builds.apache.org/job/POI-DSL-Maven/ws/sonar/main/src/main/java/org/apache/poi/ss/usermodel/DateUtil.java>:[52,97]
unmappable character for encoding US-ASCII
[INFO] Some input files use or override a deprecated API.
[INFO] Recompile with -Xlint:deprecation for details.
[INFO] <https://builds.apache.org/job/POI-DSL-Maven/ws/sonar/main/src/main/java/org/apache/poi/hpsf/CustomProperties.java>
uses unchecked or unsafe operations.
[INFO] Recompile with -Xlint:unchecked for details.
[INFO] 
[INFO] --- maven-resources-plugin:3.0.1:copy-resources (copy-tests) @ poi-main ---
[INFO] Using 'ASCII' encoding to copy filtered resources.
[INFO] Copying 535 resources
[INFO] 
[INFO] --- maven-resources-plugin:3.0.1:testResources (default-testResources) @ poi-main ---
[INFO] Using 'ASCII' encoding to copy filtered resources.
[INFO] skip non existing resourceDirectory <https://builds.apache.org/job/POI-DSL-Maven/ws/sonar/main/src/test/resources>
[INFO] 
[INFO] --- maven-compiler-plugin:3.5.1:testCompile (default-testCompile) @ poi-main ---
[INFO] Changes detected - recompiling the module!
[INFO] Compiling 532 source files to <https://builds.apache.org/job/POI-DSL-Maven/ws/sonar/main/target/test-classes>
[INFO] Some input files use or override a deprecated API.
[INFO] Recompile with -Xlint:deprecation for details.
[INFO] -------------------------------------------------------------
[WARNING] COMPILATION WARNING : 
[INFO] -------------------------------------------------------------
[WARNING] <https://builds.apache.org/job/POI-DSL-Maven/ws/sonar/main/src/test/java/org/apache/poi/ss/usermodel/TestDateUtil.java>:[113,27]
unmappable character for encoding US-ASCII
[WARNING] <https://builds.apache.org/job/POI-DSL-Maven/ws/sonar/main/src/test/java/org/apache/poi/ss/usermodel/TestDateUtil.java>:[113,28]
unmappable character for encoding US-ASCII
[WARNING] <https://builds.apache.org/job/POI-DSL-Maven/ws/sonar/main/src/test/java/org/apache/poi/ss/usermodel/TestDateUtil.java>:[113,29]
unmappable character for encoding US-ASCII
[WARNING] <https://builds.apache.org/job/POI-DSL-Maven/ws/sonar/main/src/test/java/org/apache/poi/ss/usermodel/TestDateUtil.java>:[113,32]
unmappable character for encoding US-ASCII
[WARNING] <https://builds.apache.org/job/POI-DSL-Maven/ws/sonar/main/src/test/java/org/apache/poi/ss/usermodel/TestDateUtil.java>:[113,33]
unmappable character for encoding US-ASCII
[WARNING] <https://builds.apache.org/job/POI-DSL-Maven/ws/sonar/main/src/test/java/org/apache/poi/ss/usermodel/TestDateUtil.java>:[113,34]
unmappable character for encoding US-ASCII
[WARNING] <https://builds.apache.org/job/POI-DSL-Maven/ws/sonar/main/src/test/java/org/apache/poi/ss/usermodel/TestDateUtil.java>:[113,36]
unmappable character for encoding US-ASCII
[WARNING] <https://builds.apache.org/job/POI-DSL-Maven/ws/sonar/main/src/test/java/org/apache/poi/ss/usermodel/TestDateUtil.java>:[113,37]
unmappable character for encoding US-ASCII
[WARNING] <https://builds.apache.org/job/POI-DSL-Maven/ws/sonar/main/src/test/java/org/apache/poi/ss/usermodel/TestDateUtil.java>:[113,38]
unmappable character for encoding US-ASCII
[WARNING] <https://builds.apache.org/job/POI-DSL-Maven/ws/sonar/main/src/test/java/org/apache/poi/ss/usermodel/TestDateUtil.java>:[115,27]
unmappable character for encoding US-ASCII
[WARNING] <https://builds.apache.org/job/POI-DSL-Maven/ws/sonar/main/src/test/java/org/apache/poi/ss/usermodel/TestDateUtil.java>:[115,28]
unmappable character for encoding US-ASCII
[WARNING] <https://builds.apache.org/job/POI-DSL-Maven/ws/sonar/main/src/test/java/org/apache/poi/ss/usermodel/TestDateUtil.java>:[115,29]
unmappable character for encoding US-ASCII
[WARNING] <https://builds.apache.org/job/POI-DSL-Maven/ws/sonar/main/src/test/java/org/apache/poi/ss/usermodel/TestDateUtil.java>:[115,32]
unmappable character for encoding US-ASCII
[WARNING] <https://builds.apache.org/job/POI-DSL-Maven/ws/sonar/main/src/test/java/org/apache/poi/ss/usermodel/TestDateUtil.java>:[115,33]
unmappable character for encoding US-ASCII
[WARNING] <https://builds.apache.org/job/POI-DSL-Maven/ws/sonar/main/src/test/java/org/apache/poi/ss/usermodel/TestDateUtil.java>:[115,34]
unmappable character for encoding US-ASCII
[WARNING] <https://builds.apache.org/job/POI-DSL-Maven/ws/sonar/main/src/test/java/org/apache/poi/ss/usermodel/TestDateUtil.java>:[117,25]
unmappable character for encoding US-ASCII
[WARNING] <https://builds.apache.org/job/POI-DSL-Maven/ws/sonar/main/src/test/java/org/apache/poi/ss/usermodel/TestDateUtil.java>:[117,26]
unmappable character for encoding US-ASCII
[WARNING] <https://builds.apache.org/job/POI-DSL-Maven/ws/sonar/main/src/test/java/org/apache/poi/ss/usermodel/TestDateUtil.java>:[117,27]
unmappable character for encoding US-ASCII
[WARNING] <https://builds.apache.org/job/POI-DSL-Maven/ws/sonar/main/src/test/java/org/apache/poi/ss/usermodel/TestDateUtil.java>:[117,29]
unmappable character for encoding US-ASCII
[WARNING] <https://builds.apache.org/job/POI-DSL-Maven/ws/sonar/main/src/test/java/org/apache/poi/ss/usermodel/TestDateUtil.java>:[117,30]
unmappable character for encoding US-ASCII
[WARNING] <https://builds.apache.org/job/POI-DSL-Maven/ws/sonar/main/src/test/java/org/apache/poi/ss/usermodel/TestDateUtil.java>:[117,31]
unmappable character for encoding US-ASCII
[WARNING] <https://builds.apache.org/job/POI-DSL-Maven/ws/sonar/main/src/test/java/org/apache/poi/ss/usermodel/TestDateUtil.java>:[119,23]
unmappable character for encoding US-ASCII
[WARNING] <https://builds.apache.org/job/POI-DSL-Maven/ws/sonar/main/src/test/java/org/apache/poi/ss/usermodel/TestDateUtil.java>:[119,24]
unmappable character for encoding US-ASCII
[WARNING] <https://builds.apache.org/job/POI-DSL-Maven/ws/sonar/main/src/test/java/org/apache/poi/ss/usermodel/TestDateUtil.java>:[119,25]
unmappable character for encoding US-ASCII
[WARNING] <https://builds.apache.org/job/POI-DSL-Maven/ws/sonar/main/src/test/java/org/apache/poi/ss/usermodel/TestDateUtil.java>:[119,26]
unmappable character for encoding US-ASCII
[WARNING] <https://builds.apache.org/job/POI-DSL-Maven/ws/sonar/main/src/test/java/org/apache/poi/ss/usermodel/TestDateUtil.java>:[119,27]
unmappable character for encoding US-ASCII
[WARNING] <https://builds.apache.org/job/POI-DSL-Maven/ws/sonar/main/src/test/java/org/apache/poi/ss/usermodel/TestDateUtil.java>:[119,28]
unmappable character for encoding US-ASCII
[WARNING] <https://builds.apache.org/job/POI-DSL-Maven/ws/sonar/main/src/test/java/org/apache/poi/ss/usermodel/TestDateUtil.java>:[119,29]
unmappable character for encoding US-ASCII
[WARNING] <https://builds.apache.org/job/POI-DSL-Maven/ws/sonar/main/src/test/java/org/apache/poi/ss/usermodel/TestDateUtil.java>:[119,30]
unmappable character for encoding US-ASCII
[WARNING] <https://builds.apache.org/job/POI-DSL-Maven/ws/sonar/main/src/test/java/org/apache/poi/ss/usermodel/TestDateUtil.java>:[119,31]
unmappable character for encoding US-ASCII
[WARNING] <https://builds.apache.org/job/POI-DSL-Maven/ws/sonar/main/src/test/java/org/apache/poi/ss/usermodel/TestDateUtil.java>:[119,32]
unmappable character for encoding US-ASCII
[WARNING] <https://builds.apache.org/job/POI-DSL-Maven/ws/sonar/main/src/test/java/org/apache/poi/ss/usermodel/TestDateUtil.java>:[119,33]
unmappable character for encoding US-ASCII
[WARNING] <https://builds.apache.org/job/POI-DSL-Maven/ws/sonar/main/src/test/java/org/apache/poi/ss/usermodel/TestDateUtil.java>:[119,34]
unmappable character for encoding US-ASCII
[WARNING] <https://builds.apache.org/job/POI-DSL-Maven/ws/sonar/main/src/test/java/org/apache/poi/ss/usermodel/TestDateUtil.java>:[119,35]
unmappable character for encoding US-ASCII
[WARNING] <https://builds.apache.org/job/POI-DSL-Maven/ws/sonar/main/src/test/java/org/apache/poi/ss/usermodel/TestDateUtil.java>:[119,36]
unmappable character for encoding US-ASCII
[WARNING] <https://builds.apache.org/job/POI-DSL-Maven/ws/sonar/main/src/test/java/org/apache/poi/ss/usermodel/TestDateUtil.java>:[119,37]
unmappable character for encoding US-ASCII
[WARNING] <https://builds.apache.org/job/POI-DSL-Maven/ws/sonar/main/src/test/java/org/apache/poi/ss/usermodel/TestDateUtil.java>:[121,23]
unmappable character for encoding US-ASCII
[WARNING] <https://builds.apache.org/job/POI-DSL-Maven/ws/sonar/main/src/test/java/org/apache/poi/ss/usermodel/TestDateUtil.java>:[121,24]
unmappable character for encoding US-ASCII
[WARNING] <https://builds.apache.org/job/POI-DSL-Maven/ws/sonar/main/src/test/java/org/apache/poi/ss/usermodel/TestDateUtil.java>:[121,25]
unmappable character for encoding US-ASCII
[WARNING] <https://builds.apache.org/job/POI-DSL-Maven/ws/sonar/main/src/test/java/org/apache/poi/ss/usermodel/TestDateUtil.java>:[121,26]
unmappable character for encoding US-ASCII
[WARNING] <https://builds.apache.org/job/POI-DSL-Maven/ws/sonar/main/src/test/java/org/apache/poi/ss/usermodel/TestDateUtil.java>:[121,27]
unmappable character for encoding US-ASCII
[WARNING] <https://builds.apache.org/job/POI-DSL-Maven/ws/sonar/main/src/test/java/org/apache/poi/ss/usermodel/TestDateUtil.java>:[121,28]
unmappable character for encoding US-ASCII
[WARNING] <https://builds.apache.org/job/POI-DSL-Maven/ws/sonar/main/src/test/java/org/apache/poi/ss/usermodel/TestDateUtil.java>:[121,29]
unmappable character for encoding US-ASCII
[WARNING] <https://builds.apache.org/job/POI-DSL-Maven/ws/sonar/main/src/test/java/org/apache/poi/ss/usermodel/TestDateUtil.java>:[121,30]
unmappable character for encoding US-ASCII
[WARNING] <https://builds.apache.org/job/POI-DSL-Maven/ws/sonar/main/src/test/java/org/apache/poi/ss/usermodel/TestDateUtil.java>:[121,31]
unmappable character for encoding US-ASCII
[WARNING] <https://builds.apache.org/job/POI-DSL-Maven/ws/sonar/main/src/test/java/org/apache/poi/ss/usermodel/TestDateUtil.java>:[121,32]
unmappable character for encoding US-ASCII
[WARNING] <https://builds.apache.org/job/POI-DSL-Maven/ws/sonar/main/src/test/java/org/apache/poi/ss/usermodel/TestDateUtil.java>:[121,33]
unmappable character for encoding US-ASCII
[WARNING] <https://builds.apache.org/job/POI-DSL-Maven/ws/sonar/main/src/test/java/org/apache/poi/ss/usermodel/TestDateUtil.java>:[121,34]
unmappable character for encoding US-ASCII
[WARNING] <https://builds.apache.org/job/POI-DSL-Maven/ws/sonar/main/src/test/java/org/apache/poi/ss/usermodel/TestDateUtil.java>:[121,35]
unmappable character for encoding US-ASCII
[WARNING] <https://builds.apache.org/job/POI-DSL-Maven/ws/sonar/main/src/test/java/org/apache/poi/ss/usermodel/TestDateUtil.java>:[121,36]
unmappable character for encoding US-ASCII
[WARNING] <https://builds.apache.org/job/POI-DSL-Maven/ws/sonar/main/src/test/java/org/apache/poi/ss/usermodel/TestDateUtil.java>:[121,37]
unmappable character for encoding US-ASCII
[WARNING] <https://builds.apache.org/job/POI-DSL-Maven/ws/sonar/main/src/test/java/org/apache/poi/ss/usermodel/TestDateUtil.java>:[121,38]
unmappable character for encoding US-ASCII
[WARNING] <https://builds.apache.org/job/POI-DSL-Maven/ws/sonar/main/src/test/java/org/apache/poi/ss/usermodel/TestDateUtil.java>:[121,39]
unmappable character for encoding US-ASCII
[WARNING] <https://builds.apache.org/job/POI-DSL-Maven/ws/sonar/main/src/test/java/org/apache/poi/ss/usermodel/TestDateUtil.java>:[121,40]
unmappable character for encoding US-ASCII
[WARNING] <https://builds.apache.org/job/POI-DSL-Maven/ws/sonar/main/src/test/java/org/apache/poi/ss/usermodel/TestDateUtil.java>:[121,41]
unmappable character for encoding US-ASCII
[WARNING] <https://builds.apache.org/job/POI-DSL-Maven/ws/sonar/main/src/test/java/org/apache/poi/ss/usermodel/TestDateUtil.java>:[121,42]
unmappable character for encoding US-ASCII
[WARNING] <https://builds.apache.org/job/POI-DSL-Maven/ws/sonar/main/src/test/java/org/apache/poi/ss/usermodel/TestDateUtil.java>:[121,43]
unmappable character for encoding US-ASCII
[WARNING] <https://builds.apache.org/job/POI-DSL-Maven/ws/sonar/main/src/test/java/org/apache/poi/ss/usermodel/TestDateUtil.java>:[121,44]
unmappable character for encoding US-ASCII
[WARNING] <https://builds.apache.org/job/POI-DSL-Maven/ws/sonar/main/src/test/java/org/apache/poi/ss/usermodel/TestDateUtil.java>:[121,45]
unmappable character for encoding US-ASCII
[WARNING] <https://builds.apache.org/job/POI-DSL-Maven/ws/sonar/main/src/test/java/org/apache/poi/ss/usermodel/TestDateUtil.java>:[121,46]
unmappable character for encoding US-ASCII
[WARNING] <https://builds.apache.org/job/POI-DSL-Maven/ws/sonar/main/src/test/java/org/apache/poi/ss/usermodel/TestDateUtil.java>:[121,47]
unmappable character for encoding US-ASCII
[WARNING] <https://builds.apache.org/job/POI-DSL-Maven/ws/sonar/main/src/test/java/org/apache/poi/ss/usermodel/TestDateUtil.java>:[121,48]
unmappable character for encoding US-ASCII
[WARNING] <https://builds.apache.org/job/POI-DSL-Maven/ws/sonar/main/src/test/java/org/apache/poi/ss/usermodel/TestDateUtil.java>:[121,49]
unmappable character for encoding US-ASCII
[WARNING] <https://builds.apache.org/job/POI-DSL-Maven/ws/sonar/main/src/test/java/org/apache/poi/ss/usermodel/TestDateUtil.java>:[121,50]
unmappable character for encoding US-ASCII
[WARNING] <https://builds.apache.org/job/POI-DSL-Maven/ws/sonar/main/src/test/java/org/apache/poi/ss/usermodel/TestDateUtil.java>:[121,51]
unmappable character for encoding US-ASCII
[WARNING] <https://builds.apache.org/job/POI-DSL-Maven/ws/sonar/main/src/test/java/org/apache/poi/ss/usermodel/TestDateUtil.java>:[121,52]
unmappable character for encoding US-ASCII
[WARNING] <https://builds.apache.org/job/POI-DSL-Maven/ws/sonar/main/src/test/java/org/apache/poi/ss/usermodel/TestDateUtil.java>:[121,53]
unmappable character for encoding US-ASCII
[WARNING] <https://builds.apache.org/job/POI-DSL-Maven/ws/sonar/main/src/test/java/org/apache/poi/ss/usermodel/TestDateUtil.java>:[121,54]
unmappable character for encoding US-ASCII
[WARNING] <https://builds.apache.org/job/POI-DSL-Maven/ws/sonar/main/src/test/java/org/apache/poi/ss/usermodel/TestDateUtil.java>:[121,55]
unmappable character for encoding US-ASCII
[WARNING] <https://builds.apache.org/job/POI-DSL-Maven/ws/sonar/main/src/test/java/org/apache/poi/ss/usermodel/TestDateUtil.java>:[123,23]
unmappable character for encoding US-ASCII
[WARNING] <https://builds.apache.org/job/POI-DSL-Maven/ws/sonar/main/src/test/java/org/apache/poi/ss/usermodel/TestDateUtil.java>:[123,24]
unmappable character for encoding US-ASCII
[WARNING] <https://builds.apache.org/job/POI-DSL-Maven/ws/sonar/main/src/test/java/org/apache/poi/ss/usermodel/TestDateUtil.java>:[123,25]
unmappable character for encoding US-ASCII
[WARNING] <https://builds.apache.org/job/POI-DSL-Maven/ws/sonar/main/src/test/java/org/apache/poi/ss/usermodel/TestDateUtil.java>:[123,26]
unmappable character for encoding US-ASCII
[WARNING] <https://builds.apache.org/job/POI-DSL-Maven/ws/sonar/main/src/test/java/org/apache/poi/ss/usermodel/TestDateUtil.java>:[123,27]
unmappable character for encoding US-ASCII
[WARNING] <https://builds.apache.org/job/POI-DSL-Maven/ws/sonar/main/src/test/java/org/apache/poi/ss/usermodel/TestDateUtil.java>:[123,28]
unmappable character for encoding US-ASCII
[WARNING] <https://builds.apache.org/job/POI-DSL-Maven/ws/sonar/main/src/test/java/org/apache/poi/ss/usermodel/TestDateUtil.java>:[123,29]
unmappable character for encoding US-ASCII
[WARNING] <https://builds.apache.org/job/POI-DSL-Maven/ws/sonar/main/src/test/java/org/apache/poi/ss/usermodel/TestDateUtil.java>:[123,30]
unmappable character for encoding US-ASCII
[WARNING] <https://builds.apache.org/job/POI-DSL-Maven/ws/sonar/main/src/test/java/org/apache/poi/ss/usermodel/TestDateUtil.java>:[123,31]
unmappable character for encoding US-ASCII
[WARNING] <https://builds.apache.org/job/POI-DSL-Maven/ws/sonar/main/src/test/java/org/apache/poi/ss/usermodel/TestDateUtil.java>:[123,32]
unmappable character for encoding US-ASCII
[WARNING] <https://builds.apache.org/job/POI-DSL-Maven/ws/sonar/main/src/test/java/org/apache/poi/ss/usermodel/TestDateUtil.java>:[123,33]
unmappable character for encoding US-ASCII
[WARNING] <https://builds.apache.org/job/POI-DSL-Maven/ws/sonar/main/src/test/java/org/apache/poi/ss/usermodel/TestDateUtil.java>:[123,34]
unmappable character for encoding US-ASCII
[WARNING] <https://builds.apache.org/job/POI-DSL-Maven/ws/sonar/main/src/test/java/org/apache/poi/ss/usermodel/TestDateUtil.java>:[123,35]
unmappable character for encoding US-ASCII
[WARNING] <https://builds.apache.org/job/POI-DSL-Maven/ws/sonar/main/src/test/java/org/apache/poi/ss/usermodel/TestDateUtil.java>:[123,36]
unmappable character for encoding US-ASCII
[WARNING] <https://builds.apache.org/job/POI-DSL-Maven/ws/sonar/main/src/test/java/org/apache/poi/ss/usermodel/TestDateUtil.java>:[123,37]
unmappable character for encoding US-ASCII
[WARNING] <https://builds.apache.org/job/POI-DSL-Maven/ws/sonar/main/src/test/java/org/apache/poi/ss/usermodel/TestDateUtil.java>:[123,38]
unmappable character for encoding US-ASCII
[WARNING] <https://builds.apache.org/job/POI-DSL-Maven/ws/sonar/main/src/test/java/org/apache/poi/ss/usermodel/TestDateUtil.java>:[123,39]
unmappable character for encoding US-ASCII
[WARNING] <https://builds.apache.org/job/POI-DSL-Maven/ws/sonar/main/src/test/java/org/apache/poi/ss/usermodel/TestDateUtil.java>:[123,40]
unmappable character for encoding US-ASCII
[WARNING] <https://builds.apache.org/job/POI-DSL-Maven/ws/sonar/main/src/test/java/org/apache/poi/ss/usermodel/TestDateUtil.java>:[123,41]
unmappable character for encoding US-ASCII
[WARNING] <https://builds.apache.org/job/POI-DSL-Maven/ws/sonar/main/src/test/java/org/apache/poi/ss/usermodel/TestDateUtil.java>:[123,42]
unmappable character for encoding US-ASCII
[WARNING] <https://builds.apache.org/job/POI-DSL-Maven/ws/sonar/main/src/test/java/org/apache/poi/ss/usermodel/TestDateUtil.java>:[123,43]
unmappable character for encoding US-ASCII
[WARNING] <https://builds.apache.org/job/POI-DSL-Maven/ws/sonar/main/src/test/java/org/apache/poi/ss/usermodel/TestDateUtil.java>:[123,44]
unmappable character for encoding US-ASCII
[WARNING] <https://builds.apache.org/job/POI-DSL-Maven/ws/sonar/main/src/test/java/org/apache/poi/ss/usermodel/TestDateUtil.java>:[123,45]
unmappable character for encoding US-ASCII
[WARNING] <https://builds.apache.org/job/POI-DSL-Maven/ws/sonar/main/src/test/java/org/apache/poi/ss/usermodel/TestDateUtil.java>:[123,46]
unmappable character for encoding US-ASCII
[WARNING] <https://builds.apache.org/job/POI-DSL-Maven/ws/sonar/main/src/test/java/org/apache/poi/ss/usermodel/TestDateUtil.java>:[123,47]
unmappable character for encoding US-ASCII
[WARNING] <https://builds.apache.org/job/POI-DSL-Maven/ws/sonar/main/src/test/java/org/apache/poi/ss/usermodel/TestDateUtil.java>:[123,48]
unmappable character for encoding US-ASCII
[WARNING] <https://builds.apache.org/job/POI-DSL-Maven/ws/sonar/main/src/test/java/org/apache/poi/ss/usermodel/TestDateUtil.java>:[123,49]
unmappable character for encoding US-ASCII
[WARNING] <https://builds.apache.org/job/POI-DSL-Maven/ws/sonar/main/src/test/java/org/apache/poi/ss/usermodel/TestDateUtil.java>:[123,50]
unmappable character for encoding US-ASCII
[WARNING] <https://builds.apache.org/job/POI-DSL-Maven/ws/sonar/main/src/test/java/org/apache/poi/ss/usermodel/TestDateUtil.java>:[123,51]
unmappable character for encoding US-ASCII
[WARNING] <https://builds.apache.org/job/POI-DSL-Maven/ws/sonar/main/src/test/java/org/apache/poi/ss/usermodel/TestDateUtil.java>:[123,52]
unmappable character for encoding US-ASCII
[INFO] 99 warnings 
[INFO] -------------------------------------------------------------
[INFO] -------------------------------------------------------------
[ERROR] COMPILATION ERROR : 
[INFO] -------------------------------------------------------------
[ERROR] <https://builds.apache.org/job/POI-DSL-Maven/ws/sonar/main/src/test/java/org/apache/poi/POITestCase.java>:[33,27]
cannot find symbol
symbol  : class Matchers
location: package org.hamcrest
[ERROR] <https://builds.apache.org/job/POI-DSL-Maven/ws/sonar/main/src/test/java/org/apache/poi/POITestCase.java>:[33,1]
static import only from classes and interfaces
[ERROR] <https://builds.apache.org/job/POI-DSL-Maven/ws/sonar/main/src/test/java/org/apache/poi/POITestCase.java>:[34,27]
cannot find symbol
symbol  : class Matchers
location: package org.hamcrest
[ERROR] <https://builds.apache.org/job/POI-DSL-Maven/ws/sonar/main/src/test/java/org/apache/poi/POITestCase.java>:[34,1]
static import only from classes and interfaces
[ERROR] <https://builds.apache.org/job/POI-DSL-Maven/ws/sonar/main/src/test/java/org/apache/poi/POITestCase.java>:[35,27]
cannot find symbol
symbol  : class Matchers
location: package org.hamcrest
[ERROR] <https://builds.apache.org/job/POI-DSL-Maven/ws/sonar/main/src/test/java/org/apache/poi/POITestCase.java>:[35,1]
static import only from classes and interfaces
[ERROR] <https://builds.apache.org/job/POI-DSL-Maven/ws/sonar/main/src/test/java/org/apache/poi/POITestCase.java>:[36,27]
cannot find symbol
symbol  : class Matchers
location: package org.hamcrest
[ERROR] <https://builds.apache.org/job/POI-DSL-Maven/ws/sonar/main/src/test/java/org/apache/poi/POITestCase.java>:[36,1]
static import only from classes and interfaces
[ERROR] <https://builds.apache.org/job/POI-DSL-Maven/ws/sonar/main/src/test/java/org/apache/poi/POITestCase.java>:[269,36]
cannot find symbol
symbol  : method greaterThanOrEqualTo(int)
location: class org.apache.poi.POITestCase
[ERROR] <https://builds.apache.org/job/POI-DSL-Maven/ws/sonar/main/src/test/java/org/apache/poi/POITestCase.java>:[270,36]
cannot find symbol
symbol  : method lessThanOrEqualTo(int)
location: class org.apache.poi.POITestCase
[ERROR] <https://builds.apache.org/job/POI-DSL-Maven/ws/sonar/main/src/test/java/org/apache/poi/POITestCase.java>:[273,36]
cannot find symbol
symbol  : method greaterThan(int)
location: class org.apache.poi.POITestCase
[ERROR] <https://builds.apache.org/job/POI-DSL-Maven/ws/sonar/main/src/test/java/org/apache/poi/POITestCase.java>:[274,36]
cannot find symbol
symbol  : method lessThan(int)
location: class org.apache.poi.POITestCase
[INFO] 12 errors 
[INFO] -------------------------------------------------------------
[INFO] ------------------------------------------------------------------------
[INFO] Reactor Summary:
[INFO] 
[INFO] Apache POI - the Java API for Microsoft Documents . SUCCESS [  0.003 s]
[INFO] Apache POI Main package ........................... FAILURE [ 13.332 s]
[INFO] Apache POI Scratchpad package ..................... SKIPPED
[INFO] Apache POI - Openxmlformats Schema package ........ SKIPPED
[INFO] Apache POI - Openxmlformats Encryption Schema package  SKIPPED
[INFO] Apache POI - Openxmlformats Security-Schema package  SKIPPED
[INFO] Apache POI OOXML package .......................... SKIPPED
[INFO] Apache POI ExcelAnt package ....................... SKIPPED
[INFO] Apache POI Examples package ....................... SKIPPED
[INFO] ------------------------------------------------------------------------
[INFO] BUILD FAILURE
[INFO] ------------------------------------------------------------------------
[INFO] Total time: 13.591 s
[INFO] Finished at: 2017-04-15T16:04:08+00:00
[INFO] Final Memory: 29M/693M
[INFO] ------------------------------------------------------------------------
[ERROR] Failed to execute goal org.apache.maven.plugins:maven-compiler-plugin:3.5.1:testCompile
(default-testCompile) on project poi-main: Compilation failure: Compilation failure:
[ERROR] <https://builds.apache.org/job/POI-DSL-Maven/ws/sonar/main/src/test/java/org/apache/poi/POITestCase.java>:[33,27]
cannot find symbol
[ERROR] symbol  : class Matchers
[ERROR] location: package org.hamcrest
[ERROR] <https://builds.apache.org/job/POI-DSL-Maven/ws/sonar/main/src/test/java/org/apache/poi/POITestCase.java>:[33,1]
static import only from classes and interfaces
[ERROR] <https://builds.apache.org/job/POI-DSL-Maven/ws/sonar/main/src/test/java/org/apache/poi/POITestCase.java>:[34,27]
cannot find symbol
[ERROR] symbol  : class Matchers
[ERROR] location: package org.hamcrest
[ERROR] <https://builds.apache.org/job/POI-DSL-Maven/ws/sonar/main/src/test/java/org/apache/poi/POITestCase.java>:[34,1]
static import only from classes and interfaces
[ERROR] <https://builds.apache.org/job/POI-DSL-Maven/ws/sonar/main/src/test/java/org/apache/poi/POITestCase.java>:[35,27]
cannot find symbol
[ERROR] symbol  : class Matchers
[ERROR] location: package org.hamcrest
[ERROR] <https://builds.apache.org/job/POI-DSL-Maven/ws/sonar/main/src/test/java/org/apache/poi/POITestCase.java>:[35,1]
static import only from classes and interfaces
[ERROR] <https://builds.apache.org/job/POI-DSL-Maven/ws/sonar/main/src/test/java/org/apache/poi/POITestCase.java>:[36,27]
cannot find symbol
[ERROR] symbol  : class Matchers
[ERROR] location: package org.hamcrest
[ERROR] <https://builds.apache.org/job/POI-DSL-Maven/ws/sonar/main/src/test/java/org/apache/poi/POITestCase.java>:[36,1]
static import only from classes and interfaces
[ERROR] <https://builds.apache.org/job/POI-DSL-Maven/ws/sonar/main/src/test/java/org/apache/poi/POITestCase.java>:[269,36]
cannot find symbol
[ERROR] symbol  : method greaterThanOrEqualTo(int)
[ERROR] location: class org.apache.poi.POITestCase
[ERROR] <https://builds.apache.org/job/POI-DSL-Maven/ws/sonar/main/src/test/java/org/apache/poi/POITestCase.java>:[270,36]
cannot find symbol
[ERROR] symbol  : method lessThanOrEqualTo(int)
[ERROR] location: class org.apache.poi.POITestCase
[ERROR] <https://builds.apache.org/job/POI-DSL-Maven/ws/sonar/main/src/test/java/org/apache/poi/POITestCase.java>:[273,36]
cannot find symbol
[ERROR] symbol  : method greaterThan(int)
[ERROR] location: class org.apache.poi.POITestCase
[ERROR] <https://builds.apache.org/job/POI-DSL-Maven/ws/sonar/main/src/test/java/org/apache/poi/POITestCase.java>:[274,36]
cannot find symbol
[ERROR] symbol  : method lessThan(int)
[ERROR] location: class org.apache.poi.POITestCase
[ERROR] -> [Help 1]
[ERROR] 
[ERROR] To see the full stack trace of the errors, re-run Maven with the -e switch.
[ERROR] Re-run Maven using the -X switch to enable full debug logging.
[ERROR] 
[ERROR] For more information about the errors and possible solutions, please read the following
articles:
[ERROR] [Help 1] http://cwiki.apache.org/confluence/display/MAVEN/MojoFailureException
[ERROR] 
[ERROR] After correcting the problems, you can resume the build with the command
[ERROR]   mvn <goals> -rf :poi-main
Build step 'Invoke top-level Maven targets' marked build as failure

---------------------------------------------------------------------
To unsubscribe, e-mail: dev-unsubscribe@poi.apache.org
For additional commands, e-mail: dev-help@poi.apache.org


Mime
View raw message