poi-dev mailing list archives

Site index · List index
Message view « Date » · « Thread »
Top « Date » · « Thread »
From Apache Jenkins Server <jenk...@builds.apache.org>
Subject Build failed in Jenkins: POI-DSL-Maven #141
Date Wed, 22 Mar 2017 20:08:37 GMT
See <https://builds.apache.org/job/POI-DSL-Maven/141/display/redirect?page=changes>

Changes:

[tallison] 60881 -- fix unit test to use assumeTrue thanks to Javen's recommendation.

------------------------------------------
[...truncated 1.86 MB...]
[INFO] Recompile with -Xlint:deprecation for details.
[INFO] 
[INFO] --- maven-resources-plugin:2.6:testResources (default-testResources) @ poi-ooxml-schema-encryption
---
[INFO] Using 'ASCII' encoding to copy filtered resources.
[INFO] skip non existing resourceDirectory <https://builds.apache.org/job/POI-DSL-Maven/ws/sonar/ooxml-schema-encryption/src/test/resources>
[INFO] 
[INFO] --- maven-compiler-plugin:3.5.1:testCompile (default-testCompile) @ poi-ooxml-schema-encryption
---
[INFO] No sources to compile
[INFO] 
[INFO] --- maven-surefire-plugin:2.19.1:test (default-test) @ poi-ooxml-schema-encryption
---
[INFO] No tests to run.
[INFO] 
[INFO] --- maven-antrun-plugin:1.8:run (remove-xmltypeloader-from-schema-jar) @ poi-ooxml-schema-encryption
---
[INFO] Executing tasks

main:
   [delete] Deleting directory <https://builds.apache.org/job/POI-DSL-Maven/ws/sonar/ooxml-schema-encryption/target/classes/org/apache>
[INFO] Executed tasks
[INFO] 
[INFO] --- maven-jar-plugin:2.4:jar (default-jar) @ poi-ooxml-schema-encryption ---
[INFO] Building jar: <https://builds.apache.org/job/POI-DSL-Maven/ws/sonar/ooxml-schema-encryption/target/poi-ooxml-schema-encryption-3.16-beta3-SNAPSHOT.jar>
[INFO]                                                                         
[INFO] ------------------------------------------------------------------------
[INFO] Building Apache POI - Openxmlformats Security-Schema package 3.16-beta3-SNAPSHOT
[INFO] ------------------------------------------------------------------------
[INFO] 
[INFO] --- maven-download-plugin:1.1.0:wget (install-xsds-part-1) @ poi-ooxml-schema-security
---
Downloading: http://www.ecma-international.org/publications/files/ECMA-ST//Office%20Open%20XML%201st%20edition%20Part%202%20(PDF).zip
4/1256K6/1256K10/1256K13/1256K17/1256K19/1256K23/1256K27/1256K30/1256K34/1256K36/1256K39/1256K43/1256K47/1256K51/1256K53/1256K54/1256K58/1256K62/1256K66/1256K70/1256K73/1256K77/1256K81/1256K81/1256K84/1256K88/1256K92/1256K96/1256K100/1256K104/1256K108/1256K112/1256K114/1256K118/1256K118/1256K119/1256K121/1256K125/1256K129/1256K133/1256K135/1256K139/1256K143/1256K147/1256K151/1256K153/1256K157/1256K160/1256K162/1256K166/1256K166/1256K170/1256K174/1256K178/1256K180/1256K184/1256K188/1256K192/1256K196/1256K199/1256K203/1256K207/1256K211/1256K211/1256K215/1256K217/1256K220/1256K221/1256K225/1256K229/1256K233/1256K237/1256K241/1256K242/1256K246/1256K250/1256K254/1256K258/1256K262/1256K266/1256K270/1256K271/1256K275/1256K276/1256K280/1256K283/1256K285/1256K289/1256K293/1256K297/1256K299/1256K303/1256K307/1256K311/1256K313/1256K317/1256K321/1256K325/1256K329/1256K332/1256K336/1256K340/1256K341/1256K343/1256K347/1256K347/1256K351/1256K355/1256K356/1256K360/1256K364/1256K368/1256K370/1256K374/1256K378/1256K382/1256K386/1256K387/1256K391/1256K395/1256K399/1256K403/1256K407/1256K408/1256K412/1256K416/1256K420/1256K421/1256K422/1256K426/1256K430/1256K431/1256K435/1256K438/1256K439/1256K443/1256K447/1256K451/1256K455/1256K459/1256K463/1256K467/1256K471/1256K475/1256K479/1256K483/1256K487/1256K491/1256K495/1256K499/1256K503/1256K507/1256K508/1256K511/1256K515/1256K519/1256K523/1256K527/1256K530/1256K534/1256K538/1256K542/1256K546/1256K546/1256K550/1256K552/1256K556/1256K560/1256K564/1256K568/1256K572/1256K576/1256K580/1256K584/1256K588/1256K592/1256K596/1256K600/1256K604/1256K608/1256K609/1256K610/1256K614/1256K618/1256K621/1256K625/1256K629/1256K630/1256K633/1256K637/1256K641/1256K645/1256K649/1256K653/1256K657/1256K661/1256K665/1256K667/1256K671/1256K675/1256K679/1256K679/1256K683/1256K687/1256K691/1256K695/1256K698/1256K702/1256K706/1256K710/1256K714/1256K718/1256K722/1256K722/1256K723/1256K727/1256K731/1256K735/1256K739/1256K743/1256K744/1256K746/1256K750/1256K750/1256K754/1256K758/1256K762/1256K766/1256K767/1256K771/1256K775/1256K779/1256K781/1256K785/1256K789/1256K793/1256K797/1256K798/1256K802/1256K806/1256K810/1256K814/1256K817/1256K821/1256K825/1256K829/1256K831/1256K835/1256K839/1256K843/1256K846/1256K849/1256K851/1256K855/1256K859/1256K863/1256K867/1256K869/1256K872/1256K876/1256K877/1256K881/1256K885/1256K889/1256K893/1256K894/1256K898/1256K902/1256K906/1256K910/1256K914/1256K918/1256K922/1256K926/1256K930/1256K934/1256K938/1256K942/1256K946/1256K950/1256K954/1256K958/1256K962/1256K966/1256K966/1256K970/1256K974/1256K978/1256K982/1256K986/1256K988/1256K992/1256K993/1256K995/1256K999/1256K1003/1256K1007/1256K1011/1256K1013/1256K1017/1256K1021/1256K1025/1256K1026/1256K1027/1256K1031/1256K1035/1256K1036/1256K1040/1256K1044/1256K1048/1256K1051/1256K1055/1256K1059/1256K1061/1256K1065/1256K1069/1256K1073/1256K1077/1256K1081/1256K1085/1256K1089/1256K1093/1256K1097/1256K1101/1256K1105/1256K1109/1256K1113/1256K1115/1256K1119/1256K1123/1256K1127/1256K1131/1256K1135/1256K1138/1256K1142/1256K1146/1256K1150/1256K1154/1256K1155/1256K1156/1256K1160/1256K1164/1256K1168/1256K1172/1256K1176/1256K1177/1256K1181/1256K1185/1256K1189/1256K1193/1256K1196/1256K1200/1256K1204/1256K1205/1256K1209/1256K1213/1256K1217/1256K1220/1256K1224/1256K1228/1256K1231/1256K1235/1256K1239/1256K1243/1256K1244/1256K1248/1256K1252/1256K1256/1256K1256/1256K1256K
downloaded
[INFO] 
[INFO] --- maven-download-plugin:1.1.0:wget (install-xsds-part-2) @ poi-ooxml-schema-security
---
Downloading: http://dublincore.org/schemas/xmls/qdc/2003/04/02//dc.xsd
4/4K4/4K4K downloaded
[INFO] 
[INFO] --- maven-download-plugin:1.1.0:wget (install-xsds-part-3) @ poi-ooxml-schema-security
---
Downloading: http://dublincore.org/schemas/xmls/qdc/2003/04/02//dcterms.xsd
2/10K4/10K5/10K9/10K10/10K10K downloaded
[INFO] 
[INFO] --- maven-download-plugin:1.1.0:wget (install-xsds-part-4) @ poi-ooxml-schema-security
---
Downloading: http://dublincore.org/schemas/xmls/qdc/2003/04/02//dcmitype.xsd
1/1K1K downloaded
[INFO] 
[INFO] --- maven-download-plugin:1.1.0:wget (install-xsds-part-5) @ poi-ooxml-schema-security
---
Downloading: http://www.w3.org/TR/2002/REC-xmldsig-core-20020212//xmldsig-core-schema.xsd
786/?2648/?6281/?10095/?10293/?[INFO] 
[INFO] --- maven-download-plugin:1.1.0:wget (install-xsds-part-6) @ poi-ooxml-schema-security
---
Downloading: http://uri.etsi.org/01903/v1.3.2//XAdES.xsd
org.apache.maven.wagon.TransferFailedException: Failed to transfer file: http://uri.etsi.org/01903/v1.3.2/XAdES.xsd.
Return code is: 503 , ReasonPhrase:Service Temporarily Unavailable.
	at org.apache.maven.wagon.providers.http.AbstractHttpClientWagon.fillInputData(AbstractHttpClientWagon.java:889)
	at org.apache.maven.wagon.StreamWagon.getInputStream(StreamWagon.java:116)
	at org.apache.maven.wagon.StreamWagon.getIfNewer(StreamWagon.java:88)
	at org.apache.maven.wagon.StreamWagon.get(StreamWagon.java:61)
	at com.googlecode.WGet.doGet(WGet.java:218)
	at com.googlecode.WGet.execute(WGet.java:173)
	at org.apache.maven.plugin.DefaultBuildPluginManager.executeMojo(DefaultBuildPluginManager.java:133)
	at org.apache.maven.lifecycle.internal.MojoExecutor.execute(MojoExecutor.java:208)
	at org.apache.maven.lifecycle.internal.MojoExecutor.execute(MojoExecutor.java:153)
	at org.apache.maven.lifecycle.internal.MojoExecutor.execute(MojoExecutor.java:145)
	at org.apache.maven.lifecycle.internal.LifecycleModuleBuilder.buildProject(LifecycleModuleBuilder.java:108)
	at org.apache.maven.lifecycle.internal.LifecycleModuleBuilder.buildProject(LifecycleModuleBuilder.java:76)
	at org.apache.maven.lifecycle.internal.builder.singlethreaded.SingleThreadedBuilder.build(SingleThreadedBuilder.java:51)
	at org.apache.maven.lifecycle.internal.LifecycleStarter.execute(LifecycleStarter.java:116)
	at org.apache.maven.DefaultMaven.doExecute(DefaultMaven.java:361)
	at org.apache.maven.DefaultMaven.execute(DefaultMaven.java:155)
	at org.apache.maven.cli.MavenCli.execute(MavenCli.java:584)
	at org.apache.maven.cli.MavenCli.doMain(MavenCli.java:213)
	at org.apache.maven.cli.MavenCli.main(MavenCli.java:157)
	at sun.reflect.NativeMethodAccessorImpl.invoke0(Native Method)
	at sun.reflect.NativeMethodAccessorImpl.invoke(NativeMethodAccessorImpl.java:39)
	at sun.reflect.DelegatingMethodAccessorImpl.invoke(DelegatingMethodAccessorImpl.java:25)
	at java.lang.reflect.Method.invoke(Method.java:597)
	at org.codehaus.plexus.classworlds.launcher.Launcher.launchEnhanced(Launcher.java:289)
	at org.codehaus.plexus.classworlds.launcher.Launcher.launch(Launcher.java:229)
	at org.codehaus.plexus.classworlds.launcher.Launcher.mainWithExitCode(Launcher.java:415)
	at org.codehaus.plexus.classworlds.launcher.Launcher.main(Launcher.java:356)
org.apache.maven.wagon.TransferFailedException: Failed to transfer file: http://uri.etsi.org/01903/v1.3.2/XAdES.xsd.
Return code is: 503 , ReasonPhrase:Service Temporarily Unavailable.
	at org.apache.maven.wagon.providers.http.AbstractHttpClientWagon.fillInputData(AbstractHttpClientWagon.java:889)
	at org.apache.maven.wagon.StreamWagon.getInputStream(StreamWagon.java:116)
	at org.apache.maven.wagon.StreamWagon.getIfNewer(StreamWagon.java:88)
	at org.apache.maven.wagon.StreamWagon.get(StreamWagon.java:61)
	at com.googlecode.WGet.doGet(WGet.java:218)
	at com.googlecode.WGet.execute(WGet.java:173)
	at org.apache.maven.plugin.DefaultBuildPluginManager.executeMojo(DefaultBuildPluginManager.java:133)
	at org.apache.maven.lifecycle.internal.MojoExecutor.execute(MojoExecutor.java:208)
	at org.apache.maven.lifecycle.internal.MojoExecutor.execute(MojoExecutor.java:153)
	at org.apache.maven.lifecycle.internal.MojoExecutor.execute(MojoExecutor.java:145)
	at org.apache.maven.lifecycle.internal.LifecycleModuleBuilder.buildProject(LifecycleModuleBuilder.java:108)
	at org.apache.maven.lifecycle.internal.LifecycleModuleBuilder.buildProject(LifecycleModuleBuilder.java:76)
	at org.apache.maven.lifecycle.internal.builder.singlethreaded.SingleThreadedBuilder.build(SingleThreadedBuilder.java:51)
	at org.apache.maven.lifecycle.internal.LifecycleStarter.execute(LifecycleStarter.java:116)
	at org.apache.maven.DefaultMaven.doExecute(DefaultMaven.java:361)
	at org.apache.maven.DefaultMaven.execute(DefaultMaven.java:155)
	at org.apache.maven.cli.MavenCli.execute(MavenCli.java:584)
	at org.apache.maven.cli.MavenCli.doMain(MavenCli.java:213)
	at org.apache.maven.cli.MavenCli.main(MavenCli.java:157)
	at sun.reflect.NativeMethodAccessorImpl.invoke0(Native Method)
	at sun.reflect.NativeMethodAccessorImpl.invoke(NativeMethodAccessorImpl.java:39)
	at sun.reflect.DelegatingMethodAccessorImpl.invoke(DelegatingMethodAccessorImpl.java:25)
	at java.lang.reflect.Method.invoke(Method.java:597)
	at org.codehaus.plexus.classworlds.launcher.Launcher.launchEnhanced(Launcher.java:289)
	at org.codehaus.plexus.classworlds.launcher.Launcher.launch(Launcher.java:229)
	at org.codehaus.plexus.classworlds.launcher.Launcher.mainWithExitCode(Launcher.java:415)
	at org.codehaus.plexus.classworlds.launcher.Launcher.main(Launcher.java:356)
[WARNING] Could not get content
org.apache.maven.wagon.TransferFailedException: Failed to transfer file: http://uri.etsi.org/01903/v1.3.2/XAdES.xsd.
Return code is: 503 , ReasonPhrase:Service Temporarily Unavailable.
	at org.apache.maven.wagon.providers.http.AbstractHttpClientWagon.fillInputData(AbstractHttpClientWagon.java:889)
	at org.apache.maven.wagon.StreamWagon.getInputStream(StreamWagon.java:116)
	at org.apache.maven.wagon.StreamWagon.getIfNewer(StreamWagon.java:88)
	at org.apache.maven.wagon.StreamWagon.get(StreamWagon.java:61)
	at com.googlecode.WGet.doGet(WGet.java:218)
	at com.googlecode.WGet.execute(WGet.java:173)
	at org.apache.maven.plugin.DefaultBuildPluginManager.executeMojo(DefaultBuildPluginManager.java:133)
	at org.apache.maven.lifecycle.internal.MojoExecutor.execute(MojoExecutor.java:208)
	at org.apache.maven.lifecycle.internal.MojoExecutor.execute(MojoExecutor.java:153)
	at org.apache.maven.lifecycle.internal.MojoExecutor.execute(MojoExecutor.java:145)
	at org.apache.maven.lifecycle.internal.LifecycleModuleBuilder.buildProject(LifecycleModuleBuilder.java:108)
	at org.apache.maven.lifecycle.internal.LifecycleModuleBuilder.buildProject(LifecycleModuleBuilder.java:76)
	at org.apache.maven.lifecycle.internal.builder.singlethreaded.SingleThreadedBuilder.build(SingleThreadedBuilder.java:51)
	at org.apache.maven.lifecycle.internal.LifecycleStarter.execute(LifecycleStarter.java:116)
	at org.apache.maven.DefaultMaven.doExecute(DefaultMaven.java:361)
	at org.apache.maven.DefaultMaven.execute(DefaultMaven.java:155)
	at org.apache.maven.cli.MavenCli.execute(MavenCli.java:584)
	at org.apache.maven.cli.MavenCli.doMain(MavenCli.java:213)
	at org.apache.maven.cli.MavenCli.main(MavenCli.java:157)
	at sun.reflect.NativeMethodAccessorImpl.invoke0(Native Method)
	at sun.reflect.NativeMethodAccessorImpl.invoke(NativeMethodAccessorImpl.java:39)
	at sun.reflect.DelegatingMethodAccessorImpl.invoke(DelegatingMethodAccessorImpl.java:25)
	at java.lang.reflect.Method.invoke(Method.java:597)
	at org.codehaus.plexus.classworlds.launcher.Launcher.launchEnhanced(Launcher.java:289)
	at org.codehaus.plexus.classworlds.launcher.Launcher.launch(Launcher.java:229)
	at org.codehaus.plexus.classworlds.launcher.Launcher.mainWithExitCode(Launcher.java:415)
	at org.codehaus.plexus.classworlds.launcher.Launcher.main(Launcher.java:356)
[WARNING] Retrying (1 more)
Downloading: http://uri.etsi.org/01903/v1.3.2//XAdES.xsd
org.apache.maven.wagon.TransferFailedException: Failed to transfer file: http://uri.etsi.org/01903/v1.3.2/XAdES.xsd.
Return code is: 503 , ReasonPhrase:Service Temporarily Unavailable.
	at org.apache.maven.wagon.providers.http.AbstractHttpClientWagon.fillInputData(AbstractHttpClientWagon.java:889)
	at org.apache.maven.wagon.StreamWagon.getInputStream(StreamWagon.java:116)
	at org.apache.maven.wagon.StreamWagon.getIfNewer(StreamWagon.java:88)
	at org.apache.maven.wagon.StreamWagon.get(StreamWagon.java:61)
	at com.googlecode.WGet.doGet(WGet.java:218)
	at com.googlecode.WGet.execute(WGet.java:173)
	at org.apache.maven.plugin.DefaultBuildPluginManager.executeMojo(DefaultBuildPluginManager.java:133)
	at org.apache.maven.lifecycle.internal.MojoExecutor.execute(MojoExecutor.java:208)
	at org.apache.maven.lifecycle.internal.MojoExecutor.execute(MojoExecutor.java:153)
	at org.apache.maven.lifecycle.internal.MojoExecutor.execute(MojoExecutor.java:145)
	at org.apache.maven.lifecycle.internal.LifecycleModuleBuilder.buildProject(LifecycleModuleBuilder.java:108)
	at org.apache.maven.lifecycle.internal.LifecycleModuleBuilder.buildProject(LifecycleModuleBuilder.java:76)
	at org.apache.maven.lifecycle.internal.builder.singlethreaded.SingleThreadedBuilder.build(SingleThreadedBuilder.java:51)
	at org.apache.maven.lifecycle.internal.LifecycleStarter.execute(LifecycleStarter.java:116)
	at org.apache.maven.DefaultMaven.doExecute(DefaultMaven.java:361)
	at org.apache.maven.DefaultMaven.execute(DefaultMaven.java:155)
	at org.apache.maven.cli.MavenCli.execute(MavenCli.java:584)
	at org.apache.maven.cli.MavenCli.doMain(MavenCli.java:213)
	at org.apache.maven.cli.MavenCli.main(MavenCli.java:157)
	at sun.reflect.NativeMethodAccessorImpl.invoke0(Native Method)
	at sun.reflect.NativeMethodAccessorImpl.invoke(NativeMethodAccessorImpl.java:39)
	at sun.reflect.DelegatingMethodAccessorImpl.invoke(DelegatingMethodAccessorImpl.java:25)
	at java.lang.reflect.Method.invoke(Method.java:597)
	at org.codehaus.plexus.classworlds.launcher.Launcher.launchEnhanced(Launcher.java:289)
	at org.codehaus.plexus.classworlds.launcher.Launcher.launch(Launcher.java:229)
	at org.codehaus.plexus.classworlds.launcher.Launcher.mainWithExitCode(Launcher.java:415)
	at org.codehaus.plexus.classworlds.launcher.Launcher.main(Launcher.java:356)
org.apache.maven.wagon.TransferFailedException: Failed to transfer file: http://uri.etsi.org/01903/v1.3.2/XAdES.xsd.
Return code is: 503 , ReasonPhrase:Service Temporarily Unavailable.
	at org.apache.maven.wagon.providers.http.AbstractHttpClientWagon.fillInputData(AbstractHttpClientWagon.java:889)
	at org.apache.maven.wagon.StreamWagon.getInputStream(StreamWagon.java:116)
	at org.apache.maven.wagon.StreamWagon.getIfNewer(StreamWagon.java:88)
	at org.apache.maven.wagon.StreamWagon.get(StreamWagon.java:61)
	at com.googlecode.WGet.doGet(WGet.java:218)
	at com.googlecode.WGet.execute(WGet.java:173)
	at org.apache.maven.plugin.DefaultBuildPluginManager.executeMojo(DefaultBuildPluginManager.java:133)
	at org.apache.maven.lifecycle.internal.MojoExecutor.execute(MojoExecutor.java:208)
	at org.apache.maven.lifecycle.internal.MojoExecutor.execute(MojoExecutor.java:153)
	at org.apache.maven.lifecycle.internal.MojoExecutor.execute(MojoExecutor.java:145)
	at org.apache.maven.lifecycle.internal.LifecycleModuleBuilder.buildProject(LifecycleModuleBuilder.java:108)
	at org.apache.maven.lifecycle.internal.LifecycleModuleBuilder.buildProject(LifecycleModuleBuilder.java:76)
	at org.apache.maven.lifecycle.internal.builder.singlethreaded.SingleThreadedBuilder.build(SingleThreadedBuilder.java:51)
	at org.apache.maven.lifecycle.internal.LifecycleStarter.execute(LifecycleStarter.java:116)
	at org.apache.maven.DefaultMaven.doExecute(DefaultMaven.java:361)
	at org.apache.maven.DefaultMaven.execute(DefaultMaven.java:155)
	at org.apache.maven.cli.MavenCli.execute(MavenCli.java:584)
	at org.apache.maven.cli.MavenCli.doMain(MavenCli.java:213)
	at org.apache.maven.cli.MavenCli.main(MavenCli.java:157)
	at sun.reflect.NativeMethodAccessorImpl.invoke0(Native Method)
	at sun.reflect.NativeMethodAccessorImpl.invoke(NativeMethodAccessorImpl.java:39)
	at sun.reflect.DelegatingMethodAccessorImpl.invoke(DelegatingMethodAccessorImpl.java:25)
	at java.lang.reflect.Method.invoke(Method.java:597)
	at org.codehaus.plexus.classworlds.launcher.Launcher.launchEnhanced(Launcher.java:289)
	at org.codehaus.plexus.classworlds.launcher.Launcher.launch(Launcher.java:229)
	at org.codehaus.plexus.classworlds.launcher.Launcher.mainWithExitCode(Launcher.java:415)
	at org.codehaus.plexus.classworlds.launcher.Launcher.main(Launcher.java:356)
[WARNING] Could not get content
org.apache.maven.wagon.TransferFailedException: Failed to transfer file: http://uri.etsi.org/01903/v1.3.2/XAdES.xsd.
Return code is: 503 , ReasonPhrase:Service Temporarily Unavailable.
	at org.apache.maven.wagon.providers.http.AbstractHttpClientWagon.fillInputData(AbstractHttpClientWagon.java:889)
	at org.apache.maven.wagon.StreamWagon.getInputStream(StreamWagon.java:116)
	at org.apache.maven.wagon.StreamWagon.getIfNewer(StreamWagon.java:88)
	at org.apache.maven.wagon.StreamWagon.get(StreamWagon.java:61)
	at com.googlecode.WGet.doGet(WGet.java:218)
	at com.googlecode.WGet.execute(WGet.java:173)
	at org.apache.maven.plugin.DefaultBuildPluginManager.executeMojo(DefaultBuildPluginManager.java:133)
	at org.apache.maven.lifecycle.internal.MojoExecutor.execute(MojoExecutor.java:208)
	at org.apache.maven.lifecycle.internal.MojoExecutor.execute(MojoExecutor.java:153)
	at org.apache.maven.lifecycle.internal.MojoExecutor.execute(MojoExecutor.java:145)
	at org.apache.maven.lifecycle.internal.LifecycleModuleBuilder.buildProject(LifecycleModuleBuilder.java:108)
	at org.apache.maven.lifecycle.internal.LifecycleModuleBuilder.buildProject(LifecycleModuleBuilder.java:76)
	at org.apache.maven.lifecycle.internal.builder.singlethreaded.SingleThreadedBuilder.build(SingleThreadedBuilder.java:51)
	at org.apache.maven.lifecycle.internal.LifecycleStarter.execute(LifecycleStarter.java:116)
	at org.apache.maven.DefaultMaven.doExecute(DefaultMaven.java:361)
	at org.apache.maven.DefaultMaven.execute(DefaultMaven.java:155)
	at org.apache.maven.cli.MavenCli.execute(MavenCli.java:584)
	at org.apache.maven.cli.MavenCli.doMain(MavenCli.java:213)
	at org.apache.maven.cli.MavenCli.main(MavenCli.java:157)
	at sun.reflect.NativeMethodAccessorImpl.invoke0(Native Method)
	at sun.reflect.NativeMethodAccessorImpl.invoke(NativeMethodAccessorImpl.java:39)
	at sun.reflect.DelegatingMethodAccessorImpl.invoke(DelegatingMethodAccessorImpl.java:25)
	at java.lang.reflect.Method.invoke(Method.java:597)
	at org.codehaus.plexus.classworlds.launcher.Launcher.launchEnhanced(Launcher.java:289)
	at org.codehaus.plexus.classworlds.launcher.Launcher.launch(Launcher.java:229)
	at org.codehaus.plexus.classworlds.launcher.Launcher.mainWithExitCode(Launcher.java:415)
	at org.codehaus.plexus.classworlds.launcher.Launcher.main(Launcher.java:356)
[INFO] ------------------------------------------------------------------------
[INFO] Reactor Summary:
[INFO] 
[INFO] Apache POI - the Java API for Microsoft Documents . SUCCESS [  0.003 s]
[INFO] Apache POI Main package ........................... SUCCESS [01:51 min]
[INFO] Apache POI Scratchpad package ..................... SUCCESS [ 20.065 s]
[INFO] Apache POI - Openxmlformats Schema package ........ SUCCESS [01:22 min]
[INFO] Apache POI - Openxmlformats Encryption Schema package  SUCCESS [  0.856 s]
[INFO] Apache POI - Openxmlformats Security-Schema package  FAILURE [ 21.090 s]
[INFO] Apache POI OOXML package .......................... SKIPPED
[INFO] Apache POI ExcelAnt package ....................... SKIPPED
[INFO] Apache POI Examples package ....................... SKIPPED
[INFO] ------------------------------------------------------------------------
[INFO] BUILD FAILURE
[INFO] ------------------------------------------------------------------------
[INFO] Total time: 03:55 min
[INFO] Finished at: 2017-03-22T20:08:33+00:00
[INFO] Final Memory: 38M/640M
[INFO] ------------------------------------------------------------------------
[ERROR] Failed to execute goal com.googlecode.maven-download-plugin:maven-download-plugin:1.1.0:wget
(install-xsds-part-6) on project poi-ooxml-schema-security: IO Error: Could not get content
-> [Help 1]
[ERROR] 
[ERROR] To see the full stack trace of the errors, re-run Maven with the -e switch.
[ERROR] Re-run Maven using the -X switch to enable full debug logging.
[ERROR] 
[ERROR] For more information about the errors and possible solutions, please read the following
articles:
[ERROR] [Help 1] http://cwiki.apache.org/confluence/display/MAVEN/MojoExecutionException
[ERROR] 
[ERROR] After correcting the problems, you can resume the build with the command
[ERROR]   mvn <goals> -rf :poi-ooxml-schema-security
Build step 'Invoke top-level Maven targets' marked build as failure

---------------------------------------------------------------------
To unsubscribe, e-mail: dev-unsubscribe@poi.apache.org
For additional commands, e-mail: dev-help@poi.apache.org


Mime
View raw message