poi-dev mailing list archives

Site index · List index
Message view « Date » · « Thread »
Top « Date » · « Thread »
From "Javen O'Neal" <one...@apache.org>
Subject Re: Build failed in Jenkins: POI-DSL-Maven #93
Date Fri, 10 Feb 2017 12:56:40 GMT
I thought it was already doing that with
https://svn.apache.org/viewvc/poi/trunk/build.gradle?revision=1782118&view=markup#l80

80
<https://svn.apache.org/viewvc/poi/trunk/build.gradle?revision=1782118&view=markup#l80>
tasks.withType(JavaCompile)
{
81
<https://svn.apache.org/viewvc/poi/trunk/build.gradle?revision=1782118&view=markup#l81>
options.encoding
= 'UTF-8'
82
<https://svn.apache.org/viewvc/poi/trunk/build.gradle?revision=1782118&view=markup#l82>
}

On Feb 10, 2017 4:54 AM, "Nick Burch" <apache@gagravarr.org> wrote:

> I think the key errors for this are things like:
>
> [WARNING] /home/jenkins/jenkins-slave/workspace/POI-DSL-Maven/sonar/ma
> in/src/test/java/org/apache/poi/ss/usermodel/TestDateUtil.java:[113,27]
> unmappable character for encoding US-ASCII
> [WARNING] /home/jenkins/jenkins-slave/workspace/POI-DSL-Maven/sonar/ma
> in/src/test/java/org/apache/poi/ss/usermodel/TestDateUtil.java:[113,28]
> unmappable character for encoding US-ASCII
>
> Does someone need to tweak the Jenkins job to tell it we're now using UTF8
> encoding? Or do we need to use \u#### escape style encodings in the test
> file for safety?
>
> Nick
>
> On Fri, 10 Feb 2017, Apache Jenkins Server wrote:
>
> See <https://builds.apache.org/job/POI-DSL-Maven/93/changes>
>>
>> Changes:
>>
>> [nick] Update the big file test to use POIFSFileSystem.create(File), and
>> tweak javadocs
>>
>> ------------------------------------------
>> [...truncated 1055 lines...]
>> Running org.apache.poi.hssf.record.chart.TestSeriesLabelsRecord
>> Tests run: 2, Failures: 0, Errors: 0, Skipped: 0, Time elapsed: 0 sec -
>> in org.apache.poi.hssf.record.chart.TestSeriesLabelsRecord
>> Running org.apache.poi.hssf.record.chart.TestLinkedDataRecord
>> Tests run: 2, Failures: 0, Errors: 0, Skipped: 0, Time elapsed: 0 sec -
>> in org.apache.poi.hssf.record.chart.TestLinkedDataRecord
>> Running org.apache.poi.hssf.record.chart.TestSeriesIndexRecord
>> Tests run: 2, Failures: 0, Errors: 0, Skipped: 0, Time elapsed: 0 sec -
>> in org.apache.poi.hssf.record.chart.TestSeriesIndexRecord
>> Running org.apache.poi.hssf.record.chart.TestObjectLinkRecord
>> Tests run: 2, Failures: 0, Errors: 0, Skipped: 0, Time elapsed: 0 sec -
>> in org.apache.poi.hssf.record.chart.TestObjectLinkRecord
>> Running org.apache.poi.hssf.record.chart.TestAreaRecord
>> Tests run: 2, Failures: 0, Errors: 0, Skipped: 0, Time elapsed: 0 sec -
>> in org.apache.poi.hssf.record.chart.TestAreaRecord
>> Running org.apache.poi.hssf.record.chart.TestDataFormatRecord
>> Tests run: 2, Failures: 0, Errors: 0, Skipped: 0, Time elapsed: 0 sec -
>> in org.apache.poi.hssf.record.chart.TestDataFormatRecord
>> Running org.apache.poi.hssf.record.chart.TestSeriesRecord
>> Tests run: 2, Failures: 0, Errors: 0, Skipped: 0, Time elapsed: 0 sec -
>> in org.apache.poi.hssf.record.chart.TestSeriesRecord
>> Running org.apache.poi.hssf.record.chart.TestTextRecord
>> Tests run: 2, Failures: 0, Errors: 0, Skipped: 0, Time elapsed: 0 sec -
>> in org.apache.poi.hssf.record.chart.TestTextRecord
>> Running org.apache.poi.hssf.record.chart.TestFrameRecord
>> Tests run: 2, Failures: 0, Errors: 0, Skipped: 0, Time elapsed: 0 sec -
>> in org.apache.poi.hssf.record.chart.TestFrameRecord
>> Running org.apache.poi.hssf.record.chart.TestAxisUsedRecord
>> Tests run: 2, Failures: 0, Errors: 0, Skipped: 0, Time elapsed: 0 sec -
>> in org.apache.poi.hssf.record.chart.TestAxisUsedRecord
>> Running org.apache.poi.hssf.record.chart.TestFontIndexRecord
>> Tests run: 2, Failures: 0, Errors: 0, Skipped: 0, Time elapsed: 0 sec -
>> in org.apache.poi.hssf.record.chart.TestFontIndexRecord
>> Running org.apache.poi.hssf.record.TestExtendedFormatRecord
>> Tests run: 4, Failures: 0, Errors: 0, Skipped: 0, Time elapsed: 0 sec -
>> in org.apache.poi.hssf.record.TestExtendedFormatRecord
>> Running org.apache.poi.hssf.record.TestFeatRecord
>> Tests run: 3, Failures: 0, Errors: 0, Skipped: 0, Time elapsed: 0 sec -
>> in org.apache.poi.hssf.record.TestFeatRecord
>> Running org.apache.poi.hssf.record.TestCommonObjectDataSubRecord
>> Tests run: 2, Failures: 0, Errors: 0, Skipped: 0, Time elapsed: 0 sec -
>> in org.apache.poi.hssf.record.TestCommonObjectDataSubRecord
>> Running org.apache.poi.hssf.record.TestObjRecord
>> Tests run: 5, Failures: 0, Errors: 0, Skipped: 0, Time elapsed: 0 sec -
>> in org.apache.poi.hssf.record.TestObjRecord
>> Running org.apache.poi.hssf.record.TestDrawingGroupRecord
>> Tests run: 3, Failures: 0, Errors: 0, Skipped: 0, Time elapsed: 0 sec -
>> in org.apache.poi.hssf.record.TestDrawingGroupRecord
>> Running org.apache.poi.hssf.record.TestNoteStructureSubRecord
>> Tests run: 3, Failures: 0, Errors: 0, Skipped: 0, Time elapsed: 0 sec -
>> in org.apache.poi.hssf.record.TestNoteStructureSubRecord
>> Running org.apache.poi.hssf.record.TestCFHeaderRecord
>> Tests run: 4, Failures: 0, Errors: 0, Skipped: 0, Time elapsed: 0 sec -
>> in org.apache.poi.hssf.record.TestCFHeaderRecord
>> Running org.apache.poi.hssf.record.TestNameCommentRecord
>> Tests run: 1, Failures: 0, Errors: 0, Skipped: 0, Time elapsed: 0 sec -
>> in org.apache.poi.hssf.record.TestNameCommentRecord
>> Running org.apache.poi.hssf.record.TestCFRuleRecord
>> Tests run: 8, Failures: 0, Errors: 0, Skipped: 0, Time elapsed: 0.128 sec
>> - in org.apache.poi.hssf.record.TestCFRuleRecord
>> Running org.apache.poi.hssf.record.TestWriteAccessRecord
>> Tests run: 2, Failures: 0, Errors: 0, Skipped: 0, Time elapsed: 0 sec -
>> in org.apache.poi.hssf.record.TestWriteAccessRecord
>> Running org.apache.poi.hssf.eventusermodel.TestMissingRecordAwareHSS
>> FListener
>> Tests run: 8, Failures: 0, Errors: 0, Skipped: 0, Time elapsed: 0.011 sec
>> - in org.apache.poi.hssf.eventusermodel.TestMissingRecordAwareHSS
>> FListener
>> Running org.apache.poi.hssf.eventusermodel.TestEventWorkbookBuilder
>> Tests run: 4, Failures: 0, Errors: 0, Skipped: 0, Time elapsed: 0.006 sec
>> - in org.apache.poi.hssf.eventusermodel.TestEventWorkbookBuilder
>> Running org.apache.poi.hssf.eventusermodel.TestFormatTrackingHSSFListener
>> Tests run: 2, Failures: 0, Errors: 0, Skipped: 0, Time elapsed: 0.222 sec
>> - in org.apache.poi.hssf.eventusermodel.TestFormatTrackingHSSFListener
>> Running org.apache.poi.hssf.eventusermodel.TestHSSFEventFactory
>> Tests run: 5, Failures: 0, Errors: 0, Skipped: 0, Time elapsed: 0.005 sec
>> - in org.apache.poi.hssf.eventusermodel.TestHSSFEventFactory
>> Running org.apache.poi.hssf.util.TestCellReference
>> Tests run: 12, Failures: 0, Errors: 0, Skipped: 0, Time elapsed: 0 sec -
>> in org.apache.poi.hssf.util.TestCellReference
>> Running org.apache.poi.hssf.util.TestHSSFColor
>> Tests run: 3, Failures: 0, Errors: 0, Skipped: 0, Time elapsed: 0 sec -
>> in org.apache.poi.hssf.util.TestHSSFColor
>> Running org.apache.poi.hssf.util.TestAreaReference
>> Tests run: 6, Failures: 0, Errors: 0, Skipped: 0, Time elapsed: 0.001 sec
>> - in org.apache.poi.hssf.util.TestAreaReference
>> Running org.apache.poi.hssf.util.TestRKUtil
>> Tests run: 1, Failures: 0, Errors: 0, Skipped: 0, Time elapsed: 0 sec -
>> in org.apache.poi.hssf.util.TestRKUtil
>> Running org.apache.poi.hssf.model.TestFormulaParser
>> Tests run: 68, Failures: 0, Errors: 0, Skipped: 0, Time elapsed: 0.021
>> sec - in org.apache.poi.hssf.model.TestFormulaParser
>> Running org.apache.poi.hssf.model.TestHSSFAnchor
>> Tests run: 15, Failures: 0, Errors: 0, Skipped: 0, Time elapsed: 0.002
>> sec - in org.apache.poi.hssf.model.TestHSSFAnchor
>> Running org.apache.poi.hssf.model.TestWorkbook
>> Tests run: 3, Failures: 0, Errors: 0, Skipped: 0, Time elapsed: 0 sec -
>> in org.apache.poi.hssf.model.TestWorkbook
>> Running org.apache.poi.hssf.model.TestRowBlocksReader
>> Tests run: 1, Failures: 0, Errors: 0, Skipped: 0, Time elapsed: 0 sec -
>> in org.apache.poi.hssf.model.TestRowBlocksReader
>> Running org.apache.poi.hssf.model.TestDrawingManager
>> Tests run: 5, Failures: 0, Errors: 0, Skipped: 0, Time elapsed: 0 sec -
>> in org.apache.poi.hssf.model.TestDrawingManager
>> Running org.apache.poi.hssf.model.TestDrawingManager2
>> Tests run: 2, Failures: 0, Errors: 0, Skipped: 0, Time elapsed: 0 sec -
>> in org.apache.poi.hssf.model.TestDrawingManager2
>> Running org.apache.poi.hssf.model.TestDrawingShapes
>> Tests run: 19, Failures: 0, Errors: 0, Skipped: 0, Time elapsed: 0.054
>> sec - in org.apache.poi.hssf.model.TestDrawingShapes
>> Running org.apache.poi.hssf.model.TestOperandClassTransformer
>> Tests run: 4, Failures: 0, Errors: 0, Skipped: 0, Time elapsed: 0 sec -
>> in org.apache.poi.hssf.model.TestOperandClassTransformer
>> Running org.apache.poi.hssf.model.TestLinkTable
>> Tests run: 6, Failures: 0, Errors: 0, Skipped: 0, Time elapsed: 0.278 sec
>> - in org.apache.poi.hssf.model.TestLinkTable
>> Running org.apache.poi.hssf.model.TestDrawingAggregate
>> Tests run: 13, Failures: 0, Errors: 0, Skipped: 0, Time elapsed: 4.72 sec
>> - in org.apache.poi.hssf.model.TestDrawingAggregate
>> Running org.apache.poi.hssf.model.TestEscherRecordFactory
>> Tests run: 2, Failures: 0, Errors: 0, Skipped: 0, Time elapsed: 0 sec -
>> in org.apache.poi.hssf.model.TestEscherRecordFactory
>> Running org.apache.poi.hssf.model.TestRVA
>> Tests run: 42, Failures: 0, Errors: 0, Skipped: 0, Time elapsed: 0.008
>> sec - in org.apache.poi.hssf.model.TestRVA
>> Running org.apache.poi.hssf.model.TestSheet
>> Tests run: 21, Failures: 0, Errors: 0, Skipped: 0, Time elapsed: 0.32 sec
>> - in org.apache.poi.hssf.model.TestSheet
>> Running org.apache.poi.hssf.model.TestFormulaParserEval
>> Tests run: 2, Failures: 0, Errors: 0, Skipped: 0, Time elapsed: 0 sec -
>> in org.apache.poi.hssf.model.TestFormulaParserEval
>> Running org.apache.poi.hssf.model.TestSheetAdditional
>> Tests run: 2, Failures: 0, Errors: 0, Skipped: 0, Time elapsed: 0 sec -
>> in org.apache.poi.hssf.model.TestSheetAdditional
>> Running org.apache.poi.hssf.model.TestFormulaParserIf
>> Tests run: 10, Failures: 0, Errors: 0, Skipped: 0, Time elapsed: 0.001
>> sec - in org.apache.poi.hssf.model.TestFormulaParserIf
>> Running org.apache.poi.hssf.eventmodel.TestEventRecordFactory
>> Tests run: 4, Failures: 0, Errors: 0, Skipped: 0, Time elapsed: 0 sec -
>> in org.apache.poi.hssf.eventmodel.TestEventRecordFactory
>> Running org.apache.poi.hssf.eventmodel.TestAbortableListener
>> Tests run: 2, Failures: 0, Errors: 0, Skipped: 0, Time elapsed: 0 sec -
>> in org.apache.poi.hssf.eventmodel.TestAbortableListener
>> Running org.apache.poi.poifs.nio.TestDataSource
>> Tests run: 4, Failures: 0, Errors: 0, Skipped: 0, Time elapsed: 0.001 sec
>> - in org.apache.poi.poifs.nio.TestDataSource
>> Running org.apache.poi.poifs.dev.TestPOIFSDump
>> Dumping <https://builds.apache.org/job/POI-DSL-Maven/ws/test-data/
>> spreadsheet/48936-strings.txt>
>> Dumping <https://builds.apache.org/job/POI-DSL-Maven/ws/test-data/
>> spreadsheet/47668.xlsx>
>> Dumping <https://builds.apache.org/job/POI-DSL-Maven/ws/test-data/
>> spreadsheet/48936-strings.txt>
>> Dumping <https://builds.apache.org/job/POI-DSL-Maven/ws/test-data/
>> spreadsheet/47668.xlsx>
>> Dumping <https://builds.apache.org/job/POI-DSL-Maven/ws/test-data/
>> spreadsheet/48936-strings.txt>
>> Dumping <https://builds.apache.org/job/POI-DSL-Maven/ws/test-data/
>> spreadsheet/47668.xlsx>
>> Dumping <https://builds.apache.org/job/POI-DSL-Maven/ws/test-data/
>> spreadsheet/48936-strings.txt>
>> Dumping <https://builds.apache.org/job/POI-DSL-Maven/ws/test-data/
>> spreadsheet/47668.xlsx>
>> Dumping <https://builds.apache.org/job/POI-DSL-Maven/ws/test-data/
>> spreadsheet/48936-strings.txt>
>> Dumping <https://builds.apache.org/job/POI-DSL-Maven/ws/test-data/
>> spreadsheet/47668.xlsx>
>> Dumping <https://builds.apache.org/job/POI-DSL-Maven/ws/test-data/
>> spreadsheet/48936-strings.txt>
>> Dumping <https://builds.apache.org/job/POI-DSL-Maven/ws/test-data/
>> spreadsheet/47668.xlsx>
>> Dumping <https://builds.apache.org/job/POI-DSL-Maven/ws/test-data/
>> spreadsheet/48936-strings.txt>
>> Dumping <https://builds.apache.org/job/POI-DSL-Maven/ws/test-data/
>> spreadsheet/47668.xlsx>
>> Dumping <https://builds.apache.org/job/POI-DSL-Maven/ws/test-data/
>> spreadsheet/48936-strings.txt>
>> Dumping <https://builds.apache.org/job/POI-DSL-Maven/ws/test-data/
>> spreadsheet/47668.xlsx>
>> Dumping <https://builds.apache.org/job/POI-DSL-Maven/ws/test-data/
>> spreadsheet/46515.xls>
>> Dumping <https://builds.apache.org/job/POI-DSL-Maven/ws/test-data/
>> spreadsheet/46515.xls>
>> Dumping <https://builds.apache.org/job/POI-DSL-Maven/ws/test-data/
>> spreadsheet/46515.xls>
>> Dumping <https://builds.apache.org/job/POI-DSL-Maven/ws/test-data/
>> spreadsheet/46515.xls>
>> Dumping <https://builds.apache.org/job/POI-DSL-Maven/ws/test-data/
>> spreadsheet/46515.xls>
>> Dumping <https://builds.apache.org/job/POI-DSL-Maven/ws/test-data/
>> spreadsheet/46515.xls>
>> Dumping <https://builds.apache.org/job/POI-DSL-Maven/ws/test-data/
>> spreadsheet/46515.xls>
>> Dumping <https://builds.apache.org/job/POI-DSL-Maven/ws/test-data/
>> spreadsheet/46515.xls>
>> Tests run: 4, Failures: 0, Errors: 0, Skipped: 1, Time elapsed: 0.013 sec
>> - in org.apache.poi.poifs.dev.TestPOIFSDump
>> Running org.apache.poi.poifs.storage.TestBATBlock
>> Tests run: 9, Failures: 0, Errors: 0, Skipped: 0, Time elapsed: 0.005 sec
>> - in org.apache.poi.poifs.storage.TestBATBlock
>> Running org.apache.poi.poifs.storage.TestRawDataBlock
>> Tests run: 4, Failures: 0, Errors: 0, Skipped: 0, Time elapsed: 0.035 sec
>> - in org.apache.poi.poifs.storage.TestRawDataBlock
>> Running org.apache.poi.poifs.storage.TestSmallBlockTableReader
>> Tests run: 1, Failures: 0, Errors: 0, Skipped: 0, Time elapsed: 0.002 sec
>> - in org.apache.poi.poifs.storage.TestSmallBlockTableReader
>> Running org.apache.poi.poifs.storage.TestRawDataBlockList
>> Tests run: 3, Failures: 0, Errors: 0, Skipped: 0, Time elapsed: 0.033 sec
>> - in org.apache.poi.poifs.storage.TestRawDataBlockList
>> Running org.apache.poi.poifs.storage.TestBlockListImpl
>> Tests run: 4, Failures: 0, Errors: 0, Skipped: 0, Time elapsed: 0.001 sec
>> - in org.apache.poi.poifs.storage.TestBlockListImpl
>> Running org.apache.poi.poifs.storage.TestSmallDocumentBlock
>> Tests run: 5, Failures: 0, Errors: 0, Skipped: 0, Time elapsed: 0.05 sec
>> - in org.apache.poi.poifs.storage.TestSmallDocumentBlock
>> Running org.apache.poi.poifs.storage.TestBlockAllocationTableWriter
>> Tests run: 3, Failures: 0, Errors: 0, Skipped: 0, Time elapsed: 0.006 sec
>> - in org.apache.poi.poifs.storage.TestBlockAllocationTableWriter
>> Running org.apache.poi.poifs.storage.TestPropertyBlock
>> Tests run: 1, Failures: 0, Errors: 0, Skipped: 0, Time elapsed: 0.001 sec
>> - in org.apache.poi.poifs.storage.TestPropertyBlock
>> Running org.apache.poi.poifs.storage.TestHeaderBlockReading
>> Tests run: 1, Failures: 0, Errors: 0, Skipped: 0, Time elapsed: 0 sec -
>> in org.apache.poi.poifs.storage.TestHeaderBlockReading
>> Running org.apache.poi.poifs.storage.TestBlockAllocationTableReader
>> Tests run: 4, Failures: 0, Errors: 0, Skipped: 0, Time elapsed: 0.029 sec
>> - in org.apache.poi.poifs.storage.TestBlockAllocationTableReader
>> Running org.apache.poi.poifs.storage.TestSmallDocumentBlockList
>> Tests run: 1, Failures: 0, Errors: 0, Skipped: 0, Time elapsed: 0 sec -
>> in org.apache.poi.poifs.storage.TestSmallDocumentBlockList
>> Running org.apache.poi.poifs.storage.TestDocumentBlock
>> Tests run: 2, Failures: 0, Errors: 0, Skipped: 0, Time elapsed: 0 sec -
>> in org.apache.poi.poifs.storage.TestDocumentBlock
>> Running org.apache.poi.poifs.storage.TestHeaderBlockWriting
>> Tests run: 4, Failures: 0, Errors: 0, Skipped: 0, Time elapsed: 0.001 sec
>> - in org.apache.poi.poifs.storage.TestHeaderBlockWriting
>> Running org.apache.poi.poifs.storage.TestSmallBlockTableWriter
>> Tests run: 1, Failures: 0, Errors: 0, Skipped: 0, Time elapsed: 0 sec -
>> in org.apache.poi.poifs.storage.TestSmallBlockTableWriter
>> Running org.apache.poi.poifs.crypt.TestXorEncryption
>> Tests run: 2, Failures: 0, Errors: 0, Skipped: 0, Time elapsed: 0 sec -
>> in org.apache.poi.poifs.crypt.TestXorEncryption
>> Running org.apache.poi.poifs.crypt.binaryrc4.TestBinaryRC4
>> Tests run: 3, Failures: 0, Errors: 0, Skipped: 0, Time elapsed: 0.001 sec
>> - in org.apache.poi.poifs.crypt.binaryrc4.TestBinaryRC4
>> Running org.apache.poi.poifs.crypt.TestCipherAlgorithm
>> Tests run: 4, Failures: 0, Errors: 0, Skipped: 0, Time elapsed: 0 sec -
>> in org.apache.poi.poifs.crypt.TestCipherAlgorithm
>> Running org.apache.poi.poifs.crypt.TestBiff8DecryptingStream
>> Tests run: 4, Failures: 0, Errors: 0, Skipped: 0, Time elapsed: 0.07 sec
>> - in org.apache.poi.poifs.crypt.TestBiff8DecryptingStream
>> Running org.apache.poi.poifs.macros.TestVBAMacroReader
>> Tests run: 24, Failures: 0, Errors: 0, Skipped: 6, Time elapsed: 0.052
>> sec - in org.apache.poi.poifs.macros.TestVBAMacroReader
>> Running org.apache.poi.poifs.eventfilesystem.TestPOIFSReaderRegistry
>> Tests run: 2, Failures: 0, Errors: 0, Skipped: 0, Time elapsed: 0 sec -
>> in org.apache.poi.poifs.eventfilesystem.TestPOIFSReaderRegistry
>> Running org.apache.poi.poifs.property.TestDocumentProperty
>> Tests run: 2, Failures: 0, Errors: 0, Skipped: 0, Time elapsed: 0 sec -
>> in org.apache.poi.poifs.property.TestDocumentProperty
>> Running org.apache.poi.poifs.property.TestPropertyTable
>> Tests run: 1, Failures: 0, Errors: 0, Skipped: 0, Time elapsed: 0 sec -
>> in org.apache.poi.poifs.property.TestPropertyTable
>> Running org.apache.poi.poifs.property.TestRootProperty
>> Tests run: 3, Failures: 0, Errors: 0, Skipped: 0, Time elapsed: 0 sec -
>> in org.apache.poi.poifs.property.TestRootProperty
>> Running org.apache.poi.poifs.property.TestDirectoryProperty
>> Tests run: 6, Failures: 0, Errors: 0, Skipped: 0, Time elapsed: 0.015 sec
>> - in org.apache.poi.poifs.property.TestDirectoryProperty
>> Running org.apache.poi.poifs.property.TestPropertyFactory
>> Tests run: 1, Failures: 0, Errors: 0, Skipped: 0, Time elapsed: 0.001 sec
>> - in org.apache.poi.poifs.property.TestPropertyFactory
>> Running org.apache.poi.poifs.filesystem.TestNPOIFSMiniStore
>> Tests run: 7, Failures: 0, Errors: 0, Skipped: 0, Time elapsed: 0.004 sec
>> - in org.apache.poi.poifs.filesystem.TestNPOIFSMiniStore
>> Running org.apache.poi.poifs.filesystem.TestOfficeXMLException
>> Tests run: 5, Failures: 0, Errors: 0, Skipped: 0, Time elapsed: 0 sec -
>> in org.apache.poi.poifs.filesystem.TestOfficeXMLException
>> Running org.apache.poi.poifs.filesystem.TestFileSystemBugs
>> Tests run: 3, Failures: 0, Errors: 0, Skipped: 0, Time elapsed: 0.01 sec
>> - in org.apache.poi.poifs.filesystem.TestFileSystemBugs
>> Running org.apache.poi.poifs.filesystem.TestEmptyDocument
>> Tests run: 5, Failures: 0, Errors: 0, Skipped: 0, Time elapsed: 0.001 sec
>> - in org.apache.poi.poifs.filesystem.TestEmptyDocument
>> Running org.apache.poi.poifs.filesystem.TestFilteringDirectoryNode
>> Tests run: 3, Failures: 0, Errors: 0, Skipped: 0, Time elapsed: 0 sec -
>> in org.apache.poi.poifs.filesystem.TestFilteringDirectoryNode
>> Running org.apache.poi.poifs.filesystem.TestDocumentInputStream
>> Tests run: 8, Failures: 0, Errors: 0, Skipped: 0, Time elapsed: 1.107 sec
>> - in org.apache.poi.poifs.filesystem.TestDocumentInputStream
>> Running org.apache.poi.poifs.filesystem.TestDocument
>> Tests run: 1, Failures: 0, Errors: 0, Skipped: 0, Time elapsed: 0.382 sec
>> - in org.apache.poi.poifs.filesystem.TestDocument
>> Running org.apache.poi.poifs.filesystem.TestPropertySorter
>> Tests run: 2, Failures: 0, Errors: 0, Skipped: 0, Time elapsed: 0.002 sec
>> - in org.apache.poi.poifs.filesystem.TestPropertySorter
>> Running org.apache.poi.poifs.filesystem.TestNPOIFSFileSystem
>> Tests run: 16, Failures: 0, Errors: 0, Skipped: 1, Time elapsed: 0.364
>> sec - in org.apache.poi.poifs.filesystem.TestNPOIFSFileSystem
>> Running org.apache.poi.poifs.filesystem.TestDocumentOutputStream
>> Tests run: 4, Failures: 0, Errors: 0, Skipped: 0, Time elapsed: 0 sec -
>> in org.apache.poi.poifs.filesystem.TestDocumentOutputStream
>> Running org.apache.poi.poifs.filesystem.TestDocumentNode
>> Tests run: 1, Failures: 0, Errors: 0, Skipped: 0, Time elapsed: 0 sec -
>> in org.apache.poi.poifs.filesystem.TestDocumentNode
>> Running org.apache.poi.poifs.filesystem.TestNPOIFSStream
>> Tests run: 16, Failures: 0, Errors: 0, Skipped: 0, Time elapsed: 0.007
>> sec - in org.apache.poi.poifs.filesystem.TestNPOIFSStream
>> Running org.apache.poi.poifs.filesystem.TestOle10Native
>> Tests run: 3, Failures: 0, Errors: 0, Skipped: 0, Time elapsed: 0.171 sec
>> - in org.apache.poi.poifs.filesystem.TestOle10Native
>> Running org.apache.poi.poifs.filesystem.TestDirectoryNode
>> Tests run: 4, Failures: 0, Errors: 0, Skipped: 0, Time elapsed: 0 sec -
>> in org.apache.poi.poifs.filesystem.TestDirectoryNode
>> Running org.apache.poi.poifs.filesystem.TestPOIFSFileSystem
>> Tests run: 5, Failures: 0, Errors: 0, Skipped: 0, Time elapsed: 0.061 sec
>> - in org.apache.poi.poifs.filesystem.TestPOIFSFileSystem
>> Running org.apache.poi.poifs.filesystem.TestDocumentDescriptor
>> Tests run: 1, Failures: 0, Errors: 0, Skipped: 0, Time elapsed: 0.002 sec
>> - in org.apache.poi.poifs.filesystem.TestDocumentDescriptor
>> Running org.apache.poi.poifs.filesystem.TestEntryUtils
>> Tests run: 3, Failures: 0, Errors: 0, Skipped: 0, Time elapsed: 0.001 sec
>> - in org.apache.poi.poifs.filesystem.TestEntryUtils
>> Running org.apache.poi.poifs.filesystem.TestPOIFSDocumentPath
>> Tests run: 4, Failures: 0, Errors: 0, Skipped: 0, Time elapsed: 0.001 sec
>> - in org.apache.poi.poifs.filesystem.TestPOIFSDocumentPath
>>
>> Results :
>>
>> Failed tests:
>>  TestDateUtil.isADateFormat:114
>>
>> Tests run: 6253, Failures: 1, Errors: 0, Skipped: 754
>>
>> [INFO] ------------------------------------------------------------
>> ------------
>> [INFO] Reactor Summary:
>> [INFO]
>> [INFO] Apache POI - the Java API for Microsoft Documents . SUCCESS [
>> 0.003 s]
>> [INFO] Apache POI Main package ........................... FAILURE [01:27
>> min]
>> [INFO] Apache POI Scratchpad package ..................... SKIPPED
>> [INFO] Apache POI - Openxmlformats Schema package ........ SKIPPED
>> [INFO] Apache POI - Openxmlformats Encryption Schema package  SKIPPED
>> [INFO] Apache POI - Openxmlformats Security-Schema package  SKIPPED
>> [INFO] Apache POI OOXML package .......................... SKIPPED
>> [INFO] Apache POI ExcelAnt package ....................... SKIPPED
>> [INFO] Apache POI Examples package ....................... SKIPPED
>> [INFO] ------------------------------------------------------------
>> ------------
>> [INFO] BUILD FAILURE
>> [INFO] ------------------------------------------------------------
>> ------------
>> [INFO] Total time: 01:27 min
>> [INFO] Finished at: 2017-02-10T12:04:51+00:00
>> [INFO] Final Memory: 30M/763M
>> [INFO] ------------------------------------------------------------
>> ------------
>> [ERROR] Failed to execute goal org.apache.maven.plugins:maven-surefire-plugin:2.19.1:test
>> (default-test) on project poi-main: There are test failures.
>> [ERROR]
>> [ERROR] Please refer to <https://builds.apache.org/job
>> /POI-DSL-Maven/ws/sonar/main/target/surefire-reports> for the individual
>> test results.
>> [ERROR] -> [Help 1]
>> [ERROR]
>> [ERROR] To see the full stack trace of the errors, re-run Maven with the
>> -e switch.
>> [ERROR] Re-run Maven using the -X switch to enable full debug logging.
>> [ERROR]
>> [ERROR] For more information about the errors and possible solutions,
>> please read the following articles:
>> [ERROR] [Help 1] http://cwiki.apache.org/conflu
>> ence/display/MAVEN/MojoFailureException
>> [ERROR]
>> [ERROR] After correcting the problems, you can resume the build with the
>> command
>> [ERROR]   mvn <goals> -rf :poi-main
>> Build step 'Invoke top-level Maven targets' marked build as failure
>>
>> ---------------------------------------------------------------------
>> To unsubscribe, e-mail: dev-unsubscribe@poi.apache.org
>> For additional commands, e-mail: dev-help@poi.apache.org
>>
>>
>>
> ---------------------------------------------------------------------
> To unsubscribe, e-mail: dev-unsubscribe@poi.apache.org
> For additional commands, e-mail: dev-help@poi.apache.org
>
>

Mime
  • Unnamed multipart/alternative (inline, None, 0 bytes)
View raw message