poi-dev mailing list archives

Site index · List index
Message view « Date » · « Thread »
Top « Date » · « Thread »
From Apache Jenkins Server <jenk...@builds.apache.org>
Subject Build failed in Jenkins: POI-DSL-Maven #100
Date Mon, 13 Feb 2017 04:06:18 GMT
See <https://builds.apache.org/job/POI-DSL-Maven/100/changes>

Changes:

[kiwiwings] remove H24 and ubuntu-4 slaves for all builds

[kiwiwings] #60625 - Rendering issue with background and shape overlayed by image

------------------------------------------
[...truncated 16760 lines...]
[INFO] --- maven-antrun-plugin:1.8:run (replace-xmltypeloader) @ poi-ooxml-schema ---
[INFO] Executing tasks

main:
[INFO] Executed tasks
[INFO] 
[INFO] --- maven-resources-plugin:2.6:resources (default-resources) @ poi-ooxml-schema ---
[INFO] Using 'ASCII' encoding to copy filtered resources.
[INFO] skip non existing resourceDirectory <https://builds.apache.org/job/POI-DSL-Maven/ws/sonar/ooxml-schema/src/main/resources>
[INFO] Copying 7418 resources
[INFO] 
[INFO] --- maven-compiler-plugin:3.5.1:compile (default-compile) @ poi-ooxml-schema ---
[INFO] Changes detected - recompiling the module!
[INFO] Compiling 4575 source files to <https://builds.apache.org/job/POI-DSL-Maven/ws/sonar/ooxml-schema/target/classes>
[INFO] 
[INFO] --- maven-resources-plugin:2.6:testResources (default-testResources) @ poi-ooxml-schema
---
[INFO] Using 'ASCII' encoding to copy filtered resources.
[INFO] skip non existing resourceDirectory <https://builds.apache.org/job/POI-DSL-Maven/ws/sonar/ooxml-schema/src/test/resources>
[INFO] 
[INFO] --- maven-compiler-plugin:3.5.1:testCompile (default-testCompile) @ poi-ooxml-schema
---
[INFO] No sources to compile
[INFO] 
[INFO] --- maven-surefire-plugin:2.19.1:test (default-test) @ poi-ooxml-schema ---
[INFO] No tests to run.
[INFO] 
[INFO] --- maven-antrun-plugin:1.8:run (remove-xmltypeloader-from-schema-jar) @ poi-ooxml-schema
---
[INFO] Executing tasks

main:
   [delete] Deleting directory <https://builds.apache.org/job/POI-DSL-Maven/ws/sonar/ooxml-schema/target/classes/org/apache>
[INFO] Executed tasks
[INFO] 
[INFO] --- maven-jar-plugin:2.4:jar (default-jar) @ poi-ooxml-schema ---
[INFO] Building jar: <https://builds.apache.org/job/POI-DSL-Maven/ws/sonar/ooxml-schema/target/poi-ooxml-schema-3.16-beta3-SNAPSHOT.jar>
[INFO]                                                                         
[INFO] ------------------------------------------------------------------------
[INFO] Building Apache POI - Openxmlformats Encryption Schema package 3.16-beta3-SNAPSHOT
[INFO] ------------------------------------------------------------------------
[INFO] 
[INFO] --- maven-antrun-plugin:1.8:run (copy-xmltype-and-xsdconfig) @ poi-ooxml-schema-encryption
---
[INFO] Executing tasks

main:
     [copy] Copying 7 files to <https://builds.apache.org/job/POI-DSL-Maven/ws/sonar/ooxml-schema-encryption/target/generated-sources/xmlbeans>
     [copy] Copying 1 file to <https://builds.apache.org/job/POI-DSL-Maven/ws/sonar/ooxml-schema-encryption/target/schemas>
[INFO] Executed tasks
[INFO] 
[INFO] --- maven-antrun-plugin:1.8:run (unzip-schema) @ poi-ooxml-schema-encryption ---
[INFO] Executing tasks

main:
     [copy] Copying 6 files to <https://builds.apache.org/job/POI-DSL-Maven/ws/sonar/ooxml-schema-encryption/target/schemas>
[INFO] Executed tasks
[INFO] 
[INFO] --- xmlbeans-maven-plugin:2.3.3:xmlbeans (default) @ poi-ooxml-schema-encryption ---
[INFO] 
[INFO] --- maven-antrun-plugin:1.8:run (replace-xmltypeloader) @ poi-ooxml-schema-encryption
---
[INFO] Executing tasks

main:
[INFO] Executed tasks
[INFO] 
[INFO] --- maven-resources-plugin:2.6:resources (default-resources) @ poi-ooxml-schema-encryption
---
[INFO] Using 'ASCII' encoding to copy filtered resources.
[INFO] skip non existing resourceDirectory <https://builds.apache.org/job/POI-DSL-Maven/ws/sonar/ooxml-schema-encryption/src/main/resources>
[INFO] Copying 73 resources
[INFO] 
[INFO] --- maven-compiler-plugin:3.5.1:compile (default-compile) @ poi-ooxml-schema-encryption
---
[INFO] Changes detected - recompiling the module!
[INFO] Compiling 47 source files to <https://builds.apache.org/job/POI-DSL-Maven/ws/sonar/ooxml-schema-encryption/target/classes>
[INFO] <https://builds.apache.org/job/POI-DSL-Maven/ws/sonar/ooxml-schema-encryption/target/generated-sources/xmlbeans/org/apache/poi/POIXMLTypeLoader.java>
uses or overrides a deprecated API.
[INFO] Recompile with -Xlint:deprecation for details.
[INFO] 
[INFO] --- maven-resources-plugin:2.6:testResources (default-testResources) @ poi-ooxml-schema-encryption
---
[INFO] Using 'ASCII' encoding to copy filtered resources.
[INFO] skip non existing resourceDirectory <https://builds.apache.org/job/POI-DSL-Maven/ws/sonar/ooxml-schema-encryption/src/test/resources>
[INFO] 
[INFO] --- maven-compiler-plugin:3.5.1:testCompile (default-testCompile) @ poi-ooxml-schema-encryption
---
[INFO] No sources to compile
[INFO] 
[INFO] --- maven-surefire-plugin:2.19.1:test (default-test) @ poi-ooxml-schema-encryption
---
[INFO] No tests to run.
[INFO] 
[INFO] --- maven-antrun-plugin:1.8:run (remove-xmltypeloader-from-schema-jar) @ poi-ooxml-schema-encryption
---
[INFO] Executing tasks

main:
   [delete] Deleting directory <https://builds.apache.org/job/POI-DSL-Maven/ws/sonar/ooxml-schema-encryption/target/classes/org/apache>
[INFO] Executed tasks
[INFO] 
[INFO] --- maven-jar-plugin:2.4:jar (default-jar) @ poi-ooxml-schema-encryption ---
[INFO] Building jar: <https://builds.apache.org/job/POI-DSL-Maven/ws/sonar/ooxml-schema-encryption/target/poi-ooxml-schema-encryption-3.16-beta3-SNAPSHOT.jar>
[INFO]                                                                         
[INFO] ------------------------------------------------------------------------
[INFO] Building Apache POI - Openxmlformats Security-Schema package 3.16-beta3-SNAPSHOT
[INFO] ------------------------------------------------------------------------
[INFO] 
[INFO] --- maven-download-plugin:1.1.0:wget (install-xsds-part-1) @ poi-ooxml-schema-security
---
[INFO] Got from cache: <https://builds.apache.org/job/POI-DSL-Maven/ws/.repository/.cache/maven-download-plugin/Office%20Open%20XML%201st%20edition%20Part%202%20(PDF).zip>
[INFO] 
[INFO] --- maven-download-plugin:1.1.0:wget (install-xsds-part-2) @ poi-ooxml-schema-security
---
[INFO] Got from cache: <https://builds.apache.org/job/POI-DSL-Maven/ws/.repository/.cache/maven-download-plugin/dc.xsd>
[INFO] 
[INFO] --- maven-download-plugin:1.1.0:wget (install-xsds-part-3) @ poi-ooxml-schema-security
---
[INFO] Got from cache: <https://builds.apache.org/job/POI-DSL-Maven/ws/.repository/.cache/maven-download-plugin/dcterms.xsd>
[INFO] 
[INFO] --- maven-download-plugin:1.1.0:wget (install-xsds-part-4) @ poi-ooxml-schema-security
---
[INFO] Got from cache: <https://builds.apache.org/job/POI-DSL-Maven/ws/.repository/.cache/maven-download-plugin/dcmitype.xsd>
[INFO] 
[INFO] --- maven-download-plugin:1.1.0:wget (install-xsds-part-5) @ poi-ooxml-schema-security
---
[INFO] Got from cache: <https://builds.apache.org/job/POI-DSL-Maven/ws/.repository/.cache/maven-download-plugin/xmldsig-core-schema.xsd>
[INFO] 
[INFO] --- maven-download-plugin:1.1.0:wget (install-xsds-part-6) @ poi-ooxml-schema-security
---
[INFO] Got from cache: <https://builds.apache.org/job/POI-DSL-Maven/ws/.repository/.cache/maven-download-plugin/XAdES.xsd>
[INFO] 
[INFO] --- maven-download-plugin:1.1.0:wget (install-xsds-part-7) @ poi-ooxml-schema-security
---
[INFO] Got from cache: <https://builds.apache.org/job/POI-DSL-Maven/ws/.repository/.cache/maven-download-plugin/XAdESv141.xsd>
[INFO] 
[INFO] --- maven-antrun-plugin:1.8:run (copy-xmltype-and-xsdconfig) @ poi-ooxml-schema-security
---
[INFO] Executing tasks

main:
     [copy] Copying 7 files to <https://builds.apache.org/job/POI-DSL-Maven/ws/sonar/ooxml-schema-security/target/generated-sources/xmlbeans>
     [copy] Copying 1 file to <https://builds.apache.org/job/POI-DSL-Maven/ws/sonar/ooxml-schema-security/target/schemas>
[INFO] Executed tasks
[INFO] 
[INFO] --- maven-antrun-plugin:1.8:run (unzip-schema) @ poi-ooxml-schema-security ---
[INFO] Executing tasks

main:
     [echo] unzip schemas
    [unzip] Expanding: <https://builds.apache.org/job/POI-DSL-Maven/ws/sonar/ooxml-schema-security/target/OpenPackagingConventions-XMLSchema.zip>
into <https://builds.apache.org/job/POI-DSL-Maven/ws/sonar/ooxml-schema-security/target/schemas>
     [copy] Copying 1 file to <https://builds.apache.org/job/POI-DSL-Maven/ws/sonar/ooxml-schema-security/target/schemas>
[INFO] Executed tasks
[INFO] 
[INFO] --- xmlbeans-maven-plugin:2.3.3:xmlbeans (default) @ poi-ooxml-schema-security ---
[INFO] 
[INFO] --- maven-antrun-plugin:1.8:run (replace-xmltypeloader) @ poi-ooxml-schema-security
---
[INFO] Executing tasks

main:
[INFO] Executed tasks
[INFO] 
[INFO] --- maven-resources-plugin:2.6:resources (default-resources) @ poi-ooxml-schema-security
---
[INFO] Using 'ASCII' encoding to copy filtered resources.
[INFO] skip non existing resourceDirectory <https://builds.apache.org/job/POI-DSL-Maven/ws/sonar/ooxml-schema-security/src/main/resources>
[INFO] Copying 916 resources
[INFO] 
[INFO] --- maven-compiler-plugin:3.5.1:compile (default-compile) @ poi-ooxml-schema-security
---
[INFO] Changes detected - recompiling the module!
[INFO] Compiling 499 source files to <https://builds.apache.org/job/POI-DSL-Maven/ws/sonar/ooxml-schema-security/target/classes>
[INFO] 
[INFO] --- maven-resources-plugin:2.6:testResources (default-testResources) @ poi-ooxml-schema-security
---
[INFO] Using 'ASCII' encoding to copy filtered resources.
[INFO] skip non existing resourceDirectory <https://builds.apache.org/job/POI-DSL-Maven/ws/sonar/ooxml-schema-security/src/test/resources>
[INFO] 
[INFO] --- maven-compiler-plugin:3.5.1:testCompile (default-testCompile) @ poi-ooxml-schema-security
---
[INFO] No sources to compile
[INFO] 
[INFO] --- maven-surefire-plugin:2.19.1:test (default-test) @ poi-ooxml-schema-security ---
[INFO] No tests to run.
[INFO] 
[INFO] --- maven-antrun-plugin:1.8:run (remove-xmltypeloader-from-schema-jar) @ poi-ooxml-schema-security
---
[INFO] Executing tasks

main:
   [delete] Deleting directory <https://builds.apache.org/job/POI-DSL-Maven/ws/sonar/ooxml-schema-security/target/classes/org/apache>
[INFO] Executed tasks
[INFO] 
[INFO] --- maven-jar-plugin:2.4:jar (default-jar) @ poi-ooxml-schema-security ---
[INFO] Building jar: <https://builds.apache.org/job/POI-DSL-Maven/ws/sonar/ooxml-schema-security/target/poi-ooxml-schema-security-3.16-beta3-SNAPSHOT.jar>
[INFO]                                                                         
[INFO] ------------------------------------------------------------------------
[INFO] Building Apache POI OOXML package 3.16-beta3-SNAPSHOT
[INFO] ------------------------------------------------------------------------
[INFO] 
[INFO] --- maven-resources-plugin:3.0.1:copy-resources (copy-sources) @ poi-ooxml ---
[INFO] Using 'ASCII' encoding to copy filtered resources.
[INFO] Copying 417 resources
[INFO] 
[INFO] --- maven-resources-plugin:3.0.1:copy-resources (copy-resources) @ poi-ooxml ---
[INFO] Using 'ASCII' encoding to copy filtered resources.
[INFO] Copying 2 resources
[INFO] 
[INFO] --- maven-resources-plugin:3.0.1:resources (default-resources) @ poi-ooxml ---
[INFO] Using 'ASCII' encoding to copy filtered resources.
[INFO] Copying 2 resources
[INFO] 
[INFO] --- maven-compiler-plugin:3.5.1:compile (default-compile) @ poi-ooxml ---
[INFO] Changes detected - recompiling the module!
[INFO] Compiling 416 source files to <https://builds.apache.org/job/POI-DSL-Maven/ws/sonar/ooxml/target/classes>
[INFO] Some input files use or override a deprecated API.
[INFO] Recompile with -Xlint:deprecation for details.
[INFO] 
[INFO] --- maven-resources-plugin:3.0.1:copy-resources (copy-tests) @ poi-ooxml ---
[INFO] Using 'ASCII' encoding to copy filtered resources.
[INFO] Copying 217 resources
[INFO] 
[INFO] --- maven-resources-plugin:3.0.1:testResources (default-testResources) @ poi-ooxml
---
[INFO] Using 'ASCII' encoding to copy filtered resources.
[INFO] skip non existing resourceDirectory <https://builds.apache.org/job/POI-DSL-Maven/ws/sonar/ooxml/src/test/resources>
[INFO] 
[INFO] --- maven-compiler-plugin:3.5.1:testCompile (default-testCompile) @ poi-ooxml ---
[INFO] Changes detected - recompiling the module!
[INFO] Compiling 217 source files to <https://builds.apache.org/job/POI-DSL-Maven/ws/sonar/ooxml/target/test-classes>
[INFO] Some input files use or override a deprecated API.
[INFO] Recompile with -Xlint:deprecation for details.
[INFO] -------------------------------------------------------------
[ERROR] COMPILATION ERROR : 
[INFO] -------------------------------------------------------------
[ERROR] <https://builds.apache.org/job/POI-DSL-Maven/ws/sonar/ooxml/src/test/java/org/apache/poi/xslf/usermodel/TestXSLFTextShape.java>:[938,60]
inconvertible types
found   : org.apache.poi.sl.usermodel.TextShape<capture#914 of ?,capture#21 of ? extends
org.apache.poi.sl.usermodel.TextParagraph<?,?,org.apache.poi.sl.usermodel.TextRun>>
required: org.apache.poi.xslf.usermodel.XSLFAutoShape
[INFO] 1 error
[INFO] -------------------------------------------------------------
[INFO] ------------------------------------------------------------------------
[INFO] Reactor Summary:
[INFO] 
[INFO] Apache POI - the Java API for Microsoft Documents . SUCCESS [  0.002 s]
[INFO] Apache POI Main package ........................... SUCCESS [01:36 min]
[INFO] Apache POI Scratchpad package ..................... SUCCESS [ 15.989 s]
[INFO] Apache POI - Openxmlformats Schema package ........ SUCCESS [ 53.121 s]
[INFO] Apache POI - Openxmlformats Encryption Schema package  SUCCESS [  0.605 s]
[INFO] Apache POI - Openxmlformats Security-Schema package  SUCCESS [  7.241 s]
[INFO] Apache POI OOXML package .......................... FAILURE [  2.198 s]
[INFO] Apache POI ExcelAnt package ....................... SKIPPED
[INFO] Apache POI Examples package ....................... SKIPPED
[INFO] ------------------------------------------------------------------------
[INFO] BUILD FAILURE
[INFO] ------------------------------------------------------------------------
[INFO] Total time: 02:55 min
[INFO] Finished at: 2017-02-13T04:06:18+00:00
[INFO] Final Memory: 44M/800M
[INFO] ------------------------------------------------------------------------
[ERROR] Failed to execute goal org.apache.maven.plugins:maven-compiler-plugin:3.5.1:testCompile
(default-testCompile) on project poi-ooxml: Compilation failure
[ERROR] <https://builds.apache.org/job/POI-DSL-Maven/ws/sonar/ooxml/src/test/java/org/apache/poi/xslf/usermodel/TestXSLFTextShape.java>:[938,60]
inconvertible types
[ERROR] found   : org.apache.poi.sl.usermodel.TextShape<capture#914 of ?,capture#21 of
? extends org.apache.poi.sl.usermodel.TextParagraph<?,?,org.apache.poi.sl.usermodel.TextRun>>
[ERROR] required: org.apache.poi.xslf.usermodel.XSLFAutoShape
[ERROR] -> [Help 1]
[ERROR] 
[ERROR] To see the full stack trace of the errors, re-run Maven with the -e switch.
[ERROR] Re-run Maven using the -X switch to enable full debug logging.
[ERROR] 
[ERROR] For more information about the errors and possible solutions, please read the following
articles:
[ERROR] [Help 1] http://cwiki.apache.org/confluence/display/MAVEN/MojoFailureException
[ERROR] 
[ERROR] After correcting the problems, you can resume the build with the command
[ERROR]   mvn <goals> -rf :poi-ooxml
Build step 'Invoke top-level Maven targets' marked build as failure

---------------------------------------------------------------------
To unsubscribe, e-mail: dev-unsubscribe@poi.apache.org
For additional commands, e-mail: dev-help@poi.apache.org


Mime
View raw message