poi-dev mailing list archives

Site index · List index
Message view « Date » · « Thread »
Top « Date » · « Thread »
From Apache Jenkins Server <jenk...@builds.apache.org>
Subject Build failed in Jenkins: POI-DSL-1.6 #113
Date Thu, 19 Jan 2017 08:29:31 GMT
See <https://builds.apache.org/job/POI-DSL-1.6/113/changes>

Changes:

[onealj] bug 60601: hyperlinks have to be removed one by one to avoid other errors

------------------------------------------
[...truncated 305 lines...]
     [copy] Copying 1 file to <https://builds.apache.org/job/POI-DSL-1.6/ws/build/excelant-classes>

compile:

-compile-ooxml-lite-check:

compile-ooxml-lite:
     [echo] Running ooxml-lite generator
    [mkdir] Created dir: <https://builds.apache.org/job/POI-DSL-1.6/ws/build/ooxml-lite-merged>
      [jar] Building jar: <https://builds.apache.org/job/POI-DSL-1.6/ws/build/ooxml-lite-merged/ooxml-lite-merged.jar>
     [java] Collecting unit tests from <https://builds.apache.org/job/POI-DSL-1.6/ws/build/ooxml-test-classes>
     [java] Inner class org.apache.poi.xslf.usermodel.TestPPTX2PNG$1.class not included
     [java] Inner class org.apache.poi.xssf.streaming.TempFileRecordingSXSSFWorkbookWithCustomZipEntrySource$TempFileRecordingSheetDataWriterWithDecorator.class
not included
     [java] Inner class org.apache.poi.xssf.usermodel.TestFormulaEvaluatorOnXSSF$1.class not
included
     [java] Inner class org.apache.poi.xssf.usermodel.TestMultiSheetFormulaEvaluatorOnXSSF$1.class
not included
     [java] Found 196 classes
     [java] org.apache.poi.openxml4j.exceptions.NotOfficeXmlFileException: No valid entries
or contents found, this is not a valid OOXML (Office Open XML) file
     [java] 	at org.apache.poi.openxml4j.opc.ZipPackage.getPartsImpl(ZipPackage.java:286)
     [java] 	at org.apache.poi.openxml4j.opc.OPCPackage.getParts(OPCPackage.java:758)
     [java] .......................org.apache.poi.openxml4j.exceptions.NotOfficeXmlFileException
at org.apache.poi.openxml4j.opc.OPCPackage.open(OPCPackage.java:298)
     [java] No valid entries or contents found, this is not a valid OOXML (Office Open XML)
file
     [java] 
     [java] 	at org.apache.poi.openxml4j.opc.TestPackage.testCorruptFile(TestPackage.java:953)
     [java] 	at sun.reflect.NativeMethodAccessorImpl.invoke0(Native Method)
     [java] 	at sun.reflect.NativeMethodAccessorImpl.invoke(NativeMethodAccessorImpl.java:39)
     [java] 	at sun.reflect.DelegatingMethodAccessorImpl.invoke(DelegatingMethodAccessorImpl.java:25)
     [java] 	at java.lang.reflect.Method.invoke(Method.java:597)
     [java] 	at org.junit.runners.model.FrameworkMethod$1.runReflectiveCall(FrameworkMethod.java:50)
     [java] 	at org.junit.internal.runners.model.ReflectiveCallable.run(ReflectiveCallable.java:12)
     [java] 	at org.junit.runners.model.FrameworkMethod.invokeExplosively(FrameworkMethod.java:47)
     [java] 	at org.junit.internal.runners.statements.InvokeMethod.evaluate(InvokeMethod.java:17)
     [java] 	at org.junit.runners.ParentRunner.runLeaf(ParentRunner.java:325)
     [java] 	at org.junit.runners.BlockJUnit4ClassRunner.runChild(BlockJUnit4ClassRunner.java:78)
     [java] 	at org.junit.runners.BlockJUnit4ClassRunner.runChild(BlockJUnit4ClassRunner.java:57)
     [java] 	at org.junit.runners.ParentRunner$3.run(ParentRunner.java:290)
     [java] 	at org.junit.runners.ParentRunner$1.schedule(ParentRunner.java:71)
     [java] 	at org.junit.runners.ParentRunner.runChildren(ParentRunner.java:288)
     [java] 	at org.junit.runners.ParentRunner.access$000(ParentRunner.java:58)
     [java] 	at org.junit.runners.ParentRunner$2.evaluate(ParentRunner.java:268)
     [java] 	at org.junit.runners.ParentRunner.run(ParentRunner.java:363)
     [java] 	at org.junit.runners.Suite.runChild(Suite.java:128)
     [java] 	at org.junit.runners.Suite.runChild(Suite.java:27)
     [java] 	at org.junit.runners.ParentRunner$3.run(ParentRunner.java:290)
     [java] 	at org.junit.runners.ParentRunner$1.schedule(ParentRunner.java:71)
     [java] 	at org.junit.runners.ParentRunner.runChildren(ParentRunner.java:288)
     [java] 	at org.junit.runners.ParentRunner.access$000(ParentRunner.java:58)
     [java] 	at org.junit.runners.ParentRunner$2.evaluate(ParentRunner.java:268)
     [java] 	at org.junit.runners.ParentRunner.run(ParentRunner.java:363)
     [java] 	at org.junit.runner.JUnitCore.run(JUnitCore.java:137)
     [java] 	at org.junit.runner.JUnitCore.run(JUnitCore.java:115)
     [java] 	at org.junit.runner.JUnitCore.run(JUnitCore.java:105)
     [java] 	at org.junit.runner.JUnitCore.run(JUnitCore.java:94)
     [java] 	at org.apache.poi.util.OOXMLLite.build(OOXMLLite.java:131)
     [java] 	at org.apache.poi.util.OOXMLLite.main(OOXMLLite.java:88)
     [java] .........I.................................I.....................................I..............................................................................................................................................................................................................................................................................I...................................................................................................E...........11
     [java] Calibri
     [java] ......................I..I.I.I...............................................................................................................Setting
col: 0 and row 0
     [java] Setting col: 1 and row 1
     [java] ..................................................................................................................................................................................................................................................................................................................................................................................................................................................................................................................................................Cell
formula evaluation currently unsupported
     [java] Array formulas currently unsupported
     [java] ....................................................................................................................III.II.I.......I.......I.....I......................................................I............................................................................................I...............................................................................................................................................................................................................................................................I.....I.................................................................................................................I.....Cell:
3E-104
     [java] Cell: 5E-104
     [java] Cell: 5E-106
     [java] Cell: 
     [java] .II........I.I........................I........Reading row 0, col 1
     [java] Formula:A1
     [java] Formula Result Type:STRING
     [java] Reading row 1, col 1
     [java] Formula:A1
     [java] Formula Result Type:STRING
     [java] .I.....I..........................................................................<https://builds.apache.org/job/POI-DSL-1.6/ws/test-data/spreadsheet/Formatting.xlsx>
     [java] 
     [java] /_rels/.rels
     [java] 	application/vnd.openxmlformats-package.relationships+xml
     [java] 	588 bytes
     [java] /docProps/app.xml
     [java] 	application/vnd.openxmlformats-officedocument.extended-properties+xml
     [java] 	839 bytes
     [java] 	0 relations
     [java] /docProps/core.xml
     [java] 	application/vnd.openxmlformats-package.core-properties+xml
     [java] 	0 relations
     [java] /xl/_rels/workbook.xml.rels
     [java] 	application/vnd.openxmlformats-package.relationships+xml
     [java] 	980 bytes
     [java] /xl/sharedStrings.xml
     [java] 	application/vnd.openxmlformats-officedocument.spreadsheetml.sharedStrings+xml
     [java] 	477 bytes
     [java] 	0 relations
     [java] /xl/styles.xml
     [java] 	application/vnd.openxmlformats-officedocument.spreadsheetml.styles+xml
     [java] 	2237 bytes
     [java] 	0 relations
     [java] /xl/theme/theme1.xml
     [java] 	application/vnd.openxmlformats-officedocument.theme+xml
     [java] 	6995 bytes
     [java] 	0 relations
     [java] /xl/workbook.xml
     [java] 	application/vnd.openxmlformats-officedocument.spreadsheetml.sheet.main+xml
     [java] 	624 bytes
     [java] 	6 relations
     [java] 	  Relationship:
     [java] 	  	From: /xl/workbook.xml
     [java] 	  	To:   /xl/worksheets/sheet1.xml
     [java] 	  	ID:   rId1
     [java] 	  	Mode: INTERNAL
     [java] 	  	Type: http://schemas.openxmlformats.org/officeDocument/2006/relationships/worksheet
     [java] 	  Relationship:
     [java] 	  	From: /xl/workbook.xml
     [java] 	  	To:   /xl/worksheets/sheet2.xml
     [java] 	  	ID:   rId2
     [java] 	  	Mode: INTERNAL
     [java] 	  	Type: http://schemas.openxmlformats.org/officeDocument/2006/relationships/worksheet
     [java] 	  Relationship:
     [java] 	  	From: /xl/workbook.xml
     [java] 	  	To:   /xl/worksheets/sheet3.xml
     [java] 	  	ID:   rId3
     [java] 	  	Mode: INTERNAL
     [java] 	  	Type: http://schemas.openxmlformats.org/officeDocument/2006/relationships/worksheet
     [java] 	  Relationship:
     [java] 	  	From: /xl/workbook.xml
     [java] 	  	To:   /xl/theme/theme1.xml
     [java] 	  	ID:   rId4
     [java] 	  	Mode: INTERNAL
     [java] 	  	Type: http://schemas.openxmlformats.org/officeDocument/2006/relationships/theme
     [java] 	  Relationship:
     [java] 	  	From: /xl/workbook.xml
     [java] 	  	To:   /xl/styles.xml
     [java] 	  	ID:   rId5
     [java] 	  	Mode: INTERNAL
     [java] 	  	Type: http://schemas.openxmlformats.org/officeDocument/2006/relationships/styles
     [java] 	  Relationship:
     [java] 	  	From: /xl/workbook.xml
     [java] 	  	To:   /xl/sharedStrings.xml
     [java] 	  	ID:   rId6
     [java] 	  	Mode: INTERNAL
     [java] 	  	Type: http://schemas.openxmlformats.org/officeDocument/2006/relationships/sharedStrings
     [java] /xl/worksheets/sheet1.xml
     [java] 	application/vnd.openxmlformats-officedocument.spreadsheetml.worksheet+xml
     [java] 	1814 bytes
     [java] 	0 relations
     [java] /xl/worksheets/sheet2.xml
     [java] 	application/vnd.openxmlformats-officedocument.spreadsheetml.worksheet+xml
     [java] 	439 bytes
     [java] 	0 relations
     [java] /xl/worksheets/sheet3.xml
     [java] 	application/vnd.openxmlformats-officedocument.spreadsheetml.worksheet+xml
     [java] 	439 bytes
     [java] 	0 relations
     [java] 
     [java] Relationship:
     [java] 	From: /
     [java] 	To:   /xl/workbook.xml
     [java] 	ID:   rId1
     [java] 	Mode: INTERNAL
     [java] 	Type: http://schemas.openxmlformats.org/officeDocument/2006/relationships/officeDocument
     [java] Relationship:
     [java] 	From: /
     [java] 	To:   /docProps/core.xml
     [java] 	ID:   rId2
     [java] 	Mode: INTERNAL
     [java] 	Type: http://schemas.openxmlformats.org/package/2006/relationships/metadata/core-properties
     [java] Relationship:
     [java] 	From: /
     [java] 	To:   /docProps/app.xml
     [java] 	ID:   rId3
     [java] 	Mode: INTERNAL
     [java] 	Type: http://schemas.openxmlformats.org/officeDocument/2006/relationships/extended-properties
     [java] .III.Reading zip-file <https://builds.apache.org/job/POI-DSL-1.6/ws/test-data/spreadsheet/Formatting.xlsx>
and writing pretty-printed XML to /tmp/poifiles/Formatting6957681495441338997-pretty.xlsx
     [java] ............
     [java] Done.
     [java] SLF4J: Failed to load class "org.slf4j.impl.StaticLoggerBinder".
     [java] SLF4J: Defaulting to no-operation (NOP) logger implementation
     [java] SLF4J: See http://www.slf4j.org/codes.html#StaticLoggerBinder for further details.
     [java] ...............................I.............................................................................................BorderStyle
short usage
     [java] ...FillPatternType short usage
     [java] ....setCellStyleProps start
     [java] HorizontalAlignment short usage
     [java] HorizontalAlignment short usage
     [java] setCellStyleProps nearing end
     [java] .......BorderStyle short usage
     [java] ...FillPatternType short usage
     [java] ....setCellStyleProps start
     [java] HorizontalAlignment short usage
     [java] HorizontalAlignment short usage
     [java] setCellStyleProps nearing end
     [java] ...............................Took: 1484ms
     [java] Exception in thread "main" java.lang.RuntimeException: Tests did not succeed,
cannot build ooxml-lite jar
     [java] 	at org.apache.poi.util.OOXMLLite.build(OOXMLLite.java:133)
     [java] 	at org.apache.poi.util.OOXMLLite.main(OOXMLLite.java:88)
     [java] .....................
     [java] Time: 291.417
     [java] There was 1 failure:
     [java] 1) removeAllHyperlinks(org.apache.poi.xssf.streaming.TestSXSSFSheet)
     [java] java.lang.IllegalArgumentException: Expected an instance of SXSSFWorkbook
     [java] 	at org.apache.poi.xssf.SXSSFITestDataProvider.writeOutAndReadBack(SXSSFITestDataProvider.java:68)
     [java] 	at org.apache.poi.xssf.SXSSFITestDataProvider.writeOutAndReadBack(SXSSFITestDataProvider.java:43)
     [java] 	at org.apache.poi.ss.usermodel.BaseTestSheet.removeAllHyperlinks(BaseTestSheet.java:1254)
     [java] 	at sun.reflect.NativeMethodAccessorImpl.invoke0(Native Method)
     [java] 	at sun.reflect.NativeMethodAccessorImpl.invoke(NativeMethodAccessorImpl.java:39)
     [java] 	at sun.reflect.DelegatingMethodAccessorImpl.invoke(DelegatingMethodAccessorImpl.java:25)
     [java] 	at java.lang.reflect.Method.invoke(Method.java:597)
     [java] 	at org.junit.runners.model.FrameworkMethod$1.runReflectiveCall(FrameworkMethod.java:50)
     [java] 	at org.junit.internal.runners.model.ReflectiveCallable.run(ReflectiveCallable.java:12)
     [java] 	at org.junit.runners.model.FrameworkMethod.invokeExplosively(FrameworkMethod.java:47)
     [java] 	at org.junit.internal.runners.statements.InvokeMethod.evaluate(InvokeMethod.java:17)
     [java] 	at org.junit.internal.runners.statements.RunAfters.evaluate(RunAfters.java:27)
     [java] 	at org.junit.rules.ExpectedException$ExpectedExceptionStatement.evaluate(ExpectedException.java:239)
     [java] 	at org.junit.rules.RunRules.evaluate(RunRules.java:20)
     [java] 	at org.junit.runners.ParentRunner.runLeaf(ParentRunner.java:325)
     [java] 	at org.junit.runners.BlockJUnit4ClassRunner.runChild(BlockJUnit4ClassRunner.java:78)
     [java] 	at org.junit.runners.BlockJUnit4ClassRunner.runChild(BlockJUnit4ClassRunner.java:57)
     [java] 	at org.junit.runners.ParentRunner$3.run(ParentRunner.java:290)
     [java] 	at org.junit.runners.ParentRunner$1.schedule(ParentRunner.java:71)
     [java] 	at org.junit.runners.ParentRunner.runChildren(ParentRunner.java:288)
     [java] 	at org.junit.runners.ParentRunner.access$000(ParentRunner.java:58)
     [java] 	at org.junit.runners.ParentRunner$2.evaluate(ParentRunner.java:268)
     [java] 	at org.junit.runners.ParentRunner.run(ParentRunner.java:363)
     [java] 	at org.junit.runners.Suite.runChild(Suite.java:128)
     [java] 	at org.junit.runners.Suite.runChild(Suite.java:27)
     [java] 	at org.junit.runners.ParentRunner$3.run(ParentRunner.java:290)
     [java] 	at org.junit.runners.ParentRunner$1.schedule(ParentRunner.java:71)
     [java] 	at org.junit.runners.ParentRunner.runChildren(ParentRunner.java:288)
     [java] 	at org.junit.runners.ParentRunner.access$000(ParentRunner.java:58)
     [java] 	at org.junit.runners.ParentRunner$2.evaluate(ParentRunner.java:268)
     [java] 	at org.junit.runners.ParentRunner.run(ParentRunner.java:363)
     [java] 	at org.junit.runner.JUnitCore.run(JUnitCore.java:137)
     [java] 	at org.junit.runner.JUnitCore.run(JUnitCore.java:115)
     [java] 	at org.junit.runner.JUnitCore.run(JUnitCore.java:105)
     [java] 	at org.junit.runner.JUnitCore.run(JUnitCore.java:94)
     [java] 	at org.apache.poi.util.OOXMLLite.build(OOXMLLite.java:131)
     [java] 	at org.apache.poi.util.OOXMLLite.main(OOXMLLite.java:88)
     [java] 
     [java] FAILURES!!!
     [java] Tests run: 2131,  Failures: 1
     [java] 

BUILD FAILED
<https://builds.apache.org/job/POI-DSL-1.6/ws/build.xml>:1616: Java returned: 1

Total time: 5 minutes 41 seconds
Build step 'Invoke Ant' marked build as failure
Skipping publisher since build result is FAILURE
Archiving artifacts
Compressed 66.31 MB of artifacts by 65.3% relative to #111
Skipping publisher since build result is FAILURE
Recording test results
ERROR: Step ?Publish JUnit test result report? failed: No test report files were found. Configuration
error?


---------------------------------------------------------------------
To unsubscribe, e-mail: dev-unsubscribe@poi.apache.org
For additional commands, e-mail: dev-help@poi.apache.org


Mime
View raw message