poi-dev mailing list archives

Site index · List index
Message view « Date » · « Thread »
Top « Date » · « Thread »
From Apache Jenkins Server <jenk...@builds.apache.org>
Subject Build failed in Jenkins: POI-DSL-1.6 #131
Date Fri, 27 Jan 2017 09:15:58 GMT
See <https://builds.apache.org/job/POI-DSL-1.6/131/changes>

Changes:

[onealj] reduce the chance of a lazy copy-paste error of creating wrong release version

[onealj] update 3.16 beta 2 release summary

------------------------------------------
[...truncated 5595 lines...]
  1800K .......... .......... .......... .......... .......... 23% 79.2M 1s
  1850K .......... .......... .......... .......... .......... 24% 37.4M 1s
  1900K .......... .......... .......... .......... .......... 25% 15.5M 1s
  1950K .......... .......... .......... .......... .......... 25% 41.0M 1s
  2000K .......... .......... .......... .......... .......... 26% 25.4M 1s
  2050K .......... .......... .......... .......... .......... 27% 19.4M 1s
  2100K .......... .......... .......... .......... .......... 27% 2.46M 1s
  2150K .......... .......... .......... .......... .......... 28%  114M 1s
  2200K .......... .......... .......... .......... .......... 29%  117M 1s
  2250K .......... .......... .......... .......... .......... 29% 11.6M 1s
  2300K .......... .......... .......... .......... .......... 30% 84.1M 0s
  2350K .......... .......... .......... .......... .......... 31% 79.4M 0s
  2400K .......... .......... .......... .......... .......... 31% 1.37M 1s
  2450K .......... .......... .......... .......... .......... 32%  132M 1s
  2500K .......... .......... .......... .......... .......... 32%  146M 1s
  2550K .......... .......... .......... .......... .......... 33%  155M 0s
  2600K .......... .......... .......... .......... .......... 34% 11.1M 0s
  2650K .......... .......... .......... .......... .......... 34%  163M 0s
  2700K .......... .......... .......... .......... .......... 35% 92.4M 0s
  2750K .......... .......... .......... .......... .......... 36% 11.0M 0s
  2800K .......... .......... .......... .......... .......... 36% 84.8M 0s
  2850K .......... .......... .......... .......... .......... 37% 83.7M 0s
  2900K .......... .......... .......... .......... .......... 38% 13.2M 0s
  2950K .......... .......... .......... .......... .......... 38% 90.7M 0s
  3000K .......... .......... .......... .......... .......... 39% 97.2M 0s
  3050K .......... .......... .......... .......... .......... 40% 1.57M 0s
  3100K .......... .......... .......... .......... .......... 40% 99.0M 0s
  3150K .......... .......... .......... .......... .......... 41% 80.0M 0s
  3200K .......... .......... .......... .......... .......... 42% 99.4M 0s
  3250K .......... .......... .......... .......... .......... 42% 13.0M 0s
  3300K .......... .......... .......... .......... .......... 43% 73.7M 0s
  3350K .......... .......... .......... .......... .......... 43% 69.8M 0s
  3400K .......... .......... .......... .......... .......... 44% 80.6M 0s
  3450K .......... .......... .......... .......... .......... 45% 12.4M 0s
  3500K .......... .......... .......... .......... .......... 45%  115M 0s
  3550K .......... .......... .......... .......... .......... 46% 99.3M 0s
  3600K .......... .......... .......... .......... .......... 47% 23.0M 0s
  3650K .......... .......... .......... .......... .......... 47% 19.6M 0s
  3700K .......... .......... .......... .......... .......... 48%  154M 0s
  3750K .......... .......... .......... .......... .......... 49% 40.0M 0s
  3800K .......... .......... .......... .......... .......... 49% 66.8M 0s
  3850K .......... .......... .......... .......... .......... 50% 26.8M 0s
  3900K .......... .......... .......... .......... .......... 51% 44.2M 0s
  3950K .......... .......... .......... .......... .......... 51% 49.3M 0s
  4000K .......... .......... .......... .......... .......... 52% 51.8M 0s
  4050K .......... .......... .......... .......... .......... 53% 28.2M 0s
  4100K .......... .......... .......... .......... .......... 53% 32.4M 0s
  4150K .......... .......... .......... .......... .......... 54% 39.0M 0s
  4200K .......... .......... .......... .......... .......... 54% 68.1M 0s
  4250K .......... .......... .......... .......... .......... 55% 35.8M 0s
  4300K .......... .......... .......... .......... .......... 56% 25.0M 0s
  4350K .......... .......... .......... .......... .......... 56%  116M 0s
  4400K .......... .......... .......... .......... .......... 57% 30.9M 0s
  4450K .......... .......... .......... .......... .......... 58% 47.1M 0s
  4500K .......... .......... .......... .......... .......... 58% 61.8M 0s
  4550K .......... .......... .......... .......... .......... 59% 26.2M 0s
  4600K .......... .......... .......... .......... .......... 60%  144M 0s
  4650K .......... .......... .......... .......... .......... 60% 37.4M 0s
  4700K .......... .......... .......... .......... .......... 61% 80.5M 0s
  4750K .......... .......... .......... .......... .......... 62% 44.4M 0s
  4800K .......... .......... .......... .......... .......... 62% 20.8M 0s
  4850K .......... .......... .......... .......... .......... 63%  107M 0s
  4900K .......... .......... .......... .......... .......... 64% 94.8M 0s
  4950K .......... .......... .......... .......... .......... 64% 60.9M 0s
  5000K .......... .......... .......... .......... .......... 65% 57.1M 0s
  5050K .......... .......... .......... .......... .......... 65% 19.7M 0s
  5100K .......... .......... .......... .......... .......... 66%  103M 0s
  5150K .......... .......... .......... .......... .......... 67% 28.5M 0s
  5200K .......... .......... .......... .......... .......... 67% 84.3M 0s
  5250K .......... .......... .......... .......... .......... 68%  122M 0s
  5300K .......... .......... .......... .......... .......... 69% 23.9M 0s
  5350K .......... .......... .......... .......... .......... 69% 65.9M 0s
  5400K .......... .......... .......... .......... .......... 70% 47.3M 0s
  5450K .......... .......... .......... .......... .......... 71% 63.6M 0s
  5500K .......... .......... .......... .......... .......... 71% 83.1M 0s
  5550K .......... .......... .......... .......... .......... 72% 49.3M 0s
  5600K .......... .......... .......... .......... .......... 73% 30.3M 0s
  5650K .......... .......... .......... .......... .......... 73% 42.8M 0s
  5700K .......... .......... .......... .......... .......... 74% 96.7M 0s
  5750K .......... .......... .......... .......... .......... 75% 58.1M 0s
  5800K .......... .......... .......... .......... .......... 75% 83.2M 0s
  5850K .......... .......... .......... .......... .......... 76% 30.0M 0s
  5900K .......... .......... .......... .......... .......... 76% 60.4M 0s
  5950K .......... .......... .......... .......... .......... 77% 51.8M 0s
  6000K .......... .......... .......... .......... .......... 78% 57.1M 0s
  6050K .......... .......... .......... .......... .......... 78% 91.5M 0s
  6100K .......... .......... .......... .......... .......... 79% 2.00M 0s
  6150K .......... .......... .......... .......... .......... 80%  151M 0s
  6200K .......... .......... .......... .......... .......... 80%  187M 0s
  6250K .......... .......... .......... .......... .......... 81%  187M 0s
  6300K .......... .......... .......... .......... .......... 82%  182M 0s
  6350K .......... .......... .......... .......... .......... 82%  135M 0s
  6400K .......... .......... .......... .......... .......... 83%  137M 0s
  6450K .......... .......... .......... .......... .......... 84% 12.9M 0s
  6500K .......... .......... .......... .......... .......... 84% 98.3M 0s
  6550K .......... .......... .......... .......... .......... 85% 89.9M 0s
  6600K .......... .......... .......... .......... .......... 86% 91.7M 0s
  6650K .......... .......... .......... .......... .......... 86% 85.3M 0s
  6700K .......... .......... .......... .......... .......... 87% 80.0M 0s
  6750K .......... .......... .......... .......... .......... 87% 21.2M 0s
  6800K .......... .......... .......... .......... .......... 88% 98.7M 0s
  6850K .......... .......... .......... .......... .......... 89% 64.1M 0s
  6900K .......... .......... .......... .......... .......... 89%  122M 0s
  6950K .......... .......... .......... .......... .......... 90% 82.8M 0s
  7000K .......... .......... .......... .......... .......... 91% 83.4M 0s
  7050K .......... .......... .......... .......... .......... 91% 33.1M 0s
  7100K .......... .......... .......... .......... .......... 92% 56.6M 0s
  7150K .......... .......... .......... .......... .......... 93% 47.8M 0s
  7200K .......... .......... .......... .......... .......... 93% 78.5M 0s
  7250K .......... .......... .......... .......... .......... 94%  102M 0s
  7300K .......... .......... .......... .......... .......... 95% 38.3M 0s
  7350K .......... .......... .......... .......... .......... 95% 81.1M 0s
  7400K .......... .......... .......... .......... .......... 96% 62.1M 0s
  7450K .......... .......... .......... .......... .......... 97% 80.4M 0s
  7500K .......... .......... .......... .......... .......... 97% 57.2M 0s
  7550K .......... .......... .......... .......... .......... 98% 68.9M 0s
  7600K .......... .......... .......... .......... .......... 98% 35.4M 0s
  7650K .......... .......... .......... .......... .......... 99%  115M 0s
  7700K .......... .......... .......                         100%  109M=0.4s

2017-01-27 09:07:42 (18.1 MB/s) - ‘lib/findbugs-noUpdateChecks-2.0.3.zip’ saved
[7913272/7913272]

[POI-DSL-1.6] $ /home/jenkins/tools/ant/latest/bin/ant -Dcoverage.enabled=true clean jenkins
Buildfile: <https://builds.apache.org/job/POI-DSL-1.6/ws/build.xml>

clean:

check-jars:

fetch-jars:
      [get] Getting: https://repo1.maven.org/maven2/commons-logging/commons-logging/1.2/commons-logging-1.2.jar
      [get] To: <https://builds.apache.org/job/POI-DSL-1.6/ws/lib/commons-logging-1.2.jar>
      [get] Getting: https://repo1.maven.org/maven2/commons-codec/commons-codec/1.10/commons-codec-1.10.jar
      [get] To: <https://builds.apache.org/job/POI-DSL-1.6/ws/lib/commons-codec-1.10.jar>
      [get] Getting: https://repo1.maven.org/maven2/log4j/log4j/1.2.17/log4j-1.2.17.jar
      [get] To: <https://builds.apache.org/job/POI-DSL-1.6/ws/lib/log4j-1.2.17.jar>
      [get] Getting: https://repo1.maven.org/maven2/junit/junit/4.12/junit-4.12.jar
      [get] To: <https://builds.apache.org/job/POI-DSL-1.6/ws/lib/junit-4.12.jar>
      [get] Getting: https://repo1.maven.org/maven2/org/hamcrest/hamcrest-core/1.3/hamcrest-core-1.3.jar
      [get] To: <https://builds.apache.org/job/POI-DSL-1.6/ws/lib/hamcrest-core-1.3.jar>
      [get] Getting: https://repo1.maven.org/maven2/org/apache/ant/ant/1.9.4/ant-1.9.4.jar
      [get] To: <https://builds.apache.org/job/POI-DSL-1.6/ws/lib/ant-1.9.4.jar>
      [get] Getting: https://repo1.maven.org/maven2/org/apache/ant/ant-launcher/1.9.4/ant-launcher-1.9.4.jar
      [get] To: <https://builds.apache.org/job/POI-DSL-1.6/ws/lib/ant-launcher-1.9.4.jar>
      [get] Getting: https://repo1.maven.org/maven2/org/ow2/asm/asm-all/5.0.3/asm-all-5.0.3.jar
      [get] To: <https://builds.apache.org/job/POI-DSL-1.6/ws/lib/asm-all-5.0.3.jar>
      [get] Getting: https://repo1.maven.org/maven2/org/jacoco/jacoco/0.7.8/jacoco-0.7.8.zip
      [get] To: <https://builds.apache.org/job/POI-DSL-1.6/ws/lib/jacoco-0.7.8.zip>
      [get] Getting: https://repo1.maven.org/maven2/org/apache/commons/commons-collections4/4.1/commons-collections4-4.1.jar
      [get] To: <https://builds.apache.org/job/POI-DSL-1.6/ws/lib/commons-collections4-4.1.jar>
    [unzip] Expanding: <https://builds.apache.org/job/POI-DSL-1.6/ws/lib/jacoco-0.7.8.zip>
into <https://builds.apache.org/job/POI-DSL-1.6/ws/>
      [get] Getting: https://repo1.maven.org/maven2/org/apache/rat/apache-rat/0.12/apache-rat-0.12.jar
      [get] To: <https://builds.apache.org/job/POI-DSL-1.6/ws/lib/apache-rat-0.12.jar>
      [get] Getting: https://repo1.maven.org/maven2/de/thetaphi/forbiddenapis/2.1/forbiddenapis-2.1.jar
      [get] To: <https://builds.apache.org/job/POI-DSL-1.6/ws/lib/forbiddenapis-2.1.jar>
      [get] Getting: https://repo1.maven.org/maven2/org/bouncycastle/bcprov-ext-jdk15on/1.54/bcprov-ext-jdk15on-1.54.jar
      [get] To: <https://builds.apache.org/job/POI-DSL-1.6/ws/compile-lib/bcprov-ext-jdk15on-1.54.jar>
      [get] Getting: https://repo1.maven.org/maven2/org/bouncycastle/bcpkix-jdk15on/1.54/bcpkix-jdk15on-1.54.jar
      [get] To: <https://builds.apache.org/job/POI-DSL-1.6/ws/compile-lib/bcpkix-jdk15on-1.54.jar>
      [get] Getting: https://repo1.maven.org/maven2/org/apache/santuario/xmlsec/2.0.6/xmlsec-2.0.6.jar
      [get] To: <https://builds.apache.org/job/POI-DSL-1.6/ws/compile-lib/xmlsec-2.0.6.jar>
      [get] Getting: https://repo1.maven.org/maven2/org/slf4j/slf4j-api/1.7.12/slf4j-api-1.7.12.jar
      [get] To: <https://builds.apache.org/job/POI-DSL-1.6/ws/compile-lib/slf4j-api-1.7.12.jar>

check-ooxml-jars:

fetch-ooxml-jars:
      [get] Getting: https://repo1.maven.org/maven2/com/github/virtuald/curvesapi/1.04/curvesapi-1.04.jar
      [get] To: <https://builds.apache.org/job/POI-DSL-1.6/131/artifact/ooxml-lib/curvesapi-1.04.jar>
      [get] Getting: https://repo1.maven.org/maven2/org/apache/xmlbeans/xmlbeans/2.3.0/xmlbeans-2.3.0.jar
      [get] To: <https://builds.apache.org/job/POI-DSL-1.6/131/artifact/ooxml-lib/xmlbeans-2.3.0.jar.orig>
      [get] Getting: https://repo1.maven.org/maven2/org/apache/xmlbeans/xmlbeans/2.6.0/xmlbeans-2.6.0.jar
      [get] To: <https://builds.apache.org/job/POI-DSL-1.6/131/artifact/ooxml-lib/xmlbeans-2.6.0.jar.orig>
      [zip] Building zip: <https://builds.apache.org/job/POI-DSL-1.6/131/artifact/ooxml-lib/xmlbeans-2.3.0.jar>
      [zip] Building zip: <https://builds.apache.org/job/POI-DSL-1.6/131/artifact/ooxml-lib/xmlbeans-2.6.0.jar>

init:
    [mkdir] Created dir: <https://builds.apache.org/job/POI-DSL-1.6/ws/build>
    [mkdir] Created dir: <https://builds.apache.org/job/POI-DSL-1.6/ws/build/classes>
    [mkdir] Created dir: <https://builds.apache.org/job/POI-DSL-1.6/ws/build/test-classes>
    [mkdir] Created dir: <https://builds.apache.org/job/POI-DSL-1.6/ws/build/test-results>
    [mkdir] Created dir: <https://builds.apache.org/job/POI-DSL-1.6/ws/build/scratchpad-classes>
    [mkdir] Created dir: <https://builds.apache.org/job/POI-DSL-1.6/ws/build/scratchpad-test-classes>
    [mkdir] Created dir: <https://builds.apache.org/job/POI-DSL-1.6/ws/build/scratchpad-test-results>
    [mkdir] Created dir: <https://builds.apache.org/job/POI-DSL-1.6/ws/build/geometry-java>
    [mkdir] Created dir: <https://builds.apache.org/job/POI-DSL-1.6/ws/build/ooxml-classes>
    [mkdir] Created dir: <https://builds.apache.org/job/POI-DSL-1.6/ws/build/ooxml-test-classes>
    [mkdir] Created dir: <https://builds.apache.org/job/POI-DSL-1.6/ws/build/ooxml-test-results>
    [mkdir] Created dir: <https://builds.apache.org/job/POI-DSL-1.6/ws/build/excelant-classes>
    [mkdir] Created dir: <https://builds.apache.org/job/POI-DSL-1.6/ws/build/excelant-test-classes>
    [mkdir] Created dir: <https://builds.apache.org/job/POI-DSL-1.6/ws/build/excelant-test-results>
    [mkdir] Created dir: <https://builds.apache.org/job/POI-DSL-1.6/ws/build/examples-classes>
    [mkdir] Created dir: <https://builds.apache.org/job/POI-DSL-1.6/ws/build/integration-test-classes>
    [mkdir] Created dir: <https://builds.apache.org/job/POI-DSL-1.6/131/artifact/build/integration-test-results>
    [mkdir] Created dir: <https://builds.apache.org/job/POI-DSL-1.6/ws/build/dist>
    [mkdir] Created dir: <https://builds.apache.org/job/POI-DSL-1.6/ws/build/tmp/site/build/site>
     [echo] Using Ant: Apache Ant(TM) version 1.9.7 compiled on April 9 2016 from /home/jenkins/tools/ant/latest,
Ant detected Java 1.6 (may be different than actual Java sometimes...)
     [echo] Using Java: 1.6.0_45/1.6.0_45-b06/20.45-b01/Java HotSpot(TM) 64-Bit Server VM
from Sun Microsystems Inc. on Linux: 3.13.0-92-generic
     [echo] Using Findbugs: 2.0.3 for Java 1.6.0_45

compile-main:
    [javac] Compiling 1202 source files to <https://builds.apache.org/job/POI-DSL-1.6/ws/build/classes>
    [javac] Note: Some input files use or override a deprecated API.
    [javac] Note: Recompile with -Xlint:deprecation for details.
    [javac] Note: <https://builds.apache.org/job/POI-DSL-1.6/ws/src/java/org/apache/poi/hpsf/CustomProperties.java>
uses unchecked or unsafe operations.
    [javac] Note: Recompile with -Xlint:unchecked for details.
    [javac] Compiling 532 source files to <https://builds.apache.org/job/POI-DSL-1.6/ws/build/test-classes>
    [javac] Note: Some input files use or override a deprecated API.
    [javac] Note: Recompile with -Xlint:deprecation for details.
     [copy] Copying 4 files to <https://builds.apache.org/job/POI-DSL-1.6/ws/build/classes>

check-ooxml-xsds:

fetch-ooxml-xsds:
      [get] Getting: http://www.ecma-international.org/publications/files/ECMA-ST/Office%20Open%20XML%201st%20edition%20Part%204%20(PDF).zip
      [get] To: <https://builds.apache.org/job/POI-DSL-1.6/131/artifact/ooxml-lib/OfficeOpenXML-Part4.zip>
      [get] Error getting http://www.ecma-international.org/publications/files/ECMA-ST/Office%20Open%20XML%201st%20edition%20Part%204%20(PDF).zip
to <https://builds.apache.org/job/POI-DSL-1.6/131/artifact/ooxml-lib/OfficeOpenXML-Part4.zip>

BUILD FAILED
<https://builds.apache.org/job/POI-DSL-1.6/ws/build.xml>:722: java.net.ConnectException:
Connection timed out
	at java.net.PlainSocketImpl.socketConnect(Native Method)
	at java.net.PlainSocketImpl.doConnect(PlainSocketImpl.java:351)
	at java.net.PlainSocketImpl.connectToAddress(PlainSocketImpl.java:213)
	at java.net.PlainSocketImpl.connect(PlainSocketImpl.java:200)
	at java.net.SocksSocketImpl.connect(SocksSocketImpl.java:366)
	at java.net.Socket.connect(Socket.java:529)
	at java.net.Socket.connect(Socket.java:478)
	at sun.net.NetworkClient.doConnect(NetworkClient.java:163)
	at sun.net.www.http.HttpClient.openServer(HttpClient.java:411)
	at sun.net.www.http.HttpClient.openServer(HttpClient.java:525)
	at sun.net.www.http.HttpClient.<init>(HttpClient.java:208)
	at sun.net.www.http.HttpClient.New(HttpClient.java:291)
	at sun.net.www.http.HttpClient.New(HttpClient.java:310)
	at sun.net.www.protocol.http.HttpURLConnection.getNewHttpClient(HttpURLConnection.java:987)
	at sun.net.www.protocol.http.HttpURLConnection.plainConnect(HttpURLConnection.java:923)
	at sun.net.www.protocol.http.HttpURLConnection.connect(HttpURLConnection.java:841)
	at org.apache.tools.ant.taskdefs.Get$GetThread.openConnection(Get.java:728)
	at org.apache.tools.ant.taskdefs.Get$GetThread.get(Get.java:641)
	at org.apache.tools.ant.taskdefs.Get$GetThread.run(Get.java:631)

Total time: 2 minutes 37 seconds
Build step 'Invoke Ant' marked build as failure
Skipping publisher since build result is FAILURE
Archiving artifacts
Compressed 10.23 MB of artifacts by 99.3% relative to #130
Skipping publisher since build result is FAILURE
Recording test results
ERROR: Step ?Publish JUnit test result report? failed: No test report files were found. Configuration
error?


---------------------------------------------------------------------
To unsubscribe, e-mail: dev-unsubscribe@poi.apache.org
For additional commands, e-mail: dev-help@poi.apache.org


Mime
View raw message