poi-dev mailing list archives

Site index · List index
Message view « Date » · « Thread »
Top « Date » · « Thread »
From Apache Jenkins Server <jenk...@builds.apache.org>
Subject Build failed in Jenkins: POI-JDK8 #1318
Date Tue, 01 Nov 2016 02:33:10 GMT
See <https://builds.apache.org/job/POI-JDK8/1318/changes>

Changes:

[kiwiwings] Bug 60320 - issue opening password protected xlsx

------------------------------------------
[...truncated 94 lines...]
    [javac] Note: <https://builds.apache.org/job/POI-JDK8/ws/src/testcases/org/apache/poi/util/LocalTestNode.java>
uses unchecked or unsafe operations.
    [javac] Note: Recompile with -Xlint:unchecked for details.
    [javac] 1 warning
     [copy] Copying 4 files to <https://builds.apache.org/job/POI-JDK8/ws/build/classes>

check-ooxml-xsds:

fetch-ooxml-xsds:

generate-geometry:

compile-scratchpad:
    [javac] Compiling 470 source files to <https://builds.apache.org/job/POI-JDK8/ws/build/scratchpad-classes>
    [javac] warning: [options] bootstrap class path not set in conjunction with -source 1.6
    [javac] Note: Some input files use or override a deprecated API.
    [javac] Note: Recompile with -Xlint:deprecation for details.
    [javac] 1 warning
    [javac] Compiling 185 source files to <https://builds.apache.org/job/POI-JDK8/ws/build/scratchpad-test-classes>
    [javac] warning: [options] bootstrap class path not set in conjunction with -source 1.6
    [javac] Note: Some input files use or override a deprecated API.
    [javac] Note: Recompile with -Xlint:deprecation for details.
    [javac] 1 warning
     [copy] Copying 2 files to <https://builds.apache.org/job/POI-JDK8/ws/build/scratchpad-classes>

check-compiled-ooxml-xsds:

compile-ooxml-xsds:

compile-ooxml:
    [javac] Compiling 411 source files to <https://builds.apache.org/job/POI-JDK8/ws/build/ooxml-classes>
    [javac] warning: [options] bootstrap class path not set in conjunction with -source 1.6
    [javac] Note: Some input files use or override a deprecated API.
    [javac] Note: Recompile with -Xlint:deprecation for details.
    [javac] 1 warning
    [javac] Compiling 213 source files to <https://builds.apache.org/job/POI-JDK8/ws/build/ooxml-test-classes>
    [javac] warning: [options] bootstrap class path not set in conjunction with -source 1.6
    [javac] Note: Some input files use or override a deprecated API.
    [javac] Note: Recompile with -Xlint:deprecation for details.
    [javac] 1 warning
     [copy] Copying 2 files to <https://builds.apache.org/job/POI-JDK8/ws/build/ooxml-classes>

compile-examples:
    [javac] Compiling 142 source files to <https://builds.apache.org/job/POI-JDK8/ws/build/examples-classes>
    [javac] warning: [options] bootstrap class path not set in conjunction with -source 1.6
    [javac] Note: Some input files use or override a deprecated API.
    [javac] Note: Recompile with -Xlint:deprecation for details.
    [javac] Note: <https://builds.apache.org/job/POI-JDK8/ws/src/examples/src/org/apache/poi/hssf/view/SVRowHeader.java>
uses unchecked or unsafe operations.
    [javac] Note: Recompile with -Xlint:unchecked for details.
    [javac] 1 warning
     [copy] Copying 1 file to <https://builds.apache.org/job/POI-JDK8/ws/build/examples-classes>

compile-excelant:
    [javac] Compiling 14 source files to <https://builds.apache.org/job/POI-JDK8/ws/build/excelant-classes>
    [javac] warning: [options] bootstrap class path not set in conjunction with -source 1.6
    [javac] 1 warning
    [javac] Compiling 13 source files to <https://builds.apache.org/job/POI-JDK8/ws/build/excelant-test-classes>
    [javac] warning: [options] bootstrap class path not set in conjunction with -source 1.6
    [javac] 1 warning
     [copy] Copying 1 file to <https://builds.apache.org/job/POI-JDK8/ws/build/excelant-classes>

compile:

-compile-ooxml-lite-check:

compile-ooxml-lite:
     [echo] Running ooxml-lite generator
    [mkdir] Created dir: <https://builds.apache.org/job/POI-JDK8/ws/build/ooxml-lite-merged>
      [jar] Building jar: <https://builds.apache.org/job/POI-JDK8/ws/build/ooxml-lite-merged/ooxml-lite-merged.jar>
     [java] Collecting unit tests from <https://builds.apache.org/job/POI-JDK8/ws/build/ooxml-test-classes>
     [java] Inner class org.apache.poi.poifs.crypt.AesZipFileZipEntrySource$1.class not included
     [java] Class org.apache.poi.poifs.crypt.AesZipFileZipEntrySource does not derive from
TestCase and does not have a @Test annotation
     [java] Inner class org.apache.poi.xssf.usermodel.TestFormulaEvaluatorOnXSSF$1.class not
included
     [java] Inner class org.apache.poi.xssf.usermodel.TestMultiSheetFormulaEvaluatorOnXSSF$1.class
not included
     [java] Inner class org.apache.poi.xssf.streaming.TestSXSSFWorkbookWithCustomZipEntrySource$EncryptedTempData.class
not included
     [java] Inner class org.apache.poi.xssf.streaming.TempFileRecordingSXSSFWorkbookWithCustomZipEntrySource$TempFileRecordingSheetDataWriterWithDecorator.class
not included
     [java] Inner class org.apache.poi.xssf.streaming.TestSXSSFWorkbookWithCustomZipEntrySource$SXSSFWorkbookWithCustomZipEntrySource.class
not included
     [java] Inner class org.apache.poi.xssf.streaming.TestSXSSFWorkbookWithCustomZipEntrySource$SheetDataWriterWithDecorator.class
not included
     [java] Class org.apache.poi.xssf.streaming.TempFileRecordingSXSSFWorkbookWithCustomZipEntrySource
does not derive from TestCase and does not have a @Test annotation
     [java] Found 191 classes
     [java] ....................I..................................................................................................................................................................................I...................................................................................................................................................BorderStyle
short usage
     [java] ...FillPatternType short usage
     [java] ....setCellStyleProps start
     [java] HorizontalAlignment short usage
     [java] HorizontalAlignment short usage
     [java] setCellStyleProps nearing end
     [java] .......BorderStyle short usage
     [java] ...FillPatternType short usage
     [java] ....setCellStyleProps start
     [java] HorizontalAlignment short usage
     [java] HorizontalAlignment short usage
     [java] setCellStyleProps nearing end
     [java] ...........Took: 2135ms
     [java] org.apache.poi.openxml4j.exceptions.NotOfficeXmlFileException: No valid entries
or contents found, this is not a valid OOXML (Office Open XML) file
     [java] 	at org.apache.poi.openxml4j.opc.ZipPackage.getPartsImpl(ZipPackage.java:290)
     [java] 	at org.apache.poi.openxml4j.opc.OPCPackage.getParts(OPCPackage.java:766)
     [java] 	at org.apache.poi.openxml4j.opc.OPCPackage.open(OPCPackage.java:302)
     [java] 	at org.apache.poi.openxml4j.opc.TestPackage.testCorruptFile(TestPackage.java:953)
     [java] 	at sun.reflect.NativeMethodAccessorImpl.invoke0(Native Method)
     [java] 	at sun.reflect.NativeMethodAccessorImpl.invoke(NativeMethodAccessorImpl.java:57)
     [java] 	at sun.reflect.DelegatingMethodAccessorImpl.invoke(DelegatingMethodAccessorImpl.java:43)
     [java] 	at java.lang.reflect.Method.invoke(Method.java:606)
     [java] 	at org.junit.runners.model.FrameworkMethod$1.runReflectiveCall(FrameworkMethod.java:50)
     [java] 	at org.junit.internal.runners.model.ReflectiveCallable.run(ReflectiveCallable.java:12)
     [java] 	at org.junit.runners.model.FrameworkMethod.invokeExplosively(FrameworkMethod.java:47)
     [java] 	at org.junit.internal.runners.statements.InvokeMethod.evaluate(InvokeMethod.java:17)
     [java] 	at org.junit.runners.ParentRunner.runLeaf(ParentRunner.java:325)
     [java] 	at org.junit.runners.BlockJUnit4ClassRunner.runChild(BlockJUnit4ClassRunner.java:78)
     [java] 	at org.junit.runners.BlockJUnit4ClassRunner.runChild(BlockJUnit4ClassRunner.java:57)
     [java] 	at org.junit.runners.ParentRunner$3.run(ParentRunner.java:290)
     [java] 	at org.junit.runners.ParentRunner$1.schedule(ParentRunner.java:71)
     [java] 	at org.junit.runners.ParentRunner.runChildren(ParentRunner.java:288)
     [java] 	at org.junit.runners.ParentRunner.access$000(ParentRunner.java:58)
     [java] 	at org.junit.runners.ParentRunner$2.evaluate(ParentRunner.java:268)
     [java] 	at org.junit.runners.ParentRunner.run(ParentRunner.java:363)
     [java] 	at org.junit.runners.Suite.runChild(Suite.java:128)
     [java] 	at org.junit.runners.Suite.runChild(Suite.java:27)
     [java] 	at org.junit.runners.ParentRunner$3.run(ParentRunner.java:290)
     [java] 	at org.junit.runners.ParentRunner$1.schedule(ParentRunner.java:71)
     [java] 	at org.junit.runners.ParentRunner.runChildren(ParentRunner.java:288)
     [java] 	at org.junit.runners.ParentRunner.access$000(ParentRunner.java:58)
     [java] 	at org.junit.runners.ParentRunner$2.evaluate(ParentRunner.java:268)
     [java] 	at org.junit.runners.ParentRunner.run(ParentRunner.java:363)
     [java] 	at org.junit.runner.JUnitCore.run(JUnitCore.java:137)
     [java] 	at org.junit.runner.JUnitCore.run(JUnitCore.java:115)
     [java] 	at org.junit.runner.JUnitCore.run(JUnitCore.java:105)
     [java] 	at org.junit.runner.JUnitCore.run(JUnitCore.java:94)
     [java] 	at org.apache.poi.util.OOXMLLite.build(OOXMLLite.java:129)
     [java] 	at org.apache.poi.util.OOXMLLite.main(OOXMLLite.java:88)
     [java] ........I..............I................................org.apache.poi.openxml4j.exceptions.NotOfficeXmlFileException
     [java] No valid entries or contents found, this is not a valid OOXML (Office Open XML)
file
     [java] SLF4J: Failed to load class "org.slf4j.impl.StaticLoggerBinder".
     [java] SLF4J: Defaulting to no-operation (NOP) logger implementation
     [java] SLF4J: See http://www.slf4j.org/codes.html#StaticLoggerBinder for further details.
     [java] .........I......................................................E....................................................................I.E......................................................................................................................................Cell
formula evaluation currently unsupported
     [java] Array formulas currently unsupported
     [java] ..........................................................................................................................................................I.....Cell:
3E-104
     [java] Cell: 5E-104
     [java] Cell: 5E-106
     [java] Cell: 
     [java] .II........I.I........................I........Reading row 0, col 1
     [java] Formula:A1
     [java] Formula Result Type:STRING
     [java] Reading row 1, col 1
     [java] Formula:A1
     [java] Formula Result Type:STRING
     [java] .I.....I......................................................................................................................................................................I..............III.II.I.......I.......I.....I..........................................................................................................................................................................................................................................................................................................................................................................................................................................................................................................................................I.....I....................................................................................I..............................................................................................................................................................................Setting
col: 0 and row 0
     [java] Setting col: 1 and row 1
     [java] ..........................................................................................................................................................11
     [java] Calibri
     [java] Exception in thread "main" java.lang.RuntimeException: Tests did not succeed,
cannot build ooxml-lite jar
     [java] 	at org.apache.poi.util.OOXMLLite.build(OOXMLLite.java:131)
     [java] 	at org.apache.poi.util.OOXMLLite.main(OOXMLLite.java:88)
     [java] .I..I.I.I......................................
     [java] Time: 147.406
     [java] There were 2 failures:
     [java] 1) bug60320(org.apache.poi.poifs.crypt.TestDecryptor)
     [java] org.apache.poi.EncryptedDocumentException: Export Restrictions in place - please
install JCE Unlimited Strength Jurisdiction Policy files
     [java] 	at org.apache.poi.poifs.crypt.CryptoFunctions.getCipher(CryptoFunctions.java:226)
     [java] 	at org.apache.poi.poifs.crypt.CryptoFunctions.getCipher(CryptoFunctions.java:200)
     [java] 	at org.apache.poi.poifs.crypt.agile.AgileDecryptor.hashInput(AgileDecryptor.java:269)
     [java] 	at org.apache.poi.poifs.crypt.agile.AgileDecryptor.verifyPassword(AgileDecryptor.java:114)
     [java] 	at org.apache.poi.poifs.crypt.TestDecryptor.bug60320(TestDecryptor.java:172)
     [java] 	at sun.reflect.NativeMethodAccessorImpl.invoke0(Native Method)
     [java] 	at sun.reflect.NativeMethodAccessorImpl.invoke(NativeMethodAccessorImpl.java:57)
     [java] 	at sun.reflect.DelegatingMethodAccessorImpl.invoke(DelegatingMethodAccessorImpl.java:43)
     [java] 	at java.lang.reflect.Method.invoke(Method.java:606)
     [java] 	at org.junit.runners.model.FrameworkMethod$1.runReflectiveCall(FrameworkMethod.java:50)
     [java] 	at org.junit.internal.runners.model.ReflectiveCallable.run(ReflectiveCallable.java:12)
     [java] 	at org.junit.runners.model.FrameworkMethod.invokeExplosively(FrameworkMethod.java:47)
     [java] 	at org.junit.internal.runners.statements.InvokeMethod.evaluate(InvokeMethod.java:17)
     [java] 	at org.junit.runners.ParentRunner.runLeaf(ParentRunner.java:325)
     [java] 	at org.junit.runners.BlockJUnit4ClassRunner.runChild(BlockJUnit4ClassRunner.java:78)
     [java] 	at org.junit.runners.BlockJUnit4ClassRunner.runChild(BlockJUnit4ClassRunner.java:57)
     [java] 	at org.junit.runners.ParentRunner$3.run(ParentRunner.java:290)
     [java] 	at org.junit.runners.ParentRunner$1.schedule(ParentRunner.java:71)
     [java] 	at org.junit.runners.ParentRunner.runChildren(ParentRunner.java:288)
     [java] 	at org.junit.runners.ParentRunner.access$000(ParentRunner.java:58)
     [java] 	at org.junit.runners.ParentRunner$2.evaluate(ParentRunner.java:268)
     [java] 	at org.junit.runners.ParentRunner.run(ParentRunner.java:363)
     [java] 	at org.junit.runners.Suite.runChild(Suite.java:128)
     [java] 	at org.junit.runners.Suite.runChild(Suite.java:27)
     [java] 	at org.junit.runners.ParentRunner$3.run(ParentRunner.java:290)
     [java] 	at org.junit.runners.ParentRunner$1.schedule(ParentRunner.java:71)
     [java] 	at org.junit.runners.ParentRunner.runChildren(ParentRunner.java:288)
     [java] 	at org.junit.runners.ParentRunner.access$000(ParentRunner.java:58)
     [java] 	at org.junit.runners.ParentRunner$2.evaluate(ParentRunner.java:268)
     [java] 	at org.junit.runners.ParentRunner.run(ParentRunner.java:363)
     [java] 	at org.junit.runner.JUnitCore.run(JUnitCore.java:137)
     [java] 	at org.junit.runner.JUnitCore.run(JUnitCore.java:115)
     [java] 	at org.junit.runner.JUnitCore.run(JUnitCore.java:105)
     [java] 	at org.junit.runner.JUnitCore.run(JUnitCore.java:94)
     [java] 	at org.apache.poi.util.OOXMLLite.build(OOXMLLite.java:129)
     [java] 	at org.apache.poi.util.OOXMLLite.main(OOXMLLite.java:88)
     [java] 2) bug60320CustomEncrypt(org.apache.poi.poifs.crypt.TestEncryptor)
     [java] org.apache.poi.EncryptedDocumentException: Export Restrictions in place - please
install JCE Unlimited Strength Jurisdiction Policy files
     [java] 	at org.apache.poi.poifs.crypt.CryptoFunctions.getCipher(CryptoFunctions.java:226)
     [java] 	at org.apache.poi.poifs.crypt.CryptoFunctions.getCipher(CryptoFunctions.java:200)
     [java] 	at org.apache.poi.poifs.crypt.agile.AgileDecryptor.hashInput(AgileDecryptor.java:269)
     [java] 	at org.apache.poi.poifs.crypt.agile.AgileDecryptor.verifyPassword(AgileDecryptor.java:114)
     [java] 	at org.apache.poi.poifs.crypt.TestEncryptor.bug60320CustomEncrypt(TestEncryptor.java:432)
     [java] 	at sun.reflect.NativeMethodAccessorImpl.invoke0(Native Method)
     [java] 	at sun.reflect.NativeMethodAccessorImpl.invoke(NativeMethodAccessorImpl.java:57)
     [java] 	at sun.reflect.DelegatingMethodAccessorImpl.invoke(DelegatingMethodAccessorImpl.java:43)
     [java] 	at java.lang.reflect.Method.invoke(Method.java:606)
     [java] 	at org.junit.runners.model.FrameworkMethod$1.runReflectiveCall(FrameworkMethod.java:50)
     [java] 	at org.junit.internal.runners.model.ReflectiveCallable.run(ReflectiveCallable.java:12)
     [java] 	at org.junit.runners.model.FrameworkMethod.invokeExplosively(FrameworkMethod.java:47)
     [java] 	at org.junit.internal.runners.statements.InvokeMethod.evaluate(InvokeMethod.java:17)
     [java] 	at org.junit.runners.ParentRunner.runLeaf(ParentRunner.java:325)
     [java] 	at org.junit.runners.BlockJUnit4ClassRunner.runChild(BlockJUnit4ClassRunner.java:78)
     [java] 	at org.junit.runners.BlockJUnit4ClassRunner.runChild(BlockJUnit4ClassRunner.java:57)
     [java] 	at org.junit.runners.ParentRunner$3.run(ParentRunner.java:290)
     [java] 	at org.junit.runners.ParentRunner$1.schedule(ParentRunner.java:71)
     [java] 	at org.junit.runners.ParentRunner.runChildren(ParentRunner.java:288)
     [java] 	at org.junit.runners.ParentRunner.access$000(ParentRunner.java:58)
     [java] 	at org.junit.runners.ParentRunner$2.evaluate(ParentRunner.java:268)
     [java] 	at org.junit.runners.ParentRunner.run(ParentRunner.java:363)
     [java] 	at org.junit.runners.Suite.runChild(Suite.java:128)
     [java] 	at org.junit.runners.Suite.runChild(Suite.java:27)
     [java] 	at org.junit.runners.ParentRunner$3.run(ParentRunner.java:290)
     [java] 	at org.junit.runners.ParentRunner$1.schedule(ParentRunner.java:71)
     [java] 	at org.junit.runners.ParentRunner.runChildren(ParentRunner.java:288)
     [java] 	at org.junit.runners.ParentRunner.access$000(ParentRunner.java:58)
     [java] 	at org.junit.runners.ParentRunner$2.evaluate(ParentRunner.java:268)
     [java] 	at org.junit.runners.ParentRunner.run(ParentRunner.java:363)
     [java] 	at org.junit.runner.JUnitCore.run(JUnitCore.java:137)
     [java] 	at org.junit.runner.JUnitCore.run(JUnitCore.java:115)
     [java] 	at org.junit.runner.JUnitCore.run(JUnitCore.java:105)
     [java] 	at org.junit.runner.JUnitCore.run(JUnitCore.java:94)
     [java] 	at org.apache.poi.util.OOXMLLite.build(OOXMLLite.java:129)
     [java] 	at org.apache.poi.util.OOXMLLite.main(OOXMLLite.java:88)
     [java] 
     [java] FAILURES!!!
     [java] Tests run: 2087,  Failures: 2
     [java] 

BUILD FAILED
<https://builds.apache.org/job/POI-JDK8/ws/build.xml>:1564: Java returned: 1

Total time: 4 minutes 9 seconds
Build step 'Invoke Ant' marked build as failure
[FINDBUGS] Skipping publisher since build result is FAILURE
[WARNINGS] Skipping publisher since build result is FAILURE
Archiving artifacts
No JDK named ?jdk-1.8.0? found
Recording test results
No JDK named ?jdk-1.8.0? found
ERROR: Step ?Publish JUnit test result report? failed: No test report files were found. Configuration
error?
No JDK named ?jdk-1.8.0? found

---------------------------------------------------------------------
To unsubscribe, e-mail: dev-unsubscribe@poi.apache.org
For additional commands, e-mail: dev-help@poi.apache.org


Mime
View raw message