poi-dev mailing list archives

Site index · List index
Message view « Date » · « Thread »
Top « Date » · « Thread »
From Apache Jenkins Server <jenk...@builds.apache.org>
Subject Build failed in Jenkins: POI-JDK8 #1343
Date Mon, 14 Nov 2016 08:14:34 GMT
See <https://builds.apache.org/job/POI-JDK8/1343/changes>

Changes:

[onealj] change 3.16 beta 1 release notes to be more meaningful for general audience

------------------------------------------
Started by an SCM change
No JDK named ?jdk-1.8.0? found
[EnvInject] - Loading node environment variables.
No JDK named ?jdk-1.8.0? found
Building remotely on H12 (ubuntu) in workspace <https://builds.apache.org/job/POI-JDK8/ws/>
No JDK named ?jdk-1.8.0? found
Updating http://svn.apache.org/repos/asf/poi/trunk at revision '2016-11-14T08:14:07.242 +0000'
U         build.xml
Fetching 'https://svn.apache.org/repos/asf/poi/site/src/documentation' at -1 into '<https://builds.apache.org/job/POI-JDK8/ws/src/documentation'>
U         src/documentation/content/xdocs/status.xml
At revision 1769572

Fetching 'https://svn.apache.org/repos/asf/poi/site/forrest.properties' at -1 into '<https://builds.apache.org/job/POI-JDK8/ws/forrest.properties'>
At revision 1769572

At revision 1769572

No changes for http://svn.apache.org/repos/asf/poi/trunk since the previous build
No changes for http://svn.apache.org/repos/asf/poi/site/forrest.properties since the previous
build
[EnvInject] - Executing scripts and injecting environment variables after the SCM step.
[EnvInject] - Injecting as environment variables the properties content 
LANG=en_US.UTF-8

[EnvInject] - Variables injected successfully.
No JDK named ?jdk-1.8.0? found
[POI-JDK8] $ /bin/bash -xe /tmp/hudson5431752604020218771.sh
+ svn status
    X   forrest.properties
X       src/documentation

Performing status on external item at 'src/documentation':
+ exit 0
No JDK named ?jdk-1.8.0? found
[POI-JDK8] $ /home/jenkins/tools/ant/latest/bin/ant -Dcoverage.enabled=true clean jenkins
Unable to locate tools.jar. Expected to find it in /usr/lib/jvm/java-8-openjdk-amd64/lib/tools.jar
Buildfile: <https://builds.apache.org/job/POI-JDK8/ws/build.xml>

clean:
   [delete] Deleting directory <https://builds.apache.org/job/POI-JDK8/ws/build>

check-jars:

fetch-jars:

check-ooxml-jars:

fetch-ooxml-jars:

init:
    [mkdir] Created dir: <https://builds.apache.org/job/POI-JDK8/ws/build>
    [mkdir] Created dir: <https://builds.apache.org/job/POI-JDK8/ws/build/classes>
    [mkdir] Created dir: <https://builds.apache.org/job/POI-JDK8/ws/build/test-classes>
    [mkdir] Created dir: <https://builds.apache.org/job/POI-JDK8/ws/build/test-results>
    [mkdir] Created dir: <https://builds.apache.org/job/POI-JDK8/ws/build/scratchpad-classes>
    [mkdir] Created dir: <https://builds.apache.org/job/POI-JDK8/ws/build/scratchpad-test-classes>
    [mkdir] Created dir: <https://builds.apache.org/job/POI-JDK8/ws/build/scratchpad-test-results>
    [mkdir] Created dir: <https://builds.apache.org/job/POI-JDK8/ws/build/geometry-java>
    [mkdir] Created dir: <https://builds.apache.org/job/POI-JDK8/ws/build/ooxml-classes>
    [mkdir] Created dir: <https://builds.apache.org/job/POI-JDK8/ws/build/ooxml-test-classes>
    [mkdir] Created dir: <https://builds.apache.org/job/POI-JDK8/ws/build/ooxml-test-results>
    [mkdir] Created dir: <https://builds.apache.org/job/POI-JDK8/ws/build/excelant-classes>
    [mkdir] Created dir: <https://builds.apache.org/job/POI-JDK8/ws/build/excelant-test-classes>
    [mkdir] Created dir: <https://builds.apache.org/job/POI-JDK8/ws/build/excelant-test-results>
    [mkdir] Created dir: <https://builds.apache.org/job/POI-JDK8/ws/build/examples-classes>
    [mkdir] Created dir: <https://builds.apache.org/job/POI-JDK8/ws/build/integration-test-classes>
    [mkdir] Created dir: <https://builds.apache.org/job/POI-JDK8/1343/artifact/build/integration-test-results>
    [mkdir] Created dir: <https://builds.apache.org/job/POI-JDK8/ws/build/dist>
    [mkdir] Created dir: <https://builds.apache.org/job/POI-JDK8/ws/build/tmp/site/build/site>
     [echo] Using Ant: Apache Ant(TM) version 1.9.7 compiled on April 9 2016 from /home/jenkins/tools/ant/latest,
Ant detected Java 1.8 (may be different than actual Java sometimes...)
     [echo] Using Java: 1.8.0_111/1.8.0_111-8u111-b14-2ubuntu0.16.04.2-b14/25.111-b14/OpenJDK
64-Bit Server VM from Oracle Corporation on Linux: 4.4.0-43-generic
     [echo] Using Findbugs: 3.0.1 for Java 1.8.0_111

compile-main:
    [javac] Compiling 1195 source files to <https://builds.apache.org/job/POI-JDK8/ws/build/classes>

BUILD FAILED
<https://builds.apache.org/job/POI-JDK8/ws/build.xml>:877: Error running javac compiler

Total time: 1 second
Build step 'Invoke Ant' marked build as failure
[FINDBUGS] Skipping publisher since build result is FAILURE
[WARNINGS] Skipping publisher since build result is FAILURE
Archiving artifacts
No JDK named ?jdk-1.8.0? found
Recording test results
No JDK named ?jdk-1.8.0? found
ERROR: Step ?Publish JUnit test result report? failed: No test report files were found. Configuration
error?
No JDK named ?jdk-1.8.0? found

---------------------------------------------------------------------
To unsubscribe, e-mail: dev-unsubscribe@poi.apache.org
For additional commands, e-mail: dev-help@poi.apache.org


Mime
View raw message