poi-dev mailing list archives

Site index · List index
Message view « Date » · « Thread »
Top « Date » · « Thread »
From Apache Jenkins Server <jenk...@builds.apache.org>
Subject Build failed in Jenkins: POI #1586
Date Tue, 18 Oct 2016 18:36:11 GMT
See <https://builds.apache.org/job/POI/1586/changes>

Changes:

[tallison] BUG 60273 -- Use codepageutil to get correct charset in VBAMacroReader

[tallison] BUG 59858 -- avoid npe when there's a collision of record names...doh. Fix unit
test.

[tallison] BUG 59858 -- avoid npe when there's a collision of record names

------------------------------------------
Started by an SCM change
[EnvInject] - Loading node environment variables.
Building remotely on H11 (Ubuntu yahoo-not-h2 ubuntu docker) in workspace <https://builds.apache.org/job/POI/ws/>
Updating http://svn.apache.org/repos/asf/poi/trunk at revision '2016-10-18T18:34:10.529 +0000'
AU        test-data/poifs/60256.bin
AU        test-data/spreadsheet/60273.xls
AU        test-data/spreadsheet/60255_extra_drawingparts.xlsx
AU        test-data/spreadsheet/59830.xls
AU        src/examples/src/org/apache/poi/xwpf/usermodel/SimpleDocumentWithHeader.java
U         src/ooxml/testcases/org/apache/poi/TestPOIXMLDocument.java
U         src/ooxml/testcases/org/apache/poi/xssf/usermodel/TestXSSFBugs.java
U         src/ooxml/testcases/org/apache/poi/xssf/streaming/TestSXSSFWorkbookWithCustomZipEntrySource.java
U         src/ooxml/java/org/apache/poi/POIXMLDocumentPart.java
U         src/ooxml/java/org/apache/poi/xssf/usermodel/XSSFTable.java
U         src/ooxml/java/org/apache/poi/xssf/usermodel/XSSFName.java
U         src/ooxml/java/org/apache/poi/xssf/usermodel/XSSFDataValidationConstraint.java
U         src/ooxml/java/org/apache/poi/xssf/usermodel/XSSFSheet.java
U         src/ooxml/java/org/apache/poi/xwpf/usermodel/XWPFDocument.java
U         src/ooxml/java/org/apache/poi/xwpf/model/XWPFHeaderFooterPolicy.java
U         src/testcases/org/apache/poi/poifs/filesystem/TestOle10Native.java
U         src/testcases/org/apache/poi/poifs/macros/TestVBAMacroReader.java
U         src/testcases/org/apache/poi/ss/usermodel/BaseTestNamedRange.java
U         src/testcases/org/apache/poi/ss/formula/functions/TestDays360.java
U         src/java/org/apache/poi/ss/formula/functions/Days360.java
AU        src/java/org/apache/poi/wp/usermodel/HeaderFooterType.java
U         src/java/org/apache/poi/hssf/usermodel/HSSFName.java
U         src/java/org/apache/poi/util/RLEDecompressingInputStream.java
U         src/java/org/apache/poi/sl/draw/DrawFreeformShape.java
U         src/java/org/apache/poi/sl/draw/DrawShape.java
U         src/java/org/apache/poi/poifs/filesystem/Ole10Native.java
U         src/java/org/apache/poi/poifs/macros/VBAMacroReader.java
U         src/integrationtest/org/apache/poi/TestAllFiles.java
U         src/scratchpad/src/org/apache/poi/hslf/usermodel/HSLFFreeformShape.java
U         build.gradle
Fetching 'https://svn.apache.org/repos/asf/poi/site/forrest.properties' at -1 into '<https://builds.apache.org/job/POI/ws/forrest.properties'>
At revision 1765491

Fetching 'https://svn.apache.org/repos/asf/poi/site/src/documentation' at -1 into '<https://builds.apache.org/job/POI/ws/src/documentation'>
U         src/documentation/content/xdocs/status.xml
At revision 1765491

At revision 1765491

No changes for http://svn.apache.org/repos/asf/poi/site/forrest.properties since the previous
build
No changes for https://svn.apache.org/repos/asf/poi/site/src/documentation since the previous
build
[EnvInject] - Executing scripts and injecting environment variables after the SCM step.
[EnvInject] - Injecting as environment variables the properties content 
LANG=en_US.UTF-8

[EnvInject] - Variables injected successfully.
[POI] $ /bin/bash -xe /tmp/hudson5181688997932846472.sh
+ svn status
    X   forrest.properties
X       src/documentation

Performing status on external item at 'src/documentation':
+ exit 0
[POI] $ /home/jenkins/tools/ant/latest/bin/ant -Dcoverage.enabled=true clean jenkins
Buildfile: <https://builds.apache.org/job/POI/ws/build.xml>

clean:
   [delete] Deleting directory <https://builds.apache.org/job/POI/ws/build>

check-jars:

fetch-jars:

check-ooxml-jars:

fetch-ooxml-jars:

init:
    [mkdir] Created dir: <https://builds.apache.org/job/POI/ws/build>
    [mkdir] Created dir: <https://builds.apache.org/job/POI/ws/build/classes>
    [mkdir] Created dir: <https://builds.apache.org/job/POI/ws/build/test-classes>
    [mkdir] Created dir: <https://builds.apache.org/job/POI/ws/build/test-results>
    [mkdir] Created dir: <https://builds.apache.org/job/POI/ws/build/scratchpad-classes>
    [mkdir] Created dir: <https://builds.apache.org/job/POI/ws/build/scratchpad-test-classes>
    [mkdir] Created dir: <https://builds.apache.org/job/POI/ws/build/scratchpad-test-results>
    [mkdir] Created dir: <https://builds.apache.org/job/POI/ws/build/geometry-java>
    [mkdir] Created dir: <https://builds.apache.org/job/POI/ws/build/ooxml-classes>
    [mkdir] Created dir: <https://builds.apache.org/job/POI/ws/build/ooxml-test-classes>
    [mkdir] Created dir: <https://builds.apache.org/job/POI/ws/build/ooxml-test-results>
    [mkdir] Created dir: <https://builds.apache.org/job/POI/ws/build/excelant-classes>
    [mkdir] Created dir: <https://builds.apache.org/job/POI/ws/build/excelant-test-classes>
    [mkdir] Created dir: <https://builds.apache.org/job/POI/ws/build/excelant-test-results>
    [mkdir] Created dir: <https://builds.apache.org/job/POI/ws/build/examples-classes>
    [mkdir] Created dir: <https://builds.apache.org/job/POI/ws/build/integration-test-classes>
    [mkdir] Created dir: <https://builds.apache.org/job/POI/1586/artifact/build/integration-test-results>
    [mkdir] Created dir: <https://builds.apache.org/job/POI/ws/build/dist>
    [mkdir] Created dir: <https://builds.apache.org/job/POI/ws/build/tmp/site/build/site>
     [echo] Using Ant: Apache Ant(TM) version 1.9.7 compiled on April 9 2016 from /home/jenkins/tools/ant/latest,
Ant detected Java 1.6 (may be different than actual Java sometimes...)
     [echo] Using Java: 1.6.0_45/1.6.0_45-b06/20.45-b01/Java HotSpot(TM) 64-Bit Server VM
from Sun Microsystems Inc. on Linux: 3.13.0-96-generic
     [echo] Using Findbugs: 2.0.3 for Java 1.6.0_45

compile-main:
    [javac] Compiling 1195 source files to <https://builds.apache.org/job/POI/ws/build/classes>
    [javac] <https://builds.apache.org/job/POI/ws/src/java/org/apache/poi/poifs/macros/VBAMacroReader.java>:32:
cannot find symbol
    [javac] symbol  : class StandardCharsets
    [javac] location: package java.nio.charset
    [javac] import java.nio.charset.StandardCharsets;
    [javac]                        ^
    [javac] Note: Some input files use or override a deprecated API.
    [javac] Note: Recompile with -Xlint:deprecation for details.
    [javac] Note: <https://builds.apache.org/job/POI/ws/src/java/org/apache/poi/hpsf/CustomProperties.java>
uses unchecked or unsafe operations.
    [javac] Note: Recompile with -Xlint:unchecked for details.
    [javac] 1 error

BUILD FAILED
<https://builds.apache.org/job/POI/ws/build.xml>:876: Compile failed; see the compiler
error output for details.

Total time: 17 seconds
Build step 'Invoke Ant' marked build as failure
[FINDBUGS] Skipping publisher since build result is FAILURE
[WARNINGS] Skipping publisher since build result is FAILURE
Archiving artifacts
Compressed 66.31 MB of artifacts by 65.3% relative to #1584
Recording test results
ERROR: Step ?Publish JUnit test result report? failed: No test report files were found. Configuration
error?


---------------------------------------------------------------------
To unsubscribe, e-mail: dev-unsubscribe@poi.apache.org
For additional commands, e-mail: dev-help@poi.apache.org


Mime
View raw message