poi-dev mailing list archives

Site index · List index
Message view « Date » · « Thread »
Top « Date » · « Thread »
From Apache Jenkins Server <jenk...@builds.apache.org>
Subject Build failed in Jenkins: POI-Maven #611
Date Sun, 09 Oct 2016 16:33:56 GMT
See <https://builds.apache.org/job/POI-Maven/611/changes>

Changes:

[onealj] update changelog for bug 60153

[onealj] bug 60153: patch from PJ Fanning to demonstrate that SXSSFWorkbook SheetDataWriter
can write encrypted temporary files to disk and the workbook can be AES encrypted when written
to disk for a fully secure disk environment

------------------------------------------
[...truncated 1673 lines...]
[INFO] --- maven-surefire-plugin:2.19.1:test (default-test) @ poi-ooxml-schema ---
[INFO] No tests to run.
[JENKINS] Recording test results[INFO] 
[INFO] --- maven-antrun-plugin:1.8:run (remove-xmltypeloader-from-schema-jar) @ poi-ooxml-schema
---

[INFO] Executing tasks

main:
   [delete] Deleting directory <https://builds.apache.org/job/POI-Maven/ws/sonar/ooxml-schema/target/classes/org/apache>
[INFO] Executed tasks
[INFO] 
[INFO] --- maven-jar-plugin:2.4:jar (default-jar) @ poi-ooxml-schema ---
[INFO] Building jar: <https://builds.apache.org/job/POI-Maven/ws/sonar/ooxml-schema/target/poi-ooxml-schema-3.16-beta1-SNAPSHOT.jar>
[INFO]                                                                         
[INFO] ------------------------------------------------------------------------
[INFO] Building Apache POI - Openxmlformats Encryption Schema package 3.16-beta1-SNAPSHOT
[INFO] ------------------------------------------------------------------------
[INFO] 
[INFO] --- maven-antrun-plugin:1.8:run (copy-xmltype-and-xsdconfig) @ poi-ooxml-schema-encryption
---
[INFO] Executing tasks

main:
     [copy] Copying 7 files to <https://builds.apache.org/job/POI-Maven/ws/sonar/ooxml-schema-encryption/target/generated-sources/xmlbeans>
     [copy] Copying 1 file to <https://builds.apache.org/job/POI-Maven/ws/sonar/ooxml-schema-encryption/target/schemas>
[INFO] Executed tasks
[INFO] 
[INFO] --- maven-antrun-plugin:1.8:run (unzip-schema) @ poi-ooxml-schema-encryption ---
[INFO] Executing tasks

main:
     [copy] Copying 6 files to <https://builds.apache.org/job/POI-Maven/ws/sonar/ooxml-schema-encryption/target/schemas>
[INFO] Executed tasks
[INFO] 
[INFO] --- xmlbeans-maven-plugin:2.3.3:xmlbeans (default) @ poi-ooxml-schema-encryption ---
[INFO] 
[INFO] --- maven-antrun-plugin:1.8:run (replace-xmltypeloader) @ poi-ooxml-schema-encryption
---
[INFO] Executing tasks

main:
[INFO] Executed tasks
[INFO] 
[INFO] --- maven-resources-plugin:2.6:resources (default-resources) @ poi-ooxml-schema-encryption
---
[INFO] Using 'ASCII' encoding to copy filtered resources.
[INFO] skip non existing resourceDirectory <https://builds.apache.org/job/POI-Maven/ws/sonar/ooxml-schema-encryption/src/main/resources>
[INFO] Copying 73 resources
[INFO] 
[INFO] --- maven-compiler-plugin:3.5.1:compile (default-compile) @ poi-ooxml-schema-encryption
---
[INFO] Changes detected - recompiling the module!
[INFO] Compiling 47 source files to <https://builds.apache.org/job/POI-Maven/ws/sonar/ooxml-schema-encryption/target/classes>
[INFO] 
[INFO] --- maven-resources-plugin:2.6:testResources (default-testResources) @ poi-ooxml-schema-encryption
---
[INFO] Using 'ASCII' encoding to copy filtered resources.
[INFO] skip non existing resourceDirectory <https://builds.apache.org/job/POI-Maven/ws/sonar/ooxml-schema-encryption/src/test/resources>
[INFO] 
[INFO] --- maven-compiler-plugin:3.5.1:testCompile (default-testCompile) @ poi-ooxml-schema-encryption
---
[INFO] No sources to compile
[INFO] 
[INFO] --- maven-surefire-plugin:2.19.1:test (default-test) @ poi-ooxml-schema-encryption
---
[INFO] No tests to run.
[JENKINS] Recording test results[INFO] 
[INFO] --- maven-antrun-plugin:1.8:run (remove-xmltypeloader-from-schema-jar) @ poi-ooxml-schema-encryption
---

[INFO] Executing tasks

main:
   [delete] Deleting directory <https://builds.apache.org/job/POI-Maven/ws/sonar/ooxml-schema-encryption/target/classes/org/apache>
[INFO] Executed tasks
[INFO] 
[INFO] --- maven-jar-plugin:2.4:jar (default-jar) @ poi-ooxml-schema-encryption ---
[INFO] Building jar: <https://builds.apache.org/job/POI-Maven/ws/sonar/ooxml-schema-encryption/target/poi-ooxml-schema-encryption-3.16-beta1-SNAPSHOT.jar>
[INFO]                                                                         
[INFO] ------------------------------------------------------------------------
[INFO] Building Apache POI - Openxmlformats Security-Schema package 3.16-beta1-SNAPSHOT
[INFO] ------------------------------------------------------------------------
[INFO] 
[INFO] --- maven-download-plugin:1.1.0:wget (install-xsds-part-1) @ poi-ooxml-schema-security
---
[INFO] Got from cache: /home/jenkins/jenkins-slave/maven-repositories/0/.cache/maven-download-plugin/Office%20Open%20XML%201st%20edition%20Part%202%20(PDF).zip
[INFO] 
[INFO] --- maven-download-plugin:1.1.0:wget (install-xsds-part-2) @ poi-ooxml-schema-security
---
[INFO] Got from cache: /home/jenkins/jenkins-slave/maven-repositories/0/.cache/maven-download-plugin/dc.xsd
[INFO] 
[INFO] --- maven-download-plugin:1.1.0:wget (install-xsds-part-3) @ poi-ooxml-schema-security
---
[INFO] Got from cache: /home/jenkins/jenkins-slave/maven-repositories/0/.cache/maven-download-plugin/dcterms.xsd
[INFO] 
[INFO] --- maven-download-plugin:1.1.0:wget (install-xsds-part-4) @ poi-ooxml-schema-security
---
[INFO] Got from cache: /home/jenkins/jenkins-slave/maven-repositories/0/.cache/maven-download-plugin/dcmitype.xsd
[INFO] 
[INFO] --- maven-download-plugin:1.1.0:wget (install-xsds-part-5) @ poi-ooxml-schema-security
---
[INFO] File already exist, skipping
[INFO] 
[INFO] --- maven-download-plugin:1.1.0:wget (install-xsds-part-6) @ poi-ooxml-schema-security
---
[INFO] Got from cache: /home/jenkins/jenkins-slave/maven-repositories/0/.cache/maven-download-plugin/XAdES.xsd
[INFO] 
[INFO] --- maven-download-plugin:1.1.0:wget (install-xsds-part-7) @ poi-ooxml-schema-security
---
[INFO] Got from cache: /home/jenkins/jenkins-slave/maven-repositories/0/.cache/maven-download-plugin/XAdESv141.xsd
[INFO] 
[INFO] --- maven-antrun-plugin:1.8:run (copy-xmltype-and-xsdconfig) @ poi-ooxml-schema-security
---
[INFO] Executing tasks

main:
     [copy] Copying 7 files to <https://builds.apache.org/job/POI-Maven/ws/sonar/ooxml-schema-security/target/generated-sources/xmlbeans>
     [copy] Copying 1 file to <https://builds.apache.org/job/POI-Maven/ws/sonar/ooxml-schema-security/target/schemas>
[INFO] Executed tasks
[INFO] 
[INFO] --- maven-antrun-plugin:1.8:run (unzip-schema) @ poi-ooxml-schema-security ---
[INFO] Executing tasks

main:
     [echo] unzip schemas
    [unzip] Expanding: <https://builds.apache.org/job/POI-Maven/ws/sonar/ooxml-schema-security/target/OpenPackagingConventions-XMLSchema.zip>
into <https://builds.apache.org/job/POI-Maven/ws/sonar/ooxml-schema-security/target/schemas>
     [copy] Copying 1 file to <https://builds.apache.org/job/POI-Maven/ws/sonar/ooxml-schema-security/target/schemas>
[INFO] Executed tasks
[INFO] 
[INFO] --- xmlbeans-maven-plugin:2.3.3:xmlbeans (default) @ poi-ooxml-schema-security ---
[INFO] 
[INFO] --- maven-antrun-plugin:1.8:run (replace-xmltypeloader) @ poi-ooxml-schema-security
---
[INFO] Executing tasks

main:
[INFO] Executed tasks
[INFO] 
[INFO] --- maven-resources-plugin:2.6:resources (default-resources) @ poi-ooxml-schema-security
---
[INFO] Using 'ASCII' encoding to copy filtered resources.
[INFO] skip non existing resourceDirectory <https://builds.apache.org/job/POI-Maven/ws/sonar/ooxml-schema-security/src/main/resources>
[INFO] Copying 916 resources
[INFO] 
[INFO] --- maven-compiler-plugin:3.5.1:compile (default-compile) @ poi-ooxml-schema-security
---
[INFO] Changes detected - recompiling the module!
[INFO] Compiling 499 source files to <https://builds.apache.org/job/POI-Maven/ws/sonar/ooxml-schema-security/target/classes>
[INFO] 
[INFO] --- maven-resources-plugin:2.6:testResources (default-testResources) @ poi-ooxml-schema-security
---
[INFO] Using 'ASCII' encoding to copy filtered resources.
[INFO] skip non existing resourceDirectory <https://builds.apache.org/job/POI-Maven/ws/sonar/ooxml-schema-security/src/test/resources>
[INFO] 
[INFO] --- maven-compiler-plugin:3.5.1:testCompile (default-testCompile) @ poi-ooxml-schema-security
---
[INFO] No sources to compile
[INFO] 
[INFO] --- maven-surefire-plugin:2.19.1:test (default-test) @ poi-ooxml-schema-security ---
[INFO] No tests to run.
[JENKINS] Recording test results
[INFO] 
[INFO] --- maven-antrun-plugin:1.8:run (remove-xmltypeloader-from-schema-jar) @ poi-ooxml-schema-security
---
[INFO] Executing tasks

main:
   [delete] Deleting directory <https://builds.apache.org/job/POI-Maven/ws/sonar/ooxml-schema-security/target/classes/org/apache>
[INFO] Executed tasks
[INFO] 
[INFO] --- maven-jar-plugin:2.4:jar (default-jar) @ poi-ooxml-schema-security ---
[INFO] Building jar: <https://builds.apache.org/job/POI-Maven/ws/sonar/ooxml-schema-security/target/poi-ooxml-schema-security-3.16-beta1-SNAPSHOT.jar>
[INFO]                                                                         
[INFO] ------------------------------------------------------------------------
[INFO] Building Apache POI OOXML package 3.16-beta1-SNAPSHOT
[INFO] ------------------------------------------------------------------------
[INFO] 
[INFO] --- maven-resources-plugin:3.0.1:copy-resources (copy-sources) @ poi-ooxml ---
[INFO] Using 'ASCII' encoding to copy filtered resources.
[INFO] Copying 412 resources
[INFO] 
[INFO] --- maven-resources-plugin:3.0.1:copy-resources (copy-resources) @ poi-ooxml ---
[INFO] Using 'ASCII' encoding to copy filtered resources.
[INFO] Copying 2 resources
[INFO] 
[INFO] --- maven-resources-plugin:3.0.1:resources (default-resources) @ poi-ooxml ---
[INFO] Using 'ASCII' encoding to copy filtered resources.
[INFO] Copying 2 resources
[INFO] 
[INFO] --- maven-compiler-plugin:3.5.1:compile (default-compile) @ poi-ooxml ---
[INFO] Changes detected - recompiling the module!
[INFO] Compiling 411 source files to <https://builds.apache.org/job/POI-Maven/ws/sonar/ooxml/target/classes>
[INFO] 
[INFO] --- maven-resources-plugin:3.0.1:copy-resources (copy-tests) @ poi-ooxml ---
[INFO] Using 'ASCII' encoding to copy filtered resources.
[INFO] Copying 213 resources
[INFO] 
[INFO] --- maven-resources-plugin:3.0.1:testResources (default-testResources) @ poi-ooxml
---
[INFO] Using 'ASCII' encoding to copy filtered resources.
[INFO] skip non existing resourceDirectory <https://builds.apache.org/job/POI-Maven/ws/sonar/ooxml/src/test/resources>
[INFO] 
[INFO] --- maven-compiler-plugin:3.5.1:testCompile (default-testCompile) @ poi-ooxml ---
[INFO] Changes detected - recompiling the module!
[INFO] Compiling 213 source files to <https://builds.apache.org/job/POI-Maven/ws/sonar/ooxml/target/test-classes>
[INFO] -------------------------------------------------------------
[ERROR] COMPILATION ERROR : 
[INFO] -------------------------------------------------------------
[ERROR] <https://builds.apache.org/job/POI-Maven/ws/sonar/ooxml/src/test/java/org/apache/poi/xssf/streaming/TestSXSSFWorkbookWithCustomZipEntrySource.java>:[22,30]
cannot find symbol
symbol  : class StandardCharsets
location: package java.nio.charset
[ERROR] <https://builds.apache.org/job/POI-Maven/ws/sonar/ooxml/src/test/java/org/apache/poi/xssf/streaming/TestSXSSFWorkbookWithCustomZipEntrySource.java>:[22]
static import only from classes and interfaces
[ERROR] <https://builds.apache.org/job/POI-Maven/ws/sonar/ooxml/src/test/java/org/apache/poi/xssf/streaming/TestSXSSFWorkbookWithCustomZipEntrySource.java>:[133,39]
cannot find symbol
symbol  : variable UTF_8
location: class org.apache.poi.xssf.streaming.TestSXSSFWorkbookWithCustomZipEntrySource
[INFO] 3 errors 
[INFO] -------------------------------------------------------------
[INFO] ------------------------------------------------------------------------
[INFO] Reactor Summary:
[INFO] 
[INFO] Apache POI - the Java API for Microsoft Documents . SUCCESS [  0.245 s]
[INFO] Apache POI Main package ........................... SUCCESS [02:28 min]
[INFO] Apache POI Scratchpad package ..................... SUCCESS [ 39.861 s]
[INFO] Apache POI - Openxmlformats Schema package ........ SUCCESS [01:50 min]
[INFO] Apache POI - Openxmlformats Encryption Schema package  SUCCESS [  4.965 s]
[INFO] Apache POI - Openxmlformats Security-Schema package  SUCCESS [ 15.492 s]
[INFO] Apache POI OOXML package .......................... FAILURE [ 16.248 s]
[INFO] Apache POI ExcelAnt package ....................... SKIPPED
[INFO] Apache POI Examples package ....................... SKIPPED
[INFO] ------------------------------------------------------------------------
[INFO] BUILD FAILURE
[INFO] ------------------------------------------------------------------------
[INFO] Total time: 05:41 min
[INFO] Finished at: 2016-10-09T16:32:13+00:00
[INFO] Final Memory: 31M/514M
[INFO] ------------------------------------------------------------------------
Waiting for Jenkins to finish collecting data
[ERROR] Failed to execute goal org.apache.maven.plugins:maven-compiler-plugin:3.5.1:testCompile
(default-testCompile) on project poi-ooxml: Compilation failure: Compilation failure:
[ERROR] <https://builds.apache.org/job/POI-Maven/ws/sonar/ooxml/src/test/java/org/apache/poi/xssf/streaming/TestSXSSFWorkbookWithCustomZipEntrySource.java>:[22,30]
cannot find symbol
[ERROR] symbol  : class StandardCharsets
[ERROR] location: package java.nio.charset
[ERROR] <https://builds.apache.org/job/POI-Maven/ws/sonar/ooxml/src/test/java/org/apache/poi/xssf/streaming/TestSXSSFWorkbookWithCustomZipEntrySource.java>:[22]
static import only from classes and interfaces
[ERROR] <https://builds.apache.org/job/POI-Maven/ws/sonar/ooxml/src/test/java/org/apache/poi/xssf/streaming/TestSXSSFWorkbookWithCustomZipEntrySource.java>:[133,39]
cannot find symbol
[ERROR] symbol  : variable UTF_8
[ERROR] location: class org.apache.poi.xssf.streaming.TestSXSSFWorkbookWithCustomZipEntrySource
[ERROR] -> [Help 1]
[ERROR] 
[ERROR] To see the full stack trace of the errors, re-run Maven with the -e switch.
[ERROR] Re-run Maven using the -X switch to enable full debug logging.
[ERROR] 
[ERROR] For more information about the errors and possible solutions, please read the following
articles:
[ERROR] [Help 1] http://cwiki.apache.org/confluence/display/MAVEN/MojoFailureException
[ERROR] 
[ERROR] After correcting the problems, you can resume the build with the command
[ERROR]   mvn <goals> -rf :poi-ooxml
[JENKINS] Archiving <https://builds.apache.org/job/POI-Maven/ws/sonar/ooxml/pom.xml>
to org.apache.poi/poi-ooxml/3.16-beta1-SNAPSHOT/poi-ooxml-3.16-beta1-SNAPSHOT.pom
[JENKINS] Archiving <https://builds.apache.org/job/POI-Maven/ws/sonar/scratchpad/pom.xml>
to org.apache.poi/poi-scratchpad/3.16-beta1-SNAPSHOT/poi-scratchpad-3.16-beta1-SNAPSHOT.pom
[JENKINS] Archiving <https://builds.apache.org/job/POI-Maven/ws/sonar/scratchpad/target/poi-scratchpad-3.16-beta1-SNAPSHOT.jar>
to org.apache.poi/poi-scratchpad/3.16-beta1-SNAPSHOT/poi-scratchpad-3.16-beta1-SNAPSHOT.jar
[JENKINS] Archiving <https://builds.apache.org/job/POI-Maven/ws/sonar/examples/pom.xml>
to org.apache.poi/poi-examples/3.16-beta1-SNAPSHOT/poi-examples-3.16-beta1-SNAPSHOT.pom
[JENKINS] Archiving <https://builds.apache.org/job/POI-Maven/ws/sonar/ooxml-schema/pom.xml>
to org.apache.poi/poi-ooxml-schema/3.16-beta1-SNAPSHOT/poi-ooxml-schema-3.16-beta1-SNAPSHOT.pom
[JENKINS] Archiving <https://builds.apache.org/job/POI-Maven/ws/sonar/ooxml-schema/target/poi-ooxml-schema-3.16-beta1-SNAPSHOT.jar>
to org.apache.poi/poi-ooxml-schema/3.16-beta1-SNAPSHOT/poi-ooxml-schema-3.16-beta1-SNAPSHOT.jar
[JENKINS] Archiving <https://builds.apache.org/job/POI-Maven/ws/sonar/ooxml-schema-security/pom.xml>
to org.apache.poi/poi-ooxml-schema-security/3.16-beta1-SNAPSHOT/poi-ooxml-schema-security-3.16-beta1-SNAPSHOT.pom
[JENKINS] Archiving <https://builds.apache.org/job/POI-Maven/ws/sonar/ooxml-schema-security/target/poi-ooxml-schema-security-3.16-beta1-SNAPSHOT.jar>
to org.apache.poi/poi-ooxml-schema-security/3.16-beta1-SNAPSHOT/poi-ooxml-schema-security-3.16-beta1-SNAPSHOT.jar
[JENKINS] Archiving <https://builds.apache.org/job/POI-Maven/ws/sonar/ooxml-schema-encryption/pom.xml>
to org.apache.poi/poi-ooxml-schema-encryption/3.16-beta1-SNAPSHOT/poi-ooxml-schema-encryption-3.16-beta1-SNAPSHOT.pom
[JENKINS] Archiving <https://builds.apache.org/job/POI-Maven/ws/sonar/ooxml-schema-encryption/target/poi-ooxml-schema-encryption-3.16-beta1-SNAPSHOT.jar>
to org.apache.poi/poi-ooxml-schema-encryption/3.16-beta1-SNAPSHOT/poi-ooxml-schema-encryption-3.16-beta1-SNAPSHOT.jar
[JENKINS] Archiving <https://builds.apache.org/job/POI-Maven/ws/sonar/pom.xml> to org.apache.poi/poi-parent/3.16-beta1-SNAPSHOT/poi-parent-3.16-beta1-SNAPSHOT.pom
[JENKINS] Archiving <https://builds.apache.org/job/POI-Maven/ws/sonar/main/pom.xml>
to org.apache.poi/poi-main/3.16-beta1-SNAPSHOT/poi-main-3.16-beta1-SNAPSHOT.pom
[JENKINS] Archiving <https://builds.apache.org/job/POI-Maven/ws/sonar/main/target/poi-main-3.16-beta1-SNAPSHOT.jar>
to org.apache.poi/poi-main/3.16-beta1-SNAPSHOT/poi-main-3.16-beta1-SNAPSHOT.jar
[JENKINS] Archiving <https://builds.apache.org/job/POI-Maven/ws/sonar/main/target/poi-main-3.16-beta1-SNAPSHOT-tests.jar>
to org.apache.poi/poi-main/3.16-beta1-SNAPSHOT/poi-main-3.16-beta1-SNAPSHOT-tests.jar
[JENKINS] Archiving <https://builds.apache.org/job/POI-Maven/ws/sonar/excelant/pom.xml>
to org.apache.poi/poi-excelant/3.16-beta1-SNAPSHOT/poi-excelant-3.16-beta1-SNAPSHOT.pom
Sending e-mails to: dev@poi.apache.org
channel stopped

---------------------------------------------------------------------
To unsubscribe, e-mail: dev-unsubscribe@poi.apache.org
For additional commands, e-mail: dev-help@poi.apache.org


Mime
View raw message