poi-dev mailing list archives

Site index · List index
Message view « Date » · « Thread »
Top « Date » · « Thread »
From Apache Jenkins Server <jenk...@builds.apache.org>
Subject Build failed in Jenkins: POI-JDK8 #1262
Date Sun, 09 Oct 2016 10:13:43 GMT
See <https://builds.apache.org/job/POI-JDK8/1262/changes>

Changes:

[onealj] bug 55075,51233: create drawings with correct height when rows are custom height

------------------------------------------
Started by an SCM change
No JDK named ?jdk-1.8.0? found
[EnvInject] - Loading node environment variables.
No JDK named ?jdk-1.8.0? found
Building remotely on ubuntu-1 (Ubuntu ubuntu1 yahoo-not-h2 ubuntu docker) in workspace <https://builds.apache.org/job/POI-JDK8/ws/>
No JDK named ?jdk-1.8.0? found
Updating http://svn.apache.org/repos/asf/poi/trunk at revision '2016-10-09T10:12:20.597 +0000'
U         src/java/org/apache/poi/hssf/usermodel/HSSFComment.java
U         src/java/org/apache/poi/hssf/usermodel/HSSFWorkbook.java
U         src/java/org/apache/poi/hssf/usermodel/HSSFRow.java
U         src/java/org/apache/poi/poifs/crypt/EncryptionInfo.java
U         src/java/org/apache/poi/ss/usermodel/Comment.java
U         src/java/org/apache/poi/ss/formula/eval/NumberEval.java
U         src/scratchpad/testcases/org/apache/poi/hssf/converter/TestExcelConverterSuite.java
U         src/scratchpad/testcases/org/apache/poi/hwpf/usermodel/TestHWPFWrite.java
U         src/scratchpad/testcases/org/apache/poi/hwpf/converter/TestWordToConverterSuite.java
U         src/scratchpad/testcases/org/apache/poi/hslf/extractor/TestExtractor.java
U         src/scratchpad/src/org/apache/poi/hslf/extractor/PowerPointExtractor.java
U         src/scratchpad/src/org/apache/poi/hslf/model/HSLFMetroShape.java
U         src/ooxml/java/org/apache/poi/openxml4j/opc/OPCPackage.java
U         src/ooxml/java/org/apache/poi/POIXMLTypeLoader.java
U         src/ooxml/java/org/apache/poi/xssf/streaming/SXSSFSheet.java
U         src/ooxml/java/org/apache/poi/xssf/streaming/SheetDataWriter.java
AU        src/ooxml/java/org/apache/poi/xssf/streaming/SXSSFDrawing.java
AU        src/ooxml/java/org/apache/poi/xssf/streaming/SXSSFPicture.java
U         src/ooxml/java/org/apache/poi/xssf/streaming/SXSSFWorkbook.java
U         src/ooxml/java/org/apache/poi/xssf/streaming/GZIPSheetDataWriter.java
U         src/ooxml/java/org/apache/poi/xssf/usermodel/XSSFWorkbook.java
U         src/ooxml/java/org/apache/poi/xssf/usermodel/XSSFComment.java
U         src/ooxml/java/org/apache/poi/xssf/usermodel/XSSFEvaluationSheet.java
U         src/ooxml/java/org/apache/poi/extractor/CommandLineTextExtractor.java
U         src/ooxml/java/org/apache/poi/xslf/usermodel/XSLFTable.java
U         src/ooxml/java/org/apache/poi/util/OOXMLLite.java
U         src/ooxml/testcases/org/apache/poi/poifs/crypt/TestSecureTempZip.java
A         src/ooxml/testcases/org/apache/poi/poifs/crypt/AesZipFileZipEntrySource.java
A         src/ooxml/testcases/org/apache/poi/xssf/streaming/TestSXSSFWorkbookWithCustomZipEntrySource.java
U         src/ooxml/testcases/org/apache/poi/xssf/usermodel/TestSXSSFBugs.java
A         src/ooxml/testcases/org/apache/poi/xssf/usermodel/TestXSSFEvaluationSheet.java
U         src/ooxml/testcases/org/apache/poi/ss/formula/TestFormulaParser.java
U         src/ooxml/testcases/org/apache/poi/TestPOIXMLDocument.java
U         src/testcases/org/apache/poi/poifs/filesystem/TestNPOIFSFileSystem.java
U         src/testcases/org/apache/poi/hssf/usermodel/TestHSSFWorkbook.java
U         src/testcases/org/apache/poi/hssf/usermodel/TestHSSFRow.java
U         src/testcases/org/apache/poi/hssf/model/TestDrawingShapes.java
U         src/testcases/org/apache/poi/ss/usermodel/BaseTestWorkbook.java
U         src/testcases/org/apache/poi/ss/usermodel/BaseTestBugzillaIssues.java
U         src/testcases/org/apache/poi/ss/usermodel/BaseTestCell.java
U         build.gradle
A         settings.gradle
Fetching 'https://svn.apache.org/repos/asf/poi/site/src/documentation' at -1 into '<https://builds.apache.org/job/POI-JDK8/ws/src/documentation'>
U         src/documentation/content/xdocs/status.xml
U         src/documentation/content/xdocs/faq.xml
U         src/documentation/content/xdocs/index.xml
At revision 1763950

Fetching 'https://svn.apache.org/repos/asf/poi/site/forrest.properties' at -1 into '<https://builds.apache.org/job/POI-JDK8/ws/forrest.properties'>
At revision 1763950

At revision 1763950

No changes for https://svn.apache.org/repos/asf/poi/site/src/documentation since the previous
build
No changes for http://svn.apache.org/repos/asf/poi/site/forrest.properties since the previous
build
[EnvInject] - Executing scripts and injecting environment variables after the SCM step.
[EnvInject] - Injecting as environment variables the properties content 
LANG=en_US.UTF-8

[EnvInject] - Variables injected successfully.
No JDK named ?jdk-1.8.0? found
[POI-JDK8] $ /bin/bash -xe /tmp/hudson7720724106297115973.sh
+ svn status
    X   forrest.properties
X       src/documentation

Performing status on external item at 'src/documentation':
+ exit 0
No JDK named ?jdk-1.8.0? found
[POI-JDK8] $ /home/jenkins/tools/ant/latest/bin/ant -Dcoverage.enabled=true clean jenkins
Buildfile: <https://builds.apache.org/job/POI-JDK8/ws/build.xml>

clean:
   [delete] Deleting directory <https://builds.apache.org/job/POI-JDK8/ws/build>

check-jars:

fetch-jars:

check-ooxml-jars:

fetch-ooxml-jars:

init:
    [mkdir] Created dir: <https://builds.apache.org/job/POI-JDK8/ws/build>
    [mkdir] Created dir: <https://builds.apache.org/job/POI-JDK8/ws/build/classes>
    [mkdir] Created dir: <https://builds.apache.org/job/POI-JDK8/ws/build/test-classes>
    [mkdir] Created dir: <https://builds.apache.org/job/POI-JDK8/ws/build/test-results>
    [mkdir] Created dir: <https://builds.apache.org/job/POI-JDK8/ws/build/scratchpad-classes>
    [mkdir] Created dir: <https://builds.apache.org/job/POI-JDK8/ws/build/scratchpad-test-classes>
    [mkdir] Created dir: <https://builds.apache.org/job/POI-JDK8/ws/build/scratchpad-test-results>
    [mkdir] Created dir: <https://builds.apache.org/job/POI-JDK8/ws/build/geometry-java>
    [mkdir] Created dir: <https://builds.apache.org/job/POI-JDK8/ws/build/ooxml-classes>
    [mkdir] Created dir: <https://builds.apache.org/job/POI-JDK8/ws/build/ooxml-test-classes>
    [mkdir] Created dir: <https://builds.apache.org/job/POI-JDK8/ws/build/ooxml-test-results>
    [mkdir] Created dir: <https://builds.apache.org/job/POI-JDK8/ws/build/excelant-classes>
    [mkdir] Created dir: <https://builds.apache.org/job/POI-JDK8/ws/build/excelant-test-classes>
    [mkdir] Created dir: <https://builds.apache.org/job/POI-JDK8/ws/build/excelant-test-results>
    [mkdir] Created dir: <https://builds.apache.org/job/POI-JDK8/ws/build/examples-classes>
    [mkdir] Created dir: <https://builds.apache.org/job/POI-JDK8/ws/build/integration-test-classes>
    [mkdir] Created dir: <https://builds.apache.org/job/POI-JDK8/1262/artifact/build/integration-test-results>
    [mkdir] Created dir: <https://builds.apache.org/job/POI-JDK8/ws/build/dist>
    [mkdir] Created dir: <https://builds.apache.org/job/POI-JDK8/ws/build/tmp/site/build/site>
     [echo] Using Ant: Apache Ant(TM) version 1.9.7 compiled on April 9 2016 from /home/jenkins/tools/ant/latest,
Ant detected Java 1.7 (may be different than actual Java sometimes...)
     [echo] Using Java: 1.7.0_80/1.7.0_80-b15/24.80-b11/Java HotSpot(TM) 64-Bit Server VM
from Oracle Corporation on Linux: 3.13.0-92-generic
     [echo] Using Findbugs: 3.0.1 for Java 1.7.0_80

compile-main:
    [javac] Compiling 1194 source files to <https://builds.apache.org/job/POI-JDK8/ws/build/classes>
    [javac] warning: [options] bootstrap class path not set in conjunction with -source 1.6
    [javac] Note: Some input files use or override a deprecated API.
    [javac] Note: Recompile with -Xlint:deprecation for details.
    [javac] Note: Some input files use unchecked or unsafe operations.
    [javac] Note: Recompile with -Xlint:unchecked for details.
    [javac] 1 warning
    [javac] Compiling 532 source files to <https://builds.apache.org/job/POI-JDK8/ws/build/test-classes>
    [javac] warning: [options] bootstrap class path not set in conjunction with -source 1.6
    [javac] <https://builds.apache.org/job/POI-JDK8/ws/src/testcases/org/apache/poi/ss/usermodel/BaseTestWorkbook.java>:949:
error: cannot find symbol
    [javac]             File f = TempFile.createTempFile(prefix, ext);
    [javac]             ^
    [javac]   symbol:   class File
    [javac]   location: class BaseTestWorkbook
    [javac] Note: Some input files use or override a deprecated API.
    [javac] Note: Recompile with -Xlint:deprecation for details.
    [javac] Note: <https://builds.apache.org/job/POI-JDK8/ws/src/testcases/org/apache/poi/util/LocalTestNode.java>
uses unchecked or unsafe operations.
    [javac] Note: Recompile with -Xlint:unchecked for details.
    [javac] 1 error
    [javac] 1 warning

BUILD FAILED
<https://builds.apache.org/job/POI-JDK8/ws/build.xml>:887: Compile failed; see the compiler
error output for details.

Total time: 27 seconds
Build step 'Invoke Ant' marked build as failure
[FINDBUGS] Skipping publisher since build result is FAILURE
[WARNINGS] Skipping publisher since build result is FAILURE
Archiving artifacts
No JDK named ?jdk-1.8.0? found
Recording test results
No JDK named ?jdk-1.8.0? found
ERROR: Step ?Publish JUnit test result report? failed: No test report files were found. Configuration
error?
No JDK named ?jdk-1.8.0? found

---------------------------------------------------------------------
To unsubscribe, e-mail: dev-unsubscribe@poi.apache.org
For additional commands, e-mail: dev-help@poi.apache.org


Mime
View raw message