poi-dev mailing list archives

Site index · List index
Message view « Date » · « Thread »
Top « Date » · « Thread »
From Apache Jenkins Server <jenk...@builds.apache.org>
Subject Build failed in Jenkins: POI #1600
Date Fri, 21 Oct 2016 14:46:25 GMT
See <https://builds.apache.org/job/POI/1600/>

------------------------------------------
[...truncated 332 lines...]
	at org.tmatesoft.svn.core.internal.io.dav.DAVRepository.update(DAVRepository.java:868)
	at org.tmatesoft.svn.core.internal.wc2.ng.SvnNgAbstractUpdate.updateInternal(SvnNgAbstractUpdate.java:247)
	at org.tmatesoft.svn.core.internal.wc2.ng.SvnNgAbstractUpdate.update(SvnNgAbstractUpdate.java:111)
	at org.tmatesoft.svn.core.internal.wc2.ng.SvnNgUpdate.run(SvnNgUpdate.java:38)
	at org.tmatesoft.svn.core.internal.wc2.ng.SvnNgUpdate.run(SvnNgUpdate.java:18)
	at org.tmatesoft.svn.core.internal.wc2.ng.SvnNgOperationRunner.run(SvnNgOperationRunner.java:20)
	at org.tmatesoft.svn.core.internal.wc2.SvnOperationRunner.run(SvnOperationRunner.java:21)
	at org.tmatesoft.svn.core.wc2.SvnOperationFactory.run(SvnOperationFactory.java:1235)
	at org.tmatesoft.svn.core.wc2.SvnOperation.run(SvnOperation.java:294)
	at org.tmatesoft.svn.core.wc.SVNUpdateClient.doUpdate(SVNUpdateClient.java:311)
	at org.tmatesoft.svn.core.wc.SVNUpdateClient.doUpdate(SVNUpdateClient.java:291)
	at org.tmatesoft.svn.core.wc.SVNUpdateClient.doUpdate(SVNUpdateClient.java:387)
	at hudson.scm.subversion.UpdateUpdater$TaskImpl.perform(UpdateUpdater.java:158)
	... 13 more
Caused by: org.tmatesoft.sqljet.core.SqlJetException: FULL: error code is FULL
	at org.tmatesoft.sqljet.core.internal.pager.SqlJetPager.openJournal(SqlJetPager.java:3051)
	at org.tmatesoft.sqljet.core.internal.pager.SqlJetPager.begin(SqlJetPager.java:2782)
	at org.tmatesoft.sqljet.core.internal.btree.SqlJetBtree.beginTrans(SqlJetBtree.java:931)
	at org.tmatesoft.sqljet.core.table.engine.SqlJetEngine.doBeginTransaction(SqlJetEngine.java:561)
	at org.tmatesoft.sqljet.core.table.engine.SqlJetEngine.access$100(SqlJetEngine.java:55)
	at org.tmatesoft.sqljet.core.table.engine.SqlJetEngine$12.runSynchronized(SqlJetEngine.java:535)
	at org.tmatesoft.sqljet.core.table.engine.SqlJetEngine.runSynchronized(SqlJetEngine.java:217)
	at org.tmatesoft.sqljet.core.table.engine.SqlJetEngine.runEngineTransaction(SqlJetEngine.java:529)
	at org.tmatesoft.sqljet.core.table.SqlJetDb.runTransaction(SqlJetDb.java:238)
	at org.tmatesoft.sqljet.core.table.SqlJetDb.runWriteTransaction(SqlJetDb.java:211)
	at org.tmatesoft.svn.core.internal.wc17.db.statement.SVNWCDbCreateSchema.exec(SVNWCDbCreateSchema.java:225)
	at org.tmatesoft.svn.core.internal.db.SVNSqlJetStatement.done(SVNSqlJetStatement.java:420)
	at org.tmatesoft.svn.core.internal.wc17.db.SVNWCDb$BumpRevisionPostUpdate.bumpMovedAway(SVNWCDb.java:5215)
	at org.tmatesoft.svn.core.internal.wc17.db.SVNWCDb$BumpRevisionPostUpdate.transaction(SVNWCDb.java:5208)
	at org.tmatesoft.svn.core.internal.db.SVNSqlJetDb.runTransaction(SVNSqlJetDb.java:258)
	at org.tmatesoft.svn.core.internal.db.SVNSqlJetDb.runTransaction(SVNSqlJetDb.java:252)
	at org.tmatesoft.svn.core.internal.wc17.db.SVNWCDb.opBumpRevisionPostUpdate(SVNWCDb.java:5160)
	at org.tmatesoft.svn.core.internal.wc17.SVNUpdateEditor17.closeEdit(SVNUpdateEditor17.java:1728)
	at org.tmatesoft.svn.core.internal.wc.SVNCancellableEditor.closeEdit(SVNCancellableEditor.java:148)
	at org.tmatesoft.svn.core.internal.io.dav.handlers.DAVEditorHandler.endElement(DAVEditorHandler.java:492)
	at org.tmatesoft.svn.core.internal.io.dav.handlers.BasicDAVHandler.endElement(BasicDAVHandler.java:103)
	at com.sun.org.apache.xerces.internal.parsers.AbstractSAXParser.endElement(AbstractSAXParser.java:609)
	at com.sun.org.apache.xerces.internal.impl.XMLDocumentFragmentScannerImpl.scanEndElement(XMLDocumentFragmentScannerImpl.java:1781)
	at com.sun.org.apache.xerces.internal.impl.XMLDocumentFragmentScannerImpl$FragmentContentDriver.next(XMLDocumentFragmentScannerImpl.java:2957)
	at com.sun.org.apache.xerces.internal.impl.XMLDocumentScannerImpl.next(XMLDocumentScannerImpl.java:606)
	at com.sun.org.apache.xerces.internal.impl.XMLNSDocumentScannerImpl.next(XMLNSDocumentScannerImpl.java:117)
	at com.sun.org.apache.xerces.internal.impl.XMLDocumentFragmentScannerImpl.scanDocument(XMLDocumentFragmentScannerImpl.java:510)
	at com.sun.org.apache.xerces.internal.parsers.XML11Configuration.parse(XML11Configuration.java:848)
	at com.sun.org.apache.xerces.internal.parsers.XML11Configuration.parse(XML11Configuration.java:777)
	at com.sun.org.apache.xerces.internal.parsers.XMLParser.parse(XMLParser.java:141)
	at com.sun.org.apache.xerces.internal.parsers.AbstractSAXParser.parse(AbstractSAXParser.java:1213)
	at com.sun.org.apache.xerces.internal.jaxp.SAXParserImpl$JAXPSAXParser.parse(SAXParserImpl.java:649)
	at org.tmatesoft.svn.core.internal.io.dav.http.HTTPConnection.readData(HTTPConnection.java:932)
	at org.tmatesoft.svn.core.internal.io.dav.http.HTTPConnection.readData(HTTPConnection.java:897)
	at org.tmatesoft.svn.core.internal.io.dav.http.HTTPRequest.dispatch(HTTPRequest.java:220)
	at org.tmatesoft.svn.core.internal.io.dav.http.HTTPConnection.request(HTTPConnection.java:497)
	... 31 more
Retrying after 10 seconds
Updating http://svn.apache.org/repos/asf/poi/trunk at revision '2016-10-21T14:34:09.517 +0000'
ERROR: Failed to update http://svn.apache.org/repos/asf/poi/trunk
org.tmatesoft.svn.core.SVNException: svn: E200030: FULL
	at org.tmatesoft.svn.core.internal.wc.SVNErrorManager.error(SVNErrorManager.java:64)
	at org.tmatesoft.svn.core.internal.wc.SVNErrorManager.error(SVNErrorManager.java:51)
	at org.tmatesoft.svn.core.internal.io.dav.http.HTTPConnection.request(HTTPConnection.java:793)
	at org.tmatesoft.svn.core.internal.io.dav.http.HTTPConnection.request(HTTPConnection.java:398)
	at org.tmatesoft.svn.core.internal.io.dav.http.HTTPConnection.request(HTTPConnection.java:386)
	at org.tmatesoft.svn.core.internal.io.dav.DAVConnection.performHttpRequest(DAVConnection.java:863)
	at org.tmatesoft.svn.core.internal.io.dav.DAVConnection.doReport(DAVConnection.java:360)
	at org.tmatesoft.svn.core.internal.io.dav.DAVRepository.runReport(DAVRepository.java:1340)
	at org.tmatesoft.svn.core.internal.io.dav.DAVRepository.update(DAVRepository.java:868)
	at org.tmatesoft.svn.core.internal.wc2.ng.SvnNgAbstractUpdate.updateInternal(SvnNgAbstractUpdate.java:247)
	at org.tmatesoft.svn.core.internal.wc2.ng.SvnNgAbstractUpdate.update(SvnNgAbstractUpdate.java:111)
	at org.tmatesoft.svn.core.internal.wc2.ng.SvnNgUpdate.run(SvnNgUpdate.java:38)
	at org.tmatesoft.svn.core.internal.wc2.ng.SvnNgUpdate.run(SvnNgUpdate.java:18)
	at org.tmatesoft.svn.core.internal.wc2.ng.SvnNgOperationRunner.run(SvnNgOperationRunner.java:20)
	at org.tmatesoft.svn.core.internal.wc2.SvnOperationRunner.run(SvnOperationRunner.java:21)
	at org.tmatesoft.svn.core.wc2.SvnOperationFactory.run(SvnOperationFactory.java:1235)
	at org.tmatesoft.svn.core.wc2.SvnOperation.run(SvnOperation.java:294)
	at org.tmatesoft.svn.core.wc.SVNUpdateClient.doUpdate(SVNUpdateClient.java:311)
	at org.tmatesoft.svn.core.wc.SVNUpdateClient.doUpdate(SVNUpdateClient.java:291)
	at org.tmatesoft.svn.core.wc.SVNUpdateClient.doUpdate(SVNUpdateClient.java:387)
	at hudson.scm.subversion.UpdateUpdater$TaskImpl.perform(UpdateUpdater.java:158)
	at hudson.scm.subversion.WorkspaceUpdater$UpdateTask.delegateTo(WorkspaceUpdater.java:162)
	at hudson.scm.SubversionSCM$CheckOutTask.perform(SubversionSCM.java:996)
	at hudson.scm.SubversionSCM$CheckOutTask.invoke(SubversionSCM.java:972)
	at hudson.scm.SubversionSCM$CheckOutTask.invoke(SubversionSCM.java:948)
	at hudson.FilePath$FileCallableWrapper.call(FilePath.java:2772)
	at hudson.remoting.UserRequest.perform(UserRequest.java:153)
	at hudson.remoting.UserRequest.perform(UserRequest.java:50)
	at hudson.remoting.Request$2.run(Request.java:332)
	at hudson.remoting.InterceptingExecutorService$1.call(InterceptingExecutorService.java:68)
	at java.util.concurrent.FutureTask.run(FutureTask.java:262)
	at java.util.concurrent.ThreadPoolExecutor.runWorker(ThreadPoolExecutor.java:1145)
	at java.util.concurrent.ThreadPoolExecutor$Worker.run(ThreadPoolExecutor.java:615)
	at java.lang.Thread.run(Thread.java:745)
Caused by: org.tmatesoft.sqljet.core.SqlJetException: FULL: error code is FULL
	at org.tmatesoft.sqljet.core.internal.pager.SqlJetPager.openJournal(SqlJetPager.java:3051)
	at org.tmatesoft.sqljet.core.internal.pager.SqlJetPager.begin(SqlJetPager.java:2782)
	at org.tmatesoft.sqljet.core.internal.btree.SqlJetBtree.beginTrans(SqlJetBtree.java:931)
	at org.tmatesoft.sqljet.core.table.engine.SqlJetEngine.doBeginTransaction(SqlJetEngine.java:561)
	at org.tmatesoft.sqljet.core.table.engine.SqlJetEngine.access$100(SqlJetEngine.java:55)
	at org.tmatesoft.sqljet.core.table.engine.SqlJetEngine$12.runSynchronized(SqlJetEngine.java:535)
	at org.tmatesoft.sqljet.core.table.engine.SqlJetEngine.runSynchronized(SqlJetEngine.java:217)
	at org.tmatesoft.sqljet.core.table.engine.SqlJetEngine.runEngineTransaction(SqlJetEngine.java:529)
	at org.tmatesoft.sqljet.core.table.SqlJetDb.runTransaction(SqlJetDb.java:238)
	at org.tmatesoft.sqljet.core.table.SqlJetDb.runWriteTransaction(SqlJetDb.java:211)
	at org.tmatesoft.svn.core.internal.wc17.db.statement.SVNWCDbCreateSchema.exec(SVNWCDbCreateSchema.java:225)
	at org.tmatesoft.svn.core.internal.db.SVNSqlJetStatement.done(SVNSqlJetStatement.java:420)
	at org.tmatesoft.svn.core.internal.wc17.db.SVNWCDb$BumpRevisionPostUpdate.bumpMovedAway(SVNWCDb.java:5215)
	at org.tmatesoft.svn.core.internal.wc17.db.SVNWCDb$BumpRevisionPostUpdate.transaction(SVNWCDb.java:5208)
	at org.tmatesoft.svn.core.internal.db.SVNSqlJetDb.runTransaction(SVNSqlJetDb.java:258)
	at org.tmatesoft.svn.core.internal.db.SVNSqlJetDb.runTransaction(SVNSqlJetDb.java:252)
	at org.tmatesoft.svn.core.internal.wc17.db.SVNWCDb.opBumpRevisionPostUpdate(SVNWCDb.java:5160)
	at org.tmatesoft.svn.core.internal.wc17.SVNUpdateEditor17.closeEdit(SVNUpdateEditor17.java:1728)
	at org.tmatesoft.svn.core.internal.wc.SVNCancellableEditor.closeEdit(SVNCancellableEditor.java:148)
	at org.tmatesoft.svn.core.internal.io.dav.handlers.DAVEditorHandler.endElement(DAVEditorHandler.java:492)
	at org.tmatesoft.svn.core.internal.io.dav.handlers.BasicDAVHandler.endElement(BasicDAVHandler.java:103)
	at com.sun.org.apache.xerces.internal.parsers.AbstractSAXParser.endElement(AbstractSAXParser.java:609)
	at com.sun.org.apache.xerces.internal.impl.XMLDocumentFragmentScannerImpl.scanEndElement(XMLDocumentFragmentScannerImpl.java:1781)
	at com.sun.org.apache.xerces.internal.impl.XMLDocumentFragmentScannerImpl$FragmentContentDriver.next(XMLDocumentFragmentScannerImpl.java:2957)
	at com.sun.org.apache.xerces.internal.impl.XMLDocumentScannerImpl.next(XMLDocumentScannerImpl.java:606)
	at com.sun.org.apache.xerces.internal.impl.XMLNSDocumentScannerImpl.next(XMLNSDocumentScannerImpl.java:117)
	at com.sun.org.apache.xerces.internal.impl.XMLDocumentFragmentScannerImpl.scanDocument(XMLDocumentFragmentScannerImpl.java:510)
	at com.sun.org.apache.xerces.internal.parsers.XML11Configuration.parse(XML11Configuration.java:848)
	at com.sun.org.apache.xerces.internal.parsers.XML11Configuration.parse(XML11Configuration.java:777)
	at com.sun.org.apache.xerces.internal.parsers.XMLParser.parse(XMLParser.java:141)
	at com.sun.org.apache.xerces.internal.parsers.AbstractSAXParser.parse(AbstractSAXParser.java:1213)
	at com.sun.org.apache.xerces.internal.jaxp.SAXParserImpl$JAXPSAXParser.parse(SAXParserImpl.java:649)
	at org.tmatesoft.svn.core.internal.io.dav.http.HTTPConnection.readData(HTTPConnection.java:932)
	at org.tmatesoft.svn.core.internal.io.dav.http.HTTPConnection.readData(HTTPConnection.java:897)
	at org.tmatesoft.svn.core.internal.io.dav.http.HTTPRequest.dispatch(HTTPRequest.java:220)
	at org.tmatesoft.svn.core.internal.io.dav.http.HTTPConnection.request(HTTPConnection.java:497)
	... 31 more
ERROR: Subversion update failed
java.io.IOException: remote file operation failed: <https://builds.apache.org/job/POI/ws/>
at hudson.remoting.Channel@58e865bc:ubuntu-eu2: java.io.IOException
	at hudson.FilePath.act(FilePath.java:1014)
	at hudson.FilePath.act(FilePath.java:996)
	at hudson.scm.SubversionSCM.checkout(SubversionSCM.java:897)
	at hudson.scm.SubversionSCM.checkout(SubversionSCM.java:833)
	at hudson.scm.SCM.checkout(SCM.java:485)
	at hudson.model.AbstractProject.checkout(AbstractProject.java:1269)
	at hudson.model.AbstractBuild$AbstractBuildExecution.defaultCheckout(AbstractBuild.java:604)
	at jenkins.scm.SCMCheckoutStrategy.checkout(SCMCheckoutStrategy.java:86)
	at hudson.model.AbstractBuild$AbstractBuildExecution.run(AbstractBuild.java:529)
	at hudson.model.Run.execute(Run.java:1741)
	at hudson.model.FreeStyleBuild.run(FreeStyleBuild.java:43)
	at hudson.model.ResourceController.execute(ResourceController.java:98)
	at hudson.model.Executor.run(Executor.java:410)
Caused by: java.io.IOException
	at hudson.scm.subversion.UpdateUpdater$TaskImpl.perform(UpdateUpdater.java:212)
	at hudson.scm.subversion.WorkspaceUpdater$UpdateTask.delegateTo(WorkspaceUpdater.java:162)
	at hudson.scm.SubversionSCM$CheckOutTask.perform(SubversionSCM.java:996)
	at hudson.scm.SubversionSCM$CheckOutTask.invoke(SubversionSCM.java:972)
	at hudson.scm.SubversionSCM$CheckOutTask.invoke(SubversionSCM.java:948)
	at hudson.FilePath$FileCallableWrapper.call(FilePath.java:2772)
	at hudson.remoting.UserRequest.perform(UserRequest.java:153)
	at hudson.remoting.UserRequest.perform(UserRequest.java:50)
	at hudson.remoting.Request$2.run(Request.java:332)
	at hudson.remoting.InterceptingExecutorService$1.call(InterceptingExecutorService.java:68)
	at java.util.concurrent.FutureTask.run(FutureTask.java:262)
	at java.util.concurrent.ThreadPoolExecutor.runWorker(ThreadPoolExecutor.java:1145)
	at java.util.concurrent.ThreadPoolExecutor$Worker.run(ThreadPoolExecutor.java:615)
	at java.lang.Thread.run(Thread.java:745)
	at ......remote call to ubuntu-eu2(Native Method)
	at hudson.remoting.Channel.attachCallSiteStackTrace(Channel.java:1416)
	at hudson.remoting.UserResponse.retrieve(UserRequest.java:253)
	at hudson.remoting.Channel.call(Channel.java:781)
	at hudson.FilePath.act(FilePath.java:1007)
	... 12 more
Caused by: hudson.scm.subversion.UpdaterException: failed to perform svn update
	at hudson.scm.subversion.UpdateUpdater$TaskImpl.perform(UpdateUpdater.java:212)
	at hudson.scm.subversion.WorkspaceUpdater$UpdateTask.delegateTo(WorkspaceUpdater.java:162)
	at hudson.scm.SubversionSCM$CheckOutTask.perform(SubversionSCM.java:996)
	at hudson.scm.SubversionSCM$CheckOutTask.invoke(SubversionSCM.java:972)
	at hudson.scm.SubversionSCM$CheckOutTask.invoke(SubversionSCM.java:948)
	at hudson.FilePath$FileCallableWrapper.call(FilePath.java:2772)
	at hudson.remoting.UserRequest.perform(UserRequest.java:153)
	at hudson.remoting.UserRequest.perform(UserRequest.java:50)
	at hudson.remoting.Request$2.run(Request.java:332)
	at hudson.remoting.InterceptingExecutorService$1.call(InterceptingExecutorService.java:68)
	at java.util.concurrent.FutureTask.run(FutureTask.java:262)
	at java.util.concurrent.ThreadPoolExecutor.runWorker(ThreadPoolExecutor.java:1145)
	at java.util.concurrent.ThreadPoolExecutor$Worker.run(ThreadPoolExecutor.java:615)
	at java.lang.Thread.run(Thread.java:745)
Caused by: org.tmatesoft.svn.core.SVNException: svn: E200030: FULL
	at org.tmatesoft.svn.core.internal.wc.SVNErrorManager.error(SVNErrorManager.java:64)
	at org.tmatesoft.svn.core.internal.wc.SVNErrorManager.error(SVNErrorManager.java:51)
	at org.tmatesoft.svn.core.internal.io.dav.http.HTTPConnection.request(HTTPConnection.java:793)
	at org.tmatesoft.svn.core.internal.io.dav.http.HTTPConnection.request(HTTPConnection.java:398)
	at org.tmatesoft.svn.core.internal.io.dav.http.HTTPConnection.request(HTTPConnection.java:386)
	at org.tmatesoft.svn.core.internal.io.dav.DAVConnection.performHttpRequest(DAVConnection.java:863)
	at org.tmatesoft.svn.core.internal.io.dav.DAVConnection.doReport(DAVConnection.java:360)
	at org.tmatesoft.svn.core.internal.io.dav.DAVRepository.runReport(DAVRepository.java:1340)
	at org.tmatesoft.svn.core.internal.io.dav.DAVRepository.update(DAVRepository.java:868)
	at org.tmatesoft.svn.core.internal.wc2.ng.SvnNgAbstractUpdate.updateInternal(SvnNgAbstractUpdate.java:247)
	at org.tmatesoft.svn.core.internal.wc2.ng.SvnNgAbstractUpdate.update(SvnNgAbstractUpdate.java:111)
	at org.tmatesoft.svn.core.internal.wc2.ng.SvnNgUpdate.run(SvnNgUpdate.java:38)
	at org.tmatesoft.svn.core.internal.wc2.ng.SvnNgUpdate.run(SvnNgUpdate.java:18)
	at org.tmatesoft.svn.core.internal.wc2.ng.SvnNgOperationRunner.run(SvnNgOperationRunner.java:20)
	at org.tmatesoft.svn.core.internal.wc2.SvnOperationRunner.run(SvnOperationRunner.java:21)
	at org.tmatesoft.svn.core.wc2.SvnOperationFactory.run(SvnOperationFactory.java:1235)
	at org.tmatesoft.svn.core.wc2.SvnOperation.run(SvnOperation.java:294)
	at org.tmatesoft.svn.core.wc.SVNUpdateClient.doUpdate(SVNUpdateClient.java:311)
	at org.tmatesoft.svn.core.wc.SVNUpdateClient.doUpdate(SVNUpdateClient.java:291)
	at org.tmatesoft.svn.core.wc.SVNUpdateClient.doUpdate(SVNUpdateClient.java:387)
	at hudson.scm.subversion.UpdateUpdater$TaskImpl.perform(UpdateUpdater.java:158)
	... 13 more
Caused by: org.tmatesoft.sqljet.core.SqlJetException: FULL: error code is FULL
	at org.tmatesoft.sqljet.core.internal.pager.SqlJetPager.openJournal(SqlJetPager.java:3051)
	at org.tmatesoft.sqljet.core.internal.pager.SqlJetPager.begin(SqlJetPager.java:2782)
	at org.tmatesoft.sqljet.core.internal.btree.SqlJetBtree.beginTrans(SqlJetBtree.java:931)
	at org.tmatesoft.sqljet.core.table.engine.SqlJetEngine.doBeginTransaction(SqlJetEngine.java:561)
	at org.tmatesoft.sqljet.core.table.engine.SqlJetEngine.access$100(SqlJetEngine.java:55)
	at org.tmatesoft.sqljet.core.table.engine.SqlJetEngine$12.runSynchronized(SqlJetEngine.java:535)
	at org.tmatesoft.sqljet.core.table.engine.SqlJetEngine.runSynchronized(SqlJetEngine.java:217)
	at org.tmatesoft.sqljet.core.table.engine.SqlJetEngine.runEngineTransaction(SqlJetEngine.java:529)
	at org.tmatesoft.sqljet.core.table.SqlJetDb.runTransaction(SqlJetDb.java:238)
	at org.tmatesoft.sqljet.core.table.SqlJetDb.runWriteTransaction(SqlJetDb.java:211)
	at org.tmatesoft.svn.core.internal.wc17.db.statement.SVNWCDbCreateSchema.exec(SVNWCDbCreateSchema.java:225)
	at org.tmatesoft.svn.core.internal.db.SVNSqlJetStatement.done(SVNSqlJetStatement.java:420)
	at org.tmatesoft.svn.core.internal.wc17.db.SVNWCDb$BumpRevisionPostUpdate.bumpMovedAway(SVNWCDb.java:5215)
	at org.tmatesoft.svn.core.internal.wc17.db.SVNWCDb$BumpRevisionPostUpdate.transaction(SVNWCDb.java:5208)
	at org.tmatesoft.svn.core.internal.db.SVNSqlJetDb.runTransaction(SVNSqlJetDb.java:258)
	at org.tmatesoft.svn.core.internal.db.SVNSqlJetDb.runTransaction(SVNSqlJetDb.java:252)
	at org.tmatesoft.svn.core.internal.wc17.db.SVNWCDb.opBumpRevisionPostUpdate(SVNWCDb.java:5160)
	at org.tmatesoft.svn.core.internal.wc17.SVNUpdateEditor17.closeEdit(SVNUpdateEditor17.java:1728)
	at org.tmatesoft.svn.core.internal.wc.SVNCancellableEditor.closeEdit(SVNCancellableEditor.java:148)
	at org.tmatesoft.svn.core.internal.io.dav.handlers.DAVEditorHandler.endElement(DAVEditorHandler.java:492)
	at org.tmatesoft.svn.core.internal.io.dav.handlers.BasicDAVHandler.endElement(BasicDAVHandler.java:103)
	at com.sun.org.apache.xerces.internal.parsers.AbstractSAXParser.endElement(AbstractSAXParser.java:609)
	at com.sun.org.apache.xerces.internal.impl.XMLDocumentFragmentScannerImpl.scanEndElement(XMLDocumentFragmentScannerImpl.java:1781)
	at com.sun.org.apache.xerces.internal.impl.XMLDocumentFragmentScannerImpl$FragmentContentDriver.next(XMLDocumentFragmentScannerImpl.java:2957)
	at com.sun.org.apache.xerces.internal.impl.XMLDocumentScannerImpl.next(XMLDocumentScannerImpl.java:606)
	at com.sun.org.apache.xerces.internal.impl.XMLNSDocumentScannerImpl.next(XMLNSDocumentScannerImpl.java:117)
	at com.sun.org.apache.xerces.internal.impl.XMLDocumentFragmentScannerImpl.scanDocument(XMLDocumentFragmentScannerImpl.java:510)
	at com.sun.org.apache.xerces.internal.parsers.XML11Configuration.parse(XML11Configuration.java:848)
	at com.sun.org.apache.xerces.internal.parsers.XML11Configuration.parse(XML11Configuration.java:777)
	at com.sun.org.apache.xerces.internal.parsers.XMLParser.parse(XMLParser.java:141)
	at com.sun.org.apache.xerces.internal.parsers.AbstractSAXParser.parse(AbstractSAXParser.java:1213)
	at com.sun.org.apache.xerces.internal.jaxp.SAXParserImpl$JAXPSAXParser.parse(SAXParserImpl.java:649)
	at org.tmatesoft.svn.core.internal.io.dav.http.HTTPConnection.readData(HTTPConnection.java:932)
	at org.tmatesoft.svn.core.internal.io.dav.http.HTTPConnection.readData(HTTPConnection.java:897)
	at org.tmatesoft.svn.core.internal.io.dav.http.HTTPRequest.dispatch(HTTPRequest.java:220)
	at org.tmatesoft.svn.core.internal.io.dav.http.HTTPConnection.request(HTTPConnection.java:497)
	... 31 more
[FINDBUGS] Skipping publisher since build result is FAILURE
[WARNINGS] Skipping publisher since build result is FAILURE
Archiving artifacts
Compressed 121.74 MB of artifacts by 79.8% relative to #1598
Recording test results
ERROR: Step ‘Publish JUnit test result report’ failed: Test reports were found but none
of them are new. Did tests run? 
For example, <https://builds.apache.org/job/POI/ws/build/excelant-test-results/TEST-org.apache.poi.ss.examples.formula.TestExcelAntUserDefinedFunction.xml>
is 17 hr old



---------------------------------------------------------------------
To unsubscribe, e-mail: dev-unsubscribe@poi.apache.org
For additional commands, e-mail: dev-help@poi.apache.org


Mime
View raw message