poi-dev mailing list archives

Site index · List index
Message view « Date » · « Thread »
Top « Date » · « Thread »
From Apache Jenkins Server <jenk...@builds.apache.org>
Subject Build failed in Jenkins: POI #1524
Date Wed, 14 Sep 2016 14:36:11 GMT
See <https://builds.apache.org/job/POI/1524/changes>

Changes:

[onealj] make logger final

[onealj] bug 60128: close opened resources to avoid leaks; add exception as cause where available
for more context for raised exceptions.

[onealj] give more helpful exceptions rather than returning null when zip file cannot be opened

[onealj] bug 60128: close open file descriptors when exceptions are thrown from OPCPackage.open

[nick] Unit test for bug #60128, showing that calling close on a broken package cleans up
file or stream

------------------------------------------
Started by an SCM change
[EnvInject] - Loading node environment variables.
Building remotely on ubuntu-4 (Ubuntu yahoo-not-h2 ubuntu ubuntu4 docker) in workspace <https://builds.apache.org/job/POI/ws/>
Updating http://svn.apache.org/repos/asf/poi/trunk at revision '2016-09-14T14:34:28.006 +0000'
AU        test-data/openxml4j/invalid.xlsx
U         src/java/org/apache/poi/ss/usermodel/CreationHelper.java
U         src/java/org/apache/poi/ss/usermodel/CellValue.java
U         src/java/org/apache/poi/ss/usermodel/Row.java
U         src/java/org/apache/poi/ss/usermodel/BorderFormatting.java
U         src/java/org/apache/poi/ss/usermodel/ClientAnchor.java
U         src/java/org/apache/poi/ss/usermodel/FormulaEvaluator.java
U         src/java/org/apache/poi/ss/usermodel/charts/DataSources.java
U         src/java/org/apache/poi/ss/usermodel/CellStyle.java
U         src/java/org/apache/poi/ss/usermodel/Cell.java
U         src/java/org/apache/poi/ss/formula/EvaluationCell.java
U         src/java/org/apache/poi/ss/formula/OperandClassTransformer.java
U         src/java/org/apache/poi/ss/formula/eval/forked/ForkedEvaluationCell.java
U         src/java/org/apache/poi/ss/formula/BaseFormulaEvaluator.java
U         src/java/org/apache/poi/ss/format/CellFormat.java
U         src/java/org/apache/poi/ss/util/CellUtil.java
U         src/java/org/apache/poi/common/usermodel/Hyperlink.java
U         src/java/org/apache/poi/hssf/usermodel/HSSFHyperlink.java
U         src/java/org/apache/poi/hssf/usermodel/HSSFBorderFormatting.java
U         src/java/org/apache/poi/hssf/usermodel/HSSFClientAnchor.java
U         src/java/org/apache/poi/hssf/usermodel/HSSFCell.java
U         src/java/org/apache/poi/hssf/usermodel/HSSFFormulaEvaluator.java
U         src/java/org/apache/poi/hssf/usermodel/HSSFCellStyle.java
U         src/java/org/apache/poi/hssf/usermodel/HSSFCreationHelper.java
U         src/java/org/apache/poi/hssf/usermodel/HSSFEvaluationCell.java
U         src/java/org/apache/poi/hssf/model/HSSFFormulaParser.java
U         src/java/org/apache/poi/sl/usermodel/SlideShow.java
U         src/scratchpad/src/org/apache/poi/hssf/converter/ExcelToFoConverter.java
U         src/scratchpad/src/org/apache/poi/hssf/converter/ExcelToHtmlConverter.java
U         src/scratchpad/src/org/apache/poi/hslf/usermodel/HSLFSlideShow.java
U         src/examples/src/org/apache/poi/hssf/view/SVTableCellRenderer.java
U         src/examples/src/org/apache/poi/ss/examples/ExcelComparator.java
U         src/examples/src/org/apache/poi/ss/examples/html/ToHtml.java
U         src/ooxml/testcases/org/apache/poi/openxml4j/opc/TestZipPackage.java
U         src/ooxml/testcases/org/apache/poi/openxml4j/opc/TestPackage.java
U         src/ooxml/testcases/org/apache/poi/poifs/crypt/TestSecureTempZip.java
U         src/ooxml/testcases/org/apache/poi/xssf/usermodel/TestMultiSheetFormulaEvaluatorOnXSSF.java
U         src/ooxml/testcases/org/apache/poi/xssf/usermodel/TestXSSFFormulaEvaluation.java
U         src/ooxml/testcases/org/apache/poi/xssf/usermodel/TestXSSFBugs.java
U         src/ooxml/testcases/org/apache/poi/xssf/usermodel/TestFormulaEvaluatorOnXSSF.java
U         src/ooxml/testcases/org/apache/poi/xssf/usermodel/TestXSSFCellStyle.java
U         src/ooxml/testcases/org/apache/poi/ss/formula/functions/TestProper.java
U         src/ooxml/testcases/org/apache/poi/ss/formula/TestStructuredReferences.java
U         src/ooxml/testcases/org/apache/poi/extractor/TestExtractorFactory.java
U         src/ooxml/java/org/apache/poi/xslf/usermodel/XSLFHyperlink.java
U         src/ooxml/java/org/apache/poi/xslf/usermodel/XMLSlideShow.java
U         src/ooxml/java/org/apache/poi/openxml4j/util/ZipInputStreamZipEntrySource.java
U         src/ooxml/java/org/apache/poi/openxml4j/util/ZipEntrySource.java
U         src/ooxml/java/org/apache/poi/openxml4j/util/ZipFileZipEntrySource.java
U         src/ooxml/java/org/apache/poi/openxml4j/util/ZipSecureFile.java
U         src/ooxml/java/org/apache/poi/openxml4j/opc/internal/ZipHelper.java
U         src/ooxml/java/org/apache/poi/openxml4j/opc/OPCPackage.java
U         src/ooxml/java/org/apache/poi/openxml4j/opc/ZipPackage.java
U         src/ooxml/java/org/apache/poi/xssf/usermodel/XSSFBorderFormatting.java
U         src/ooxml/java/org/apache/poi/xssf/usermodel/XSSFClientAnchor.java
U         src/ooxml/java/org/apache/poi/xssf/usermodel/XSSFFormulaEvaluator.java
U         src/ooxml/java/org/apache/poi/xssf/usermodel/XSSFEvaluationCell.java
U         src/ooxml/java/org/apache/poi/xssf/usermodel/XSSFCellStyle.java
U         src/ooxml/java/org/apache/poi/xssf/usermodel/XSSFCell.java
U         src/ooxml/java/org/apache/poi/xssf/usermodel/BaseXSSFFormulaEvaluator.java
U         src/ooxml/java/org/apache/poi/xssf/usermodel/XSSFCreationHelper.java
U         src/ooxml/java/org/apache/poi/xssf/usermodel/XSSFHyperlink.java
U         src/ooxml/java/org/apache/poi/xssf/streaming/SXSSFCell.java
U         src/ooxml/java/org/apache/poi/xssf/streaming/SXSSFCreationHelper.java
U         src/ooxml/java/org/apache/poi/xssf/streaming/SXSSFFormulaEvaluator.java
U         src/testcases/org/apache/poi/ss/util/BaseTestCellUtil.java
U         src/testcases/org/apache/poi/ss/usermodel/BaseTestBugzillaIssues.java
U         src/testcases/org/apache/poi/ss/usermodel/BaseTestCell.java
U         src/testcases/org/apache/poi/ss/usermodel/BaseTestFormulaEvaluator.java
U         src/testcases/org/apache/poi/ss/usermodel/BaseTestBorderStyle.java
U         src/testcases/org/apache/poi/ss/usermodel/BaseTestConditionalFormatting.java
U         src/testcases/org/apache/poi/ss/formula/TestWorkbookEvaluator.java
U         src/testcases/org/apache/poi/ss/formula/functions/TestIrr.java
U         src/testcases/org/apache/poi/ss/formula/functions/TestIndirect.java
U         src/testcases/org/apache/poi/ss/formula/functions/TestMirr.java
U         src/testcases/org/apache/poi/ss/formula/functions/TestClean.java
U         src/testcases/org/apache/poi/ss/formula/functions/TestFind.java
U         src/testcases/org/apache/poi/ss/formula/functions/TestCalendarFieldFunction.java
U         src/testcases/org/apache/poi/ss/formula/functions/TestDate.java
U         src/testcases/org/apache/poi/ss/formula/functions/BaseTestFunctionsFromSpreadsheet.java
U         src/testcases/org/apache/poi/ss/formula/functions/TestAddress.java
U         src/testcases/org/apache/poi/ss/formula/functions/TestFixed.java
U         src/testcases/org/apache/poi/ss/formula/functions/TestIsBlank.java
U         src/testcases/org/apache/poi/ss/formula/atp/TestIfError.java
U         src/testcases/org/apache/poi/ss/formula/eval/TestFormulaBugs.java
U         src/testcases/org/apache/poi/ss/formula/eval/TestMultiSheetEval.java
U         src/testcases/org/apache/poi/ss/formula/eval/BaseTestCircularReferences.java
U         src/testcases/org/apache/poi/ss/formula/eval/TestFormulasFromSpreadsheet.java
U         src/testcases/org/apache/poi/ss/formula/eval/TestPercentEval.java
U         src/testcases/org/apache/poi/hssf/record/TestSharedFormulaRecord.java
U         src/testcases/org/apache/poi/hssf/usermodel/TestHSSFOptimiser.java
U         src/testcases/org/apache/poi/hssf/usermodel/TestHSSFFormulaEvaluator.java
U         src/testcases/org/apache/poi/hssf/usermodel/TestRowStyle.java
U         src/testcases/org/apache/poi/hssf/usermodel/TestBugs.java
U         src/testcases/org/apache/poi/hssf/usermodel/TestCellStyle.java
U         src/testcases/org/apache/poi/hssf/model/TestFormulaParserEval.java
Fetching 'https://svn.apache.org/repos/asf/poi/site/forrest.properties' at -1 into '<https://builds.apache.org/job/POI/ws/forrest.properties'>
At revision 1760715

Fetching 'https://svn.apache.org/repos/asf/poi/site/src/documentation' at -1 into '<https://builds.apache.org/job/POI/ws/src/documentation'>
At revision 1760715

At revision 1760715

No changes for http://svn.apache.org/repos/asf/poi/site/forrest.properties since the previous
build
No changes for https://svn.apache.org/repos/asf/poi/site/src/documentation since the previous
build
[EnvInject] - Executing scripts and injecting environment variables after the SCM step.
[EnvInject] - Injecting as environment variables the properties content 
LANG=en_US.UTF-8

[EnvInject] - Variables injected successfully.
[POI] $ /bin/bash -xe /tmp/hudson4500319961871258130.sh
+ svn status
    X   forrest.properties
X       src/documentation

Performing status on external item at 'src/documentation':
+ exit 0
[POI] $ /home/jenkins/tools/ant/latest/bin/ant -Dcoverage.enabled=true clean jenkins
Buildfile: <https://builds.apache.org/job/POI/ws/build.xml>

clean:
   [delete] Deleting directory <https://builds.apache.org/job/POI/ws/build>

check-jars:

fetch-jars:

check-ooxml-jars:

fetch-ooxml-jars:

init:
    [mkdir] Created dir: <https://builds.apache.org/job/POI/ws/build>
    [mkdir] Created dir: <https://builds.apache.org/job/POI/ws/build/classes>
    [mkdir] Created dir: <https://builds.apache.org/job/POI/ws/build/test-classes>
    [mkdir] Created dir: <https://builds.apache.org/job/POI/ws/build/test-results>
    [mkdir] Created dir: <https://builds.apache.org/job/POI/ws/build/scratchpad-classes>
    [mkdir] Created dir: <https://builds.apache.org/job/POI/ws/build/scratchpad-test-classes>
    [mkdir] Created dir: <https://builds.apache.org/job/POI/ws/build/scratchpad-test-results>
    [mkdir] Created dir: <https://builds.apache.org/job/POI/ws/build/geometry-java>
    [mkdir] Created dir: <https://builds.apache.org/job/POI/ws/build/ooxml-classes>
    [mkdir] Created dir: <https://builds.apache.org/job/POI/ws/build/ooxml-test-classes>
    [mkdir] Created dir: <https://builds.apache.org/job/POI/ws/build/ooxml-test-results>
    [mkdir] Created dir: <https://builds.apache.org/job/POI/ws/build/excelant-classes>
    [mkdir] Created dir: <https://builds.apache.org/job/POI/ws/build/excelant-test-classes>
    [mkdir] Created dir: <https://builds.apache.org/job/POI/ws/build/excelant-test-results>
    [mkdir] Created dir: <https://builds.apache.org/job/POI/ws/build/examples-classes>
    [mkdir] Created dir: <https://builds.apache.org/job/POI/ws/build/integration-test-classes>
    [mkdir] Created dir: <https://builds.apache.org/job/POI/1524/artifact/build/integration-test-results>
    [mkdir] Created dir: <https://builds.apache.org/job/POI/ws/build/dist>
    [mkdir] Created dir: <https://builds.apache.org/job/POI/ws/build/tmp/site/build/site>
     [echo] Using Ant: Apache Ant(TM) version 1.9.7 compiled on April 9 2016 from /home/jenkins/tools/ant/latest,
Ant detected Java 1.6 (may be different than actual Java sometimes...)
     [echo] Using Java: 1.6.0_45/1.6.0_45-b06/20.45-b01/Java HotSpot(TM) 64-Bit Server VM
from Sun Microsystems Inc. on Linux: 3.13.0-36-lowlatency
     [echo] Using Findbugs: 2.0.3 for Java 1.6.0_45

compile-main:
    [javac] Compiling 1190 source files to <https://builds.apache.org/job/POI/ws/build/classes>
    [javac] Note: Some input files use or override a deprecated API.
    [javac] Note: Recompile with -Xlint:deprecation for details.
    [javac] Note: <https://builds.apache.org/job/POI/ws/src/java/org/apache/poi/hpsf/CustomProperties.java>
uses unchecked or unsafe operations.
    [javac] Note: Recompile with -Xlint:unchecked for details.
    [javac] Compiling 530 source files to <https://builds.apache.org/job/POI/ws/build/test-classes>
    [javac] Note: Some input files use or override a deprecated API.
    [javac] Note: Recompile with -Xlint:deprecation for details.
    [javac] Note: <https://builds.apache.org/job/POI/ws/src/testcases/org/apache/poi/util/LocalTestNode.java>
uses unchecked or unsafe operations.
    [javac] Note: Recompile with -Xlint:unchecked for details.
     [copy] Copying 4 files to <https://builds.apache.org/job/POI/ws/build/classes>

check-ooxml-xsds:

fetch-ooxml-xsds:

generate-geometry:

compile-scratchpad:
    [javac] Compiling 466 source files to <https://builds.apache.org/job/POI/ws/build/scratchpad-classes>
    [javac] Note: Some input files use or override a deprecated API.
    [javac] Note: Recompile with -Xlint:deprecation for details.
    [javac] Compiling 185 source files to <https://builds.apache.org/job/POI/ws/build/scratchpad-test-classes>
    [javac] Note: Some input files use or override a deprecated API.
    [javac] Note: Recompile with -Xlint:deprecation for details.
     [copy] Copying 2 files to <https://builds.apache.org/job/POI/ws/build/scratchpad-classes>

check-compiled-ooxml-xsds:

compile-ooxml-xsds:

compile-ooxml:
    [javac] Compiling 409 source files to <https://builds.apache.org/job/POI/ws/build/ooxml-classes>
    [javac] <https://builds.apache.org/job/POI/ws/src/ooxml/java/org/apache/poi/openxml4j/opc/ZipPackage.java>:102:
cannot find symbol
    [javac] symbol  : method addSuppressed(java.io.IOException)
    [javac] location: class java.io.IOException
    [javac]                 e2.addSuppressed(e);
    [javac]                   ^
    [javac] Note: Some input files use or override a deprecated API.
    [javac] Note: Recompile with -Xlint:deprecation for details.
    [javac] 1 error

BUILD FAILED
<https://builds.apache.org/job/POI/ws/build.xml>:992: Compile failed; see the compiler
error output for details.

Total time: 53 seconds
Build step 'Invoke Ant' marked build as failure
[FINDBUGS] Skipping publisher since build result is FAILURE
[WARNINGS] Skipping publisher since build result is FAILURE
Archiving artifacts
Compressed 66.31 MB of artifacts by 65.3% relative to #1523
Recording test results
ERROR: Step ?Publish JUnit test result report? failed: No test report files were found. Configuration
error?


---------------------------------------------------------------------
To unsubscribe, e-mail: dev-unsubscribe@poi.apache.org
For additional commands, e-mail: dev-help@poi.apache.org


Mime
View raw message