poi-dev mailing list archives

Site index · List index
Message view « Date » · « Thread »
Top « Date » · « Thread »
From Apache Jenkins Server <jenk...@builds.apache.org>
Subject Build failed in Jenkins: POI #1486
Date Mon, 01 Aug 2016 00:40:29 GMT
See <https://builds.apache.org/job/POI/1486/changes>

Changes:

[nick] Javadoc fixes

[nick] Remove svn merge parts

[jmarkmurphy] Add new class Cell Style Template and supporting enum for drawing borders

------------------------------------------
[...truncated 840 lines...]
    [junit] Tests run: 6, Failures: 0, Errors: 0, Skipped: 0, Time elapsed: 0.044 sec
    [junit] Running org.apache.poi.ss.formula.eval.TestExternalFunction
    [junit] Tests run: 1, Failures: 0, Errors: 0, Skipped: 0, Time elapsed: 0.008 sec
    [junit] Running org.apache.poi.ss.formula.eval.TestFormulaBugs
    [junit] Tests run: 4, Failures: 0, Errors: 0, Skipped: 0, Time elapsed: 0.027 sec
    [junit] Running org.apache.poi.ss.formula.eval.TestFormulasFromSpreadsheet
    [junit] Tests run: 379, Failures: 0, Errors: 0, Skipped: 0, Time elapsed: 3.454 sec
    [junit] Running org.apache.poi.ss.formula.eval.TestHSSFCircularReferences
    [junit] Tests run: 4, Failures: 0, Errors: 0, Skipped: 0, Time elapsed: 0.027 sec
    [junit] Running org.apache.poi.ss.formula.eval.TestMinusZeroResult
    [junit] Tests run: 4, Failures: 0, Errors: 0, Skipped: 0, Time elapsed: 0.024 sec
    [junit] Running org.apache.poi.ss.formula.eval.TestMissingArgEval
    [junit] Warning - Row 13 has no cell 1, can't figure out test name
    [junit] Tests run: 2, Failures: 0, Errors: 0, Skipped: 0, Time elapsed: 0.013 sec
    [junit] Running org.apache.poi.ss.formula.eval.TestMultiSheetEval
    [junit] Tests run: 1, Failures: 0, Errors: 0, Skipped: 0, Time elapsed: 0.006 sec
    [junit] Running org.apache.poi.ss.formula.eval.TestOperandResolver
    [junit] Tests run: 4, Failures: 0, Errors: 0, Skipped: 0, Time elapsed: 0.023 sec
    [junit] Running org.apache.poi.ss.formula.eval.TestPercentEval
    [junit] Tests run: 3, Failures: 0, Errors: 0, Skipped: 0, Time elapsed: 0.156 sec
    [junit] Running org.apache.poi.ss.formula.eval.TestRangeEval
    [junit] Tests run: 2, Failures: 0, Errors: 0, Skipped: 0, Time elapsed: 0.108 sec
    [junit] Running org.apache.poi.ss.formula.eval.TestUnaryPlusEval
    [junit] Tests run: 1, Failures: 0, Errors: 0, Skipped: 0, Time elapsed: 0.019 sec
    [junit] Running org.apache.poi.ss.formula.eval.forked.TestForkedEvaluator
    [junit] Tests run: 2, Failures: 0, Errors: 0, Skipped: 0, Time elapsed: 0.013 sec
    [junit] Running org.apache.poi.ss.formula.function.TestFunctionMetadataRegistry
    [junit] Tests run: 1, Failures: 0, Errors: 0, Skipped: 0, Time elapsed: 0.003 sec
    [junit] Running org.apache.poi.ss.formula.function.TestParseMissingBuiltInFuncs
    [junit] Tests run: 7, Failures: 0, Errors: 0, Skipped: 0, Time elapsed: 0.054 sec
    [junit] Running org.apache.poi.ss.formula.function.TestReadMissingBuiltInFuncs
    [junit] Tests run: 7, Failures: 0, Errors: 0, Skipped: 0, Time elapsed: 0.055 sec
    [junit] Running org.apache.poi.ss.formula.functions.TestAddress
    [junit] Tests run: 1, Failures: 0, Errors: 0, Skipped: 0, Time elapsed: 0.005 sec
    [junit] Running org.apache.poi.ss.formula.functions.TestAverage
    [junit] Tests run: 3, Failures: 0, Errors: 0, Skipped: 0, Time elapsed: 0.033 sec
    [junit] Running org.apache.poi.ss.formula.functions.TestBin2Dec
    [junit] Tests run: 5, Failures: 0, Errors: 0, Skipped: 0, Time elapsed: 0.036 sec
    [junit] Running org.apache.poi.ss.formula.functions.TestCalendarFieldFunction
    [junit] Tests run: 4, Failures: 0, Errors: 0, Skipped: 0, Time elapsed: 0.025 sec
    [junit] Running org.apache.poi.ss.formula.functions.TestClean
    [junit] Tests run: 1, Failures: 0, Errors: 0, Skipped: 0, Time elapsed: 0.004 sec
    [junit] Running org.apache.poi.ss.formula.functions.TestCode
    [junit] Tests run: 2, Failures: 0, Errors: 0, Skipped: 0, Time elapsed: 0.011 sec
    [junit] Running org.apache.poi.ss.formula.functions.TestCodeFunctionsFromSpreadsheet
    [junit] Tests run: 4, Failures: 0, Errors: 0, Skipped: 0, Time elapsed: 0.026 sec
    [junit] Running org.apache.poi.ss.formula.functions.TestComplex
    [junit] Tests run: 2, Failures: 0, Errors: 0, Skipped: 0, Time elapsed: 0.012 sec
    [junit] Running org.apache.poi.ss.formula.functions.TestComplexFunctionsFromSpreadsheet
    [junit] Tests run: 12, Failures: 0, Errors: 0, Skipped: 0, Time elapsed: 0.095 sec
    [junit] Running org.apache.poi.ss.formula.functions.TestCountFuncs
    [junit] Tests run: 16, Failures: 0, Errors: 0, Skipped: 0, Time elapsed: 0.134 sec
    [junit] Running org.apache.poi.ss.formula.functions.TestDGetFunctionsFromSpreadsheet
    [junit] Tests run: 66, Failures: 0, Errors: 0, Skipped: 0, Time elapsed: 0.583 sec
    [junit] Running org.apache.poi.ss.formula.functions.TestDStarFunctionsFromSpreadsheet
    [junit] Tests run: 4, Failures: 0, Errors: 0, Skipped: 0, Time elapsed: 0.02 sec
    [junit] Running org.apache.poi.ss.formula.functions.TestDate
    [junit] Tests run: 3, Failures: 0, Errors: 0, Skipped: 0, Time elapsed: 0.021 sec
    [junit] Running org.apache.poi.ss.formula.functions.TestDays360
    [junit] Tests run: 2, Failures: 0, Errors: 0, Skipped: 0, Time elapsed: 0.024 sec
    [junit] Running org.apache.poi.ss.formula.functions.TestDec2Bin
    [junit] Tests run: 15, Failures: 0, Errors: 0, Skipped: 0, Time elapsed: 0.16 sec
    [junit] Running org.apache.poi.ss.formula.functions.TestDec2Hex
    [junit] Tests run: 12, Failures: 0, Errors: 0, Skipped: 0, Time elapsed: 0.166 sec
    [junit] Running org.apache.poi.ss.formula.functions.TestDelta
    [junit] Tests run: 2, Failures: 0, Errors: 0, Skipped: 0, Time elapsed: 0.013 sec
    [junit] Running org.apache.poi.ss.formula.functions.TestDeltaFunctionsFromSpreadsheet
    [junit] Tests run: 7, Failures: 0, Errors: 0, Skipped: 0, Time elapsed: 0.052 sec
    [junit] Running org.apache.poi.ss.formula.functions.TestEDate
    [junit] Tests run: 9, Failures: 0, Errors: 0, Skipped: 0, Time elapsed: 0.065 sec
    [junit] Running org.apache.poi.ss.formula.functions.TestEOMonth
    [junit] Tests run: 9, Failures: 0, Errors: 0, Skipped: 0, Time elapsed: 0.068 sec
    [junit] Running org.apache.poi.ss.formula.functions.TestFactDoubleFunctionsFromSpreadsheet
    [junit] Tests run: 8, Failures: 0, Errors: 0, Skipped: 0, Time elapsed: 0.059 sec
    [junit] Running org.apache.poi.ss.formula.functions.TestFinanceLib
    [junit] Tests run: 5, Failures: 0, Errors: 0, Skipped: 0, Time elapsed: 0.038 sec
    [junit] Running org.apache.poi.ss.formula.functions.TestFind
    [junit] Tests run: 1, Failures: 0, Errors: 0, Skipped: 0, Time elapsed: 0.006 sec
    [junit] Running org.apache.poi.ss.formula.functions.TestFixed
    [junit] Tests run: 2, Failures: 0, Errors: 0, Skipped: 0, Time elapsed: 0.012 sec
    [junit] Running org.apache.poi.ss.formula.functions.TestFixedFunctionsFromSpreadsheet
    [junit] Tests run: 20, Failures: 0, Errors: 0, Skipped: 0, Time elapsed: 0.16 sec
    [junit] Running org.apache.poi.ss.formula.functions.TestHex2Dec
    [junit] Tests run: 5, Failures: 0, Errors: 0, Skipped: 0, Time elapsed: 0.038 sec
    [junit] Running org.apache.poi.ss.formula.functions.TestIPMT
    [junit] Tests run: 1, Failures: 0, Errors: 0, Skipped: 0, Time elapsed: 0.007 sec
    [junit] Running org.apache.poi.ss.formula.functions.TestImRealFunctionsFromSpreadsheet
    [junit] Tests run: 7, Failures: 0, Errors: 0, Skipped: 0, Time elapsed: 0.05 sec
    [junit] Running org.apache.poi.ss.formula.functions.TestImaginaryFunctionsFromSpreadsheet
    [junit] Tests run: 7, Failures: 0, Errors: 0, Skipped: 0, Time elapsed: 0.053 sec
    [junit] Running org.apache.poi.ss.formula.functions.TestIndex
    [junit] Tests run: 3, Failures: 0, Errors: 0, Skipped: 0, Time elapsed: 0.033 sec
    [junit] Running org.apache.poi.ss.formula.functions.TestIndexFunctionFromSpreadsheet
    [junit] Tests run: 98, Failures: 0, Errors: 0, Skipped: 0, Time elapsed: 0.974 sec
    [junit] Running org.apache.poi.ss.formula.functions.TestIndirect
    [junit] Tests run: 3, Failures: 0, Errors: 0, Skipped: 0, Time elapsed: 0.044 sec
    [junit] Running org.apache.poi.ss.formula.functions.TestIndirectFunctionFromSpreadsheet
    [junit] Tests run: 11, Failures: 0, Errors: 0, Skipped: 0, Time elapsed: 0.078 sec
    [junit] Running org.apache.poi.ss.formula.functions.TestIntercept
    [junit] Tests run: 4, Failures: 0, Errors: 0, Skipped: 0, Time elapsed: 0.041 sec
    [junit] Running org.apache.poi.ss.formula.functions.TestIrr
    [junit] Tests run: 3, Failures: 0, Errors: 0, Skipped: 0, Time elapsed: 0.018 sec
    [junit] Running org.apache.poi.ss.formula.functions.TestIsBlank
    [junit] Tests run: 1, Failures: 0, Errors: 0, Skipped: 0, Time elapsed: 0.002 sec
    [junit] Running org.apache.poi.ss.formula.functions.TestLeftRight
    [junit] Tests run: 2, Failures: 0, Errors: 0, Skipped: 0, Time elapsed: 0.012 sec
    [junit] Running org.apache.poi.ss.formula.functions.TestLen
    [junit] Tests run: 3, Failures: 0, Errors: 0, Skipped: 0, Time elapsed: 0.027 sec
    [junit] Running org.apache.poi.ss.formula.functions.TestLogicalFunction
    [junit] Tests run: 2, Failures: 0, Errors: 0, Skipped: 0, Time elapsed: 0.03 sec
    [junit] Running org.apache.poi.ss.formula.functions.TestLookupFunctionsFromSpreadsheet
    [junit] Tests run: 199, Failures: 0, Errors: 0, Skipped: 0, Time elapsed: 1.835 sec
    [junit] Running org.apache.poi.ss.formula.functions.TestMatch
    [junit] Tests run: 9, Failures: 0, Errors: 0, Skipped: 0, Time elapsed: 0.076 sec
    [junit] Running org.apache.poi.ss.formula.functions.TestMatchFunctionsFromSpreadsheet
    [junit] Tests run: 13, Failures: 0, Errors: 0, Skipped: 0, Time elapsed: 0.102 sec
    [junit] Running org.apache.poi.ss.formula.functions.TestMathX
    [junit] Tests run: 23, Failures: 0, Errors: 0, Skipped: 0, Time elapsed: 0.177 sec
    [junit] Running org.apache.poi.ss.formula.functions.TestMid
    [junit] Tests run: 4, Failures: 0, Errors: 0, Skipped: 0, Time elapsed: 0.029 sec
    [junit] Running org.apache.poi.ss.formula.functions.TestMirr
    [junit] Tests run: 4, Failures: 0, Errors: 0, Skipped: 0, Time elapsed: 0.029 sec
    [junit] Running org.apache.poi.ss.formula.functions.TestNper
    [junit] Tests run: 2, Failures: 0, Errors: 0, Skipped: 0, Time elapsed: 0.013 sec
    [junit] Running org.apache.poi.ss.formula.functions.TestNpv
    [junit] Tests run: 2, Failures: 0, Errors: 0, Skipped: 0, Time elapsed: 0.014 sec
    [junit] Running org.apache.poi.ss.formula.functions.TestOct2Dec
    [junit] Tests run: 2, Failures: 0, Errors: 0, Skipped: 0, Time elapsed: 0.012 sec
    [junit] Running org.apache.poi.ss.formula.functions.TestOffset
    [junit] Tests run: 2, Failures: 0, Errors: 0, Skipped: 0, Time elapsed: 0.013 sec
    [junit] Running org.apache.poi.ss.formula.functions.TestPPMT
    [junit] Tests run: 1, Failures: 0, Errors: 0, Skipped: 0, Time elapsed: 0.007 sec
    [junit] Running org.apache.poi.ss.formula.functions.TestPmt
    [junit] Tests run: 2, Failures: 0, Errors: 0, Skipped: 0, Time elapsed: 0.011 sec
    [junit] Running org.apache.poi.ss.formula.functions.TestPoisson
    [junit] Tests run: 6, Failures: 0, Errors: 0, Skipped: 0, Time elapsed: 0.057 sec
    [junit] Running org.apache.poi.ss.formula.functions.TestQuotient
    [junit] Tests run: 2, Failures: 0, Errors: 0, Skipped: 0, Time elapsed: 0.006 sec
    [junit] Running org.apache.poi.ss.formula.functions.TestQuotientFunctionsFromSpreadsheet
    [junit] Tests run: 8, Failures: 0, Errors: 0, Skipped: 0, Time elapsed: 0.087 sec
    [junit] Running org.apache.poi.ss.formula.functions.TestRank
    [junit] Tests run: 1, Failures: 0, Errors: 0, Skipped: 0, Time elapsed: 0.011 sec
    [junit] Running org.apache.poi.ss.formula.functions.TestReptFunctionsFromSpreadsheet
    [junit] Tests run: 5, Failures: 0, Errors: 0, Skipped: 0, Time elapsed: 0.038 sec
    [junit] Running org.apache.poi.ss.formula.functions.TestRomanFunctionsFromSpreadsheet
    [junit] Tests run: 35, Failures: 0, Errors: 0, Skipped: 0, Time elapsed: 0.305 sec
    [junit] Running org.apache.poi.ss.formula.functions.TestRoundFuncs
    [junit] Tests run: 2, Failures: 0, Errors: 0, Skipped: 0, Time elapsed: 0.012 sec
    [junit] Running org.apache.poi.ss.formula.functions.TestRowCol
    [junit] Tests run: 4, Failures: 0, Errors: 0, Skipped: 0, Time elapsed: 0.029 sec
    [junit] Running org.apache.poi.ss.formula.functions.TestSlope
    [junit] Tests run: 3, Failures: 0, Errors: 0, Skipped: 0, Time elapsed: 0.022 sec
    [junit] Running org.apache.poi.ss.formula.functions.TestStatsLib
    [junit] Tests run: 9, Failures: 0, Errors: 0, Skipped: 0, Time elapsed: 0.079 sec
    [junit] Running org.apache.poi.ss.formula.functions.TestSubtotal
    [junit] Tests run: 11, Failures: 0, Errors: 0, Skipped: 0, Time elapsed: 0.133 sec
    [junit] Running org.apache.poi.ss.formula.functions.TestSumif
    [junit] Tests run: 3, Failures: 0, Errors: 0, Skipped: 0, Time elapsed: 0.017 sec
    [junit] Running org.apache.poi.ss.formula.functions.TestSumifs
    [junit] Tests run: 7, Failures: 0, Errors: 0, Skipped: 0, Time elapsed: 0.105 sec
    [junit] Running org.apache.poi.ss.formula.functions.TestSumproduct
    [junit] Tests run: 5, Failures: 0, Errors: 0, Skipped: 0, Time elapsed: 0.035 sec
    [junit] Running org.apache.poi.ss.formula.functions.TestTFunc
    [junit] Tests run: 5, Failures: 0, Errors: 0, Skipped: 0, Time elapsed: 0.038 sec
    [junit] Running org.apache.poi.ss.formula.functions.TestText
    [junit] Tests run: 4, Failures: 0, Errors: 0, Skipped: 0, Time elapsed: 0.03 sec
    [junit] Running org.apache.poi.ss.formula.functions.TestTime
    [junit] Tests run: 2, Failures: 0, Errors: 0, Skipped: 0, Time elapsed: 0.013 sec
    [junit] Running org.apache.poi.ss.formula.functions.TestTrim
    [junit] Tests run: 3, Failures: 0, Errors: 0, Skipped: 0, Time elapsed: 0.021 sec
    [junit] Running org.apache.poi.ss.formula.functions.TestTrunc
    [junit] Tests run: 5, Failures: 0, Errors: 0, Skipped: 0, Time elapsed: 0.051 sec
    [junit] Running org.apache.poi.ss.formula.functions.TestValue
    [junit] Tests run: 2, Failures: 0, Errors: 0, Skipped: 0, Time elapsed: 0.016 sec
    [junit] Running org.apache.poi.ss.formula.functions.TestWeekNumFunctionsFromSpreadsheet
    [junit] Tests run: 7, Failures: 0, Errors: 0, Skipped: 0, Time elapsed: 0.055 sec
    [junit] Running org.apache.poi.ss.formula.functions.TestWeekNumFunctionsFromSpreadsheet2013
    [junit] Tests run: 7, Failures: 0, Errors: 0, Skipped: 0, Time elapsed: 0.085 sec
    [junit] Running org.apache.poi.ss.formula.functions.TestXYNumericFunction
    [junit] Tests run: 3, Failures: 0, Errors: 0, Skipped: 0, Time elapsed: 0.023 sec
    [junit] Running org.apache.poi.ss.formula.ptg.TestArea3DPtg
    [junit] Tests run: 1, Failures: 0, Errors: 0, Skipped: 0, Time elapsed: 0.004 sec
    [junit] Running org.apache.poi.ss.formula.ptg.TestAreaErrPtg
    [junit] Tests run: 1, Failures: 0, Errors: 0, Skipped: 0, Time elapsed: 0.006 sec
    [junit] Running org.apache.poi.ss.formula.ptg.TestAreaPtg
    [junit] Tests run: 5, Failures: 0, Errors: 0, Skipped: 0, Time elapsed: 0.042 sec
    [junit] Running org.apache.poi.ss.formula.ptg.TestArrayPtg
    [junit] Tests run: 5, Failures: 0, Errors: 0, Skipped: 0, Time elapsed: 0.042 sec
    [junit] Running org.apache.poi.ss.formula.ptg.TestAttrPtg
    [junit] Tests run: 1, Failures: 0, Errors: 0, Skipped: 0, Time elapsed: 0.003 sec
    [junit] Running org.apache.poi.ss.formula.ptg.TestErrPtg
    [junit] Tests run: 1, Failures: 0, Errors: 0, Skipped: 0, Time elapsed: 0.008 sec
    [junit] Running org.apache.poi.ss.formula.ptg.TestExternalFunctionFormulas
    [junit] Tests run: 3, Failures: 0, Errors: 0, Skipped: 0, Time elapsed: 0.023 sec
    [junit] Running org.apache.poi.ss.formula.ptg.TestExternalNameReference
    [junit] Tests run: 3, Failures: 0, Errors: 0, Skipped: 0, Time elapsed: 0.021 sec
    [junit] Running org.apache.poi.ss.formula.ptg.TestFuncPtg
    [junit] Tests run: 2, Failures: 0, Errors: 0, Skipped: 0, Time elapsed: 0.013 sec
    [junit] Running org.apache.poi.ss.formula.ptg.TestFuncVarPtg
    [junit] Tests run: 1, Failures: 0, Errors: 0, Skipped: 0, Time elapsed: 0.005 sec
    [junit] Running org.apache.poi.ss.formula.ptg.TestIntersectionPtg
    [junit] Tests run: 1, Failures: 0, Errors: 0, Skipped: 0, Time elapsed: 0.006 sec
    [junit] Running org.apache.poi.ss.formula.ptg.TestPercentPtg
    [junit] Tests run: 1, Failures: 0, Errors: 0, Skipped: 0, Time elapsed: 0.005 sec
    [junit] Running org.apache.poi.ss.formula.ptg.TestRangePtg
    [junit] Tests run: 1, Failures: 0, Errors: 0, Skipped: 0, Time elapsed: 0.006 sec
    [junit] Running org.apache.poi.ss.formula.ptg.TestRef3DPtg
    [junit] Tests run: 1, Failures: 0, Errors: 0, Skipped: 0, Time elapsed: 0.005 sec
    [junit] Running org.apache.poi.ss.formula.ptg.TestReferencePtg
    [junit] Tests run: 4, Failures: 0, Errors: 0, Skipped: 0, Time elapsed: 0.03 sec
    [junit] Running org.apache.poi.ss.formula.ptg.TestUnionPtg
    [junit] Tests run: 1, Failures: 0, Errors: 0, Skipped: 0, Time elapsed: 0.006 sec
    [junit] Running org.apache.poi.ss.formula.udf.TestAggregatingUDFFinder
    [junit] Tests run: 2, Failures: 0, Errors: 0, Skipped: 0, Time elapsed: 0.012 sec
    [junit] Running org.apache.poi.ss.formula.udf.TestDefaultUDFFinder
    [junit] Tests run: 1, Failures: 0, Errors: 0, Skipped: 0, Time elapsed: 0.005 sec
    [junit] Running org.apache.poi.ss.usermodel.TestDataFormatter
    [junit] Tests run: 25, Failures: 0, Errors: 0, Skipped: 1, Time elapsed: 0.21 sec
    [junit] Running org.apache.poi.ss.usermodel.TestDateUtil
    [junit] Tests run: 4, Failures: 0, Errors: 0, Skipped: 0, Time elapsed: 0.03 sec
    [junit] Running org.apache.poi.ss.usermodel.TestFractionFormat
    [junit] Tests run: 2, Failures: 0, Errors: 0, Skipped: 0, Time elapsed: 0.251 sec
    [junit] Running org.apache.poi.ss.usermodel.TestHSSFBorderStyle
    [junit] Tests run: 1, Failures: 0, Errors: 0, Skipped: 0, Time elapsed: 0.015 sec
    [junit] Running org.apache.poi.ss.usermodel.TestIndexedColors
    [junit] Tests run: 3, Failures: 0, Errors: 0, Skipped: 0, Time elapsed: 0.021 sec
    [junit] Running org.apache.poi.ss.usermodel.charts.TestDataSources
    [junit] Tests run: 6, Failures: 0, Errors: 0, Skipped: 0, Time elapsed: 0.046 sec
    [junit] Running org.apache.poi.ss.util.TestAreaReference
    [junit] Tests run: 3, Failures: 0, Errors: 0, Skipped: 0, Time elapsed: 0.021 sec
    [junit] Running org.apache.poi.ss.util.TestCellAddress
    [junit] Tests run: 6, Failures: 0, Errors: 0, Skipped: 0, Time elapsed: 0.045 sec
    [junit] Running org.apache.poi.ss.util.TestCellRangeAddress
    [junit] Tests run: 13, Failures: 0, Errors: 0, Skipped: 0, Time elapsed: 0.118 sec
    [junit] Running org.apache.poi.ss.util.TestCellReference
    [junit] Tests run: 23, Failures: 0, Errors: 0, Skipped: 0, Time elapsed: 0.187 sec
    [junit] Running org.apache.poi.ss.util.TestCellStyleTemplate
    [junit] Tests run: 7, Failures: 4, Errors: 0, Skipped: 0, Time elapsed: 0.054 sec

BUILD FAILED
<https://builds.apache.org/job/POI/ws/build.xml>:1250: Tests failed

Total time: 5 minutes 33 seconds
Build step 'Invoke Ant' marked build as failure
[FINDBUGS] Skipping publisher since build result is FAILURE
[WARNINGS] Skipping publisher since build result is FAILURE
Archiving artifacts
Compressed 67.03 MB of artifacts by 65.7% relative to #1484
Recording test results

---------------------------------------------------------------------
To unsubscribe, e-mail: dev-unsubscribe@poi.apache.org
For additional commands, e-mail: dev-help@poi.apache.org


Mime
View raw message