poi-dev mailing list archives

Site index · List index
Message view « Date » · « Thread »
Top « Date » · « Thread »
From Apache Jenkins Server <jenk...@builds.apache.org>
Subject Build failed in Jenkins: POI-JDK8 #1155
Date Sun, 17 Jul 2016 12:15:23 GMT
See <https://builds.apache.org/job/POI-JDK8/1155/changes>

Changes:

[onealj] bug 59873: add @Internal and @Deprecated decorators to HyperlinkType enum

[onealj] bug 59264,59833,59837: upgrade deprecated methods in examples and testcases

[onealj] bug 59264,59833,59837: upgrade deprecated methods in examples and testcases

[onealj] update changelog for bugs 59791 59837 59873 under the umbrella of bug 59836

[onealj] close workbook to avoid resource leak

[onealj] bug 59170: remove deprecated constants, make private variables final, whitespace

[onealj] HexDump.writeHex is similar to Long#toHexString. Consider consolidating.

------------------------------------------
Started by an SCM change
[EnvInject] - Loading node environment variables.
Building remotely on ubuntu-2 (docker Ubuntu ubuntu yahoo-not-h2) in workspace <https://builds.apache.org/job/POI-JDK8/ws/>
Updating http://svn.apache.org/repos/asf/poi/trunk at revision '2016-07-17T12:13:39.888 +0000'
U         src/java/org/apache/poi/util/HexDump.java
U         src/java/org/apache/poi/common/usermodel/HyperlinkType.java
U         src/scratchpad/src/org/apache/poi/hssf/converter/AbstractExcelUtils.java
U         src/scratchpad/src/org/apache/poi/hwpf/sprm/SprmOperation.java
U         src/examples/src/org/apache/poi/hssf/view/SVTableCellEditor.java
U         src/examples/src/org/apache/poi/hssf/view/SVTableCellRenderer.java
U         src/examples/src/org/apache/poi/hssf/usermodel/examples/Alignment.java
U         src/examples/src/org/apache/poi/xssf/usermodel/examples/AligningCells.java
U         src/examples/src/org/apache/poi/xssf/usermodel/examples/BigGridDemo.java
U         src/examples/src/org/apache/poi/xssf/usermodel/examples/HyperlinkExample.java
U         src/examples/src/org/apache/poi/ss/examples/CalendarDemo.java
U         src/examples/src/org/apache/poi/ss/examples/LoanCalculator.java
U         src/examples/src/org/apache/poi/ss/examples/html/ToHtml.java
U         src/examples/src/org/apache/poi/ss/examples/BusinessPlan.java
U         src/examples/src/org/apache/poi/ss/examples/SSPerformanceTest.java
U         src/examples/src/org/apache/poi/ss/examples/AligningCells.java
U         src/examples/src/org/apache/poi/ss/examples/TimesheetDemo.java
U         src/testcases/org/apache/poi/ss/util/BaseTestCellUtil.java
U         src/testcases/org/apache/poi/ss/usermodel/BaseTestDataValidation.java
Fetching 'https://svn.apache.org/repos/asf/poi/site/src/documentation' at -1 into '<https://builds.apache.org/job/POI-JDK8/ws/src/documentation'>
U         src/documentation/content/xdocs/status.xml
At revision 1753064

Fetching 'https://svn.apache.org/repos/asf/poi/site/forrest.properties' at -1 into '<https://builds.apache.org/job/POI-JDK8/ws/forrest.properties'>
At revision 1753064

At revision 1753064

WARNING: clock of the subversion server appears to be out of sync. This can result in inconsistent
check out behavior.
No changes for http://svn.apache.org/repos/asf/poi/site/forrest.properties since the previous
build
[EnvInject] - Executing scripts and injecting environment variables after the SCM step.
[EnvInject] - Injecting as environment variables the properties content 
LANG=en_US.UTF-8

[EnvInject] - Variables injected successfully.
[POI-JDK8] $ /bin/bash -xe /tmp/hudson2034888526696800201.sh
+ svn status
    X   forrest.properties
X       src/documentation

Performing status on external item at 'src/documentation':
+ exit 0
[POI-JDK8] $ /home/jenkins/tools/ant/latest/bin/ant -Dcoverage.enabled=true clean jenkins
Buildfile: <https://builds.apache.org/job/POI-JDK8/ws/build.xml>

clean:
   [delete] Deleting directory <https://builds.apache.org/job/POI-JDK8/ws/build>

check-jars:

fetch-jars:

check-ooxml-jars:

fetch-ooxml-jars:

init:
    [mkdir] Created dir: <https://builds.apache.org/job/POI-JDK8/ws/build>
    [mkdir] Created dir: <https://builds.apache.org/job/POI-JDK8/ws/build/classes>
    [mkdir] Created dir: <https://builds.apache.org/job/POI-JDK8/ws/build/test-classes>
    [mkdir] Created dir: <https://builds.apache.org/job/POI-JDK8/ws/build/test-results>
    [mkdir] Created dir: <https://builds.apache.org/job/POI-JDK8/ws/build/scratchpad-classes>
    [mkdir] Created dir: <https://builds.apache.org/job/POI-JDK8/ws/build/scratchpad-test-classes>
    [mkdir] Created dir: <https://builds.apache.org/job/POI-JDK8/ws/build/scratchpad-test-results>
    [mkdir] Created dir: <https://builds.apache.org/job/POI-JDK8/ws/build/geometry-java>
    [mkdir] Created dir: <https://builds.apache.org/job/POI-JDK8/ws/build/ooxml-classes>
    [mkdir] Created dir: <https://builds.apache.org/job/POI-JDK8/ws/build/ooxml-test-classes>
    [mkdir] Created dir: <https://builds.apache.org/job/POI-JDK8/ws/build/ooxml-test-results>
    [mkdir] Created dir: <https://builds.apache.org/job/POI-JDK8/ws/build/excelant-classes>
    [mkdir] Created dir: <https://builds.apache.org/job/POI-JDK8/ws/build/excelant-test-classes>
    [mkdir] Created dir: <https://builds.apache.org/job/POI-JDK8/ws/build/excelant-test-results>
    [mkdir] Created dir: <https://builds.apache.org/job/POI-JDK8/ws/build/examples-classes>
    [mkdir] Created dir: <https://builds.apache.org/job/POI-JDK8/ws/build/integration-test-classes>
    [mkdir] Created dir: <https://builds.apache.org/job/POI-JDK8/1155/artifact/build/integration-test-results>
    [mkdir] Created dir: <https://builds.apache.org/job/POI-JDK8/ws/build/dist>
    [mkdir] Created dir: <https://builds.apache.org/job/POI-JDK8/ws/build/tmp/site/build/site>
     [echo] Using Java: 1.8.0/1.8.0-b132/25.0-b70/Java HotSpot(TM) 64-Bit Server VM from Oracle
Corporation on Linux: 3.13.0-36-lowlatency

compile-main:
    [javac] Compiling 1189 source files to <https://builds.apache.org/job/POI-JDK8/ws/build/classes>
    [javac] warning: [options] bootstrap class path not set in conjunction with -source 1.6
    [javac] Note: Some input files use or override a deprecated API.
    [javac] Note: Recompile with -Xlint:deprecation for details.
    [javac] Note: <https://builds.apache.org/job/POI-JDK8/ws/src/java/org/apache/poi/hpsf/CustomProperties.java>
uses unchecked or unsafe operations.
    [javac] Note: Recompile with -Xlint:unchecked for details.
    [javac] 1 warning
    [javac] Compiling 526 source files to <https://builds.apache.org/job/POI-JDK8/ws/build/test-classes>
    [javac] warning: [options] bootstrap class path not set in conjunction with -source 1.6
    [javac] Note: Some input files use or override a deprecated API.
    [javac] Note: Recompile with -Xlint:deprecation for details.
    [javac] Note: <https://builds.apache.org/job/POI-JDK8/ws/src/testcases/org/apache/poi/util/LocalTestNode.java>
uses unchecked or unsafe operations.
    [javac] Note: Recompile with -Xlint:unchecked for details.
    [javac] 1 warning
     [copy] Copying 4 files to <https://builds.apache.org/job/POI-JDK8/ws/build/classes>

check-ooxml-xsds:

fetch-ooxml-xsds:

generate-geometry:

compile-scratchpad:
    [javac] Compiling 465 source files to <https://builds.apache.org/job/POI-JDK8/ws/build/scratchpad-classes>
    [javac] warning: [options] bootstrap class path not set in conjunction with -source 1.6
    [javac] <https://builds.apache.org/job/POI-JDK8/ws/src/scratchpad/src/org/apache/poi/hwpf/sprm/TableSprmUncompressor.java>:52:
error: cannot find symbol
    [javac]       if (sprm.getType() == SprmOperation.TAP_TYPE)
    [javac]                                          ^
    [javac]   symbol:   variable TAP_TYPE
    [javac]   location: class SprmOperation
    [javac] Note: Some input files use or override a deprecated API.
    [javac] Note: Recompile with -Xlint:deprecation for details.
    [javac] 1 error
    [javac] 1 warning

BUILD FAILED
<https://builds.apache.org/job/POI-JDK8/ws/build.xml>:931: Compile failed; see the compiler
error output for details.

Total time: 42 seconds
Build step 'Invoke Ant' marked build as failure
[FINDBUGS] Skipping publisher since build result is FAILURE
[WARNINGS] Skipping publisher since build result is FAILURE
Archiving artifacts
Recording test results
ERROR: Step ?Publish JUnit test result report? failed: No test report files were found. Configuration
error?


---------------------------------------------------------------------
To unsubscribe, e-mail: dev-unsubscribe@poi.apache.org
For additional commands, e-mail: dev-help@poi.apache.org


Mime
View raw message