poi-dev mailing list archives

Site index · List index
Message view « Date » · « Thread »
Top « Date » · « Thread »
From Apache Jenkins Server <jenk...@builds.apache.org>
Subject Build failed in Jenkins: POI-Maven #522
Date Sun, 17 Jul 2016 12:38:01 GMT
See <https://builds.apache.org/job/POI-Maven/522/changes>

Changes:

[onealj] bug 58190: add unit tests for XMLSlideShow#addPicture and XMLSlideShow#findPicture

[onealj] bug 59873: add @Internal and @Deprecated decorators to HyperlinkType enum

[onealj] bug 59264,59833,59837: upgrade deprecated methods in examples and testcases

[onealj] bug 59264,59833,59837: upgrade deprecated methods in examples and testcases

[onealj] update changelog for bugs 59791 59837 59873 under the umbrella of bug 59836

[onealj] close workbook to avoid resource leak

[onealj] bug 59170: remove deprecated constants, make private variables final, whitespace

[onealj] HexDump.writeHex is similar to Long#toHexString. Consider consolidating.

[onealj] log on unsupported Sprm operation, save operand to variable to reduce duplicated
code

[onealj] whitespace (tabs to spaces)

[onealj] HWPF SectionProperties implements Cloneable

[onealj] bug 58802: javadoc fix

[onealj] bug 59873: javadoc fix

[onealj] bug 59873: javadoc fix

[onealj] bug 59783: replace deprecated Hyperlink.LINK_* and Hyperlink.getType usage

[onealj] bug 59783: replace deprecated Hyperlink.LINK_* and Hyperlink.getType usage

[centic] Bug 58802: HWPF: Allow reading of footnote and endnote properties

[centic] Bug 59665: Using HSSFWorkbook#setSheetOrder to move sheets to the end corrupts bspos
value in WorkbookRecordList

[onealj] bug 59873: replace Hyperlink.LINK_* int constants with HyperlinkType enum

[onealj] whitespace

[onealj] whitespace (tabs to spaces)

[onealj] add cause to exceptions, log exceptions that are caught and suppressed

------------------------------------------
[...truncated 1046 lines...]
Running org.apache.poi.hssf.record.TestColumnInfoRecord
Tests run: 3, Failures: 0, Errors: 0, Skipped: 0, Time elapsed: 0 sec - in org.apache.poi.hssf.record.TestColumnInfoRecord
Running org.apache.poi.hssf.record.TestRecordInputStream
Tests run: 4, Failures: 0, Errors: 0, Skipped: 0, Time elapsed: 0 sec - in org.apache.poi.hssf.record.TestRecordInputStream
Running org.apache.poi.hssf.record.TestWriteAccessRecord
Tests run: 2, Failures: 0, Errors: 0, Skipped: 0, Time elapsed: 0.001 sec - in org.apache.poi.hssf.record.TestWriteAccessRecord
Running org.apache.poi.hssf.record.TestBoolErrRecord
Tests run: 2, Failures: 0, Errors: 0, Skipped: 0, Time elapsed: 0 sec - in org.apache.poi.hssf.record.TestBoolErrRecord
Running org.apache.poi.hssf.record.TestStyleRecord
Tests run: 1, Failures: 0, Errors: 0, Skipped: 0, Time elapsed: 0 sec - in org.apache.poi.hssf.record.TestStyleRecord
Running org.apache.poi.hssf.record.TestBoundSheetRecord
Tests run: 6, Failures: 0, Errors: 0, Skipped: 0, Time elapsed: 0 sec - in org.apache.poi.hssf.record.TestBoundSheetRecord
Running org.apache.poi.hssf.record.TestSSTRecordSizeCalculator
Tests run: 6, Failures: 0, Errors: 0, Skipped: 0, Time elapsed: 0 sec - in org.apache.poi.hssf.record.TestSSTRecordSizeCalculator
Running org.apache.poi.hssf.record.TestEmbeddedObjectRefSubRecord
Tests run: 5, Failures: 0, Errors: 0, Skipped: 0, Time elapsed: 0 sec - in org.apache.poi.hssf.record.TestEmbeddedObjectRefSubRecord
Running org.apache.poi.hssf.record.TestDrawingGroupRecord
Tests run: 3, Failures: 0, Errors: 0, Skipped: 0, Time elapsed: 0.001 sec - in org.apache.poi.hssf.record.TestDrawingGroupRecord
Running org.apache.poi.hssf.record.TestEndSubRecord
Tests run: 2, Failures: 0, Errors: 0, Skipped: 0, Time elapsed: 0 sec - in org.apache.poi.hssf.record.TestEndSubRecord
Running org.apache.poi.hssf.record.common.TestUnicodeString
Tests run: 10, Failures: 0, Errors: 0, Skipped: 0, Time elapsed: 0.002 sec - in org.apache.poi.hssf.record.common.TestUnicodeString
Running org.apache.poi.hssf.record.TestMergeCellsRecord
Tests run: 2, Failures: 0, Errors: 0, Skipped: 0, Time elapsed: 0.001 sec - in org.apache.poi.hssf.record.TestMergeCellsRecord
Running org.apache.poi.hssf.record.TestCFHeaderRecord
Tests run: 4, Failures: 0, Errors: 0, Skipped: 0, Time elapsed: 0 sec - in org.apache.poi.hssf.record.TestCFHeaderRecord
Running org.apache.poi.hssf.record.TestSubRecord
Tests run: 3, Failures: 0, Errors: 0, Skipped: 0, Time elapsed: 0 sec - in org.apache.poi.hssf.record.TestSubRecord
Running org.apache.poi.hssf.record.TestPaletteRecord
Tests run: 1, Failures: 0, Errors: 0, Skipped: 0, Time elapsed: 0 sec - in org.apache.poi.hssf.record.TestPaletteRecord
Running org.apache.poi.hssf.record.TestPLVRecord
Tests run: 1, Failures: 0, Errors: 0, Skipped: 0, Time elapsed: 0 sec - in org.apache.poi.hssf.record.TestPLVRecord
Running org.apache.poi.hssf.record.TestRecordFactoryInputStream
Tests run: 4, Failures: 0, Errors: 0, Skipped: 0, Time elapsed: 0 sec - in org.apache.poi.hssf.record.TestRecordFactoryInputStream
Running org.apache.poi.hssf.record.TestNoteRecord
Tests run: 4, Failures: 0, Errors: 0, Skipped: 0, Time elapsed: 0 sec - in org.apache.poi.hssf.record.TestNoteRecord
Running org.apache.poi.hssf.record.TestRecalcIdRecord
Tests run: 2, Failures: 0, Errors: 0, Skipped: 0, Time elapsed: 0 sec - in org.apache.poi.hssf.record.TestRecalcIdRecord
Running org.apache.poi.hssf.record.TestExternalNameRecord
Tests run: 8, Failures: 0, Errors: 0, Skipped: 0, Time elapsed: 0 sec - in org.apache.poi.hssf.record.TestExternalNameRecord
Running org.apache.poi.hssf.record.TestNoteStructureSubRecord
Tests run: 3, Failures: 0, Errors: 0, Skipped: 0, Time elapsed: 0 sec - in org.apache.poi.hssf.record.TestNoteStructureSubRecord
Running org.apache.poi.hssf.record.TestSSTDeserializer
Tests run: 4, Failures: 0, Errors: 0, Skipped: 0, Time elapsed: 0 sec - in org.apache.poi.hssf.record.TestSSTDeserializer
Running org.apache.poi.hssf.record.TestFontRecord
Tests run: 5, Failures: 0, Errors: 0, Skipped: 0, Time elapsed: 0 sec - in org.apache.poi.hssf.record.TestFontRecord
Running org.apache.poi.hssf.record.TestNameCommentRecord
Tests run: 1, Failures: 0, Errors: 0, Skipped: 0, Time elapsed: 0 sec - in org.apache.poi.hssf.record.TestNameCommentRecord
Running org.apache.poi.hssf.record.pivot.TestExtendedPivotTableViewFieldsRecord
Tests run: 2, Failures: 0, Errors: 0, Skipped: 0, Time elapsed: 0 sec - in org.apache.poi.hssf.record.pivot.TestExtendedPivotTableViewFieldsRecord
Running org.apache.poi.hssf.record.pivot.TestViewFieldsRecord
Tests run: 2, Failures: 0, Errors: 0, Skipped: 0, Time elapsed: 0 sec - in org.apache.poi.hssf.record.pivot.TestViewFieldsRecord
Running org.apache.poi.hssf.record.pivot.TestPageItemRecord
Tests run: 2, Failures: 0, Errors: 0, Skipped: 0, Time elapsed: 0 sec - in org.apache.poi.hssf.record.pivot.TestPageItemRecord
Running org.apache.poi.hssf.record.TestArrayRecord
Tests run: 2, Failures: 0, Errors: 0, Skipped: 0, Time elapsed: 0.3 sec - in org.apache.poi.hssf.record.TestArrayRecord
Running org.apache.poi.hssf.record.TestExtendedFormatRecord
Tests run: 4, Failures: 0, Errors: 0, Skipped: 0, Time elapsed: 0 sec - in org.apache.poi.hssf.record.TestExtendedFormatRecord
Running org.apache.poi.hssf.record.cf.TestCellRange
Tests run: 8, Failures: 0, Errors: 0, Skipped: 0, Time elapsed: 0.001 sec - in org.apache.poi.hssf.record.cf.TestCellRange
Running org.apache.poi.hssf.record.TestFormulaRecord
Tests run: 6, Failures: 0, Errors: 0, Skipped: 0, Time elapsed: 0 sec - in org.apache.poi.hssf.record.TestFormulaRecord
Running org.apache.poi.hssf.record.TestUnicodeNameRecord
Tests run: 1, Failures: 0, Errors: 0, Skipped: 0, Time elapsed: 0 sec - in org.apache.poi.hssf.record.TestUnicodeNameRecord
Running org.apache.poi.hssf.record.TestDVALRecord
Tests run: 1, Failures: 0, Errors: 0, Skipped: 0, Time elapsed: 0 sec - in org.apache.poi.hssf.record.TestDVALRecord
Running org.apache.poi.hssf.record.chart.TestCategorySeriesAxisRecord
Tests run: 2, Failures: 0, Errors: 0, Skipped: 0, Time elapsed: 0 sec - in org.apache.poi.hssf.record.chart.TestCategorySeriesAxisRecord
Running org.apache.poi.hssf.record.chart.TestSeriesToChartGroupRecord
Tests run: 2, Failures: 0, Errors: 0, Skipped: 0, Time elapsed: 0 sec - in org.apache.poi.hssf.record.chart.TestSeriesToChartGroupRecord
Running org.apache.poi.hssf.record.chart.TestAxisLineFormatRecord
Tests run: 2, Failures: 0, Errors: 0, Skipped: 0, Time elapsed: 0 sec - in org.apache.poi.hssf.record.chart.TestAxisLineFormatRecord
Running org.apache.poi.hssf.record.chart.TestValueRangeRecord
Tests run: 2, Failures: 0, Errors: 0, Skipped: 0, Time elapsed: 0 sec - in org.apache.poi.hssf.record.chart.TestValueRangeRecord
Running org.apache.poi.hssf.record.chart.TestFrameRecord
Tests run: 2, Failures: 0, Errors: 0, Skipped: 0, Time elapsed: 0 sec - in org.apache.poi.hssf.record.chart.TestFrameRecord
Running org.apache.poi.hssf.record.chart.TestSeriesRecord
Tests run: 2, Failures: 0, Errors: 0, Skipped: 0, Time elapsed: 0 sec - in org.apache.poi.hssf.record.chart.TestSeriesRecord
Running org.apache.poi.hssf.record.chart.TestChartTitleFormatRecord
Tests run: 1, Failures: 0, Errors: 0, Skipped: 0, Time elapsed: 0 sec - in org.apache.poi.hssf.record.chart.TestChartTitleFormatRecord
Running org.apache.poi.hssf.record.chart.TestLinkedDataRecord
Tests run: 2, Failures: 0, Errors: 0, Skipped: 0, Time elapsed: 0 sec - in org.apache.poi.hssf.record.chart.TestLinkedDataRecord
Running org.apache.poi.hssf.record.chart.TestLegendRecord
Tests run: 2, Failures: 0, Errors: 0, Skipped: 0, Time elapsed: 0 sec - in org.apache.poi.hssf.record.chart.TestLegendRecord
Running org.apache.poi.hssf.record.chart.TestFontBasisRecord
Tests run: 2, Failures: 0, Errors: 0, Skipped: 0, Time elapsed: 0 sec - in org.apache.poi.hssf.record.chart.TestFontBasisRecord
Running org.apache.poi.hssf.record.chart.TestSeriesTextRecord
Tests run: 3, Failures: 0, Errors: 0, Skipped: 0, Time elapsed: 0 sec - in org.apache.poi.hssf.record.chart.TestSeriesTextRecord
Running org.apache.poi.hssf.record.chart.TestAxisRecord
Tests run: 2, Failures: 0, Errors: 0, Skipped: 0, Time elapsed: 0 sec - in org.apache.poi.hssf.record.chart.TestAxisRecord
Running org.apache.poi.hssf.record.chart.TestNumberFormatIndexRecord
Tests run: 2, Failures: 0, Errors: 0, Skipped: 0, Time elapsed: 0 sec - in org.apache.poi.hssf.record.chart.TestNumberFormatIndexRecord
Running org.apache.poi.hssf.record.chart.TestChartRecord
Tests run: 2, Failures: 0, Errors: 0, Skipped: 0, Time elapsed: 0.001 sec - in org.apache.poi.hssf.record.chart.TestChartRecord
Running org.apache.poi.hssf.record.chart.TestAxisUsedRecord
Tests run: 2, Failures: 0, Errors: 0, Skipped: 0, Time elapsed: 0 sec - in org.apache.poi.hssf.record.chart.TestAxisUsedRecord
Running org.apache.poi.hssf.record.chart.TestAxisOptionsRecord
Tests run: 2, Failures: 0, Errors: 0, Skipped: 0, Time elapsed: 0 sec - in org.apache.poi.hssf.record.chart.TestAxisOptionsRecord
Running org.apache.poi.hssf.record.chart.TestDataFormatRecord
Tests run: 2, Failures: 0, Errors: 0, Skipped: 0, Time elapsed: 0 sec - in org.apache.poi.hssf.record.chart.TestDataFormatRecord
Running org.apache.poi.hssf.record.chart.TestUnitsRecord
Tests run: 2, Failures: 0, Errors: 0, Skipped: 0, Time elapsed: 0 sec - in org.apache.poi.hssf.record.chart.TestUnitsRecord
Running org.apache.poi.hssf.record.chart.TestLineFormatRecord
Tests run: 2, Failures: 0, Errors: 0, Skipped: 0, Time elapsed: 0 sec - in org.apache.poi.hssf.record.chart.TestLineFormatRecord
Running org.apache.poi.hssf.record.chart.TestSeriesLabelsRecord
Tests run: 2, Failures: 0, Errors: 0, Skipped: 0, Time elapsed: 0 sec - in org.apache.poi.hssf.record.chart.TestSeriesLabelsRecord
Running org.apache.poi.hssf.record.chart.TestTickRecord
Tests run: 2, Failures: 0, Errors: 0, Skipped: 0, Time elapsed: 0 sec - in org.apache.poi.hssf.record.chart.TestTickRecord
Running org.apache.poi.hssf.record.chart.TestAreaRecord
Tests run: 2, Failures: 0, Errors: 0, Skipped: 0, Time elapsed: 0 sec - in org.apache.poi.hssf.record.chart.TestAreaRecord
Running org.apache.poi.hssf.record.chart.TestDatRecord
Tests run: 2, Failures: 0, Errors: 0, Skipped: 0, Time elapsed: 0 sec - in org.apache.poi.hssf.record.chart.TestDatRecord
Running org.apache.poi.hssf.record.chart.TestSeriesIndexRecord
Tests run: 2, Failures: 0, Errors: 0, Skipped: 0, Time elapsed: 0 sec - in org.apache.poi.hssf.record.chart.TestSeriesIndexRecord
Running org.apache.poi.hssf.record.chart.TestTextRecord
Tests run: 2, Failures: 0, Errors: 0, Skipped: 0, Time elapsed: 0 sec - in org.apache.poi.hssf.record.chart.TestTextRecord
Running org.apache.poi.hssf.record.chart.TestFontIndexRecord
Tests run: 2, Failures: 0, Errors: 0, Skipped: 0, Time elapsed: 0.001 sec - in org.apache.poi.hssf.record.chart.TestFontIndexRecord
Running org.apache.poi.hssf.record.chart.TestSeriesChartGroupIndexRecord
Tests run: 2, Failures: 0, Errors: 0, Skipped: 0, Time elapsed: 0 sec - in org.apache.poi.hssf.record.chart.TestSeriesChartGroupIndexRecord
Running org.apache.poi.hssf.record.chart.TestSheetPropertiesRecord
Tests run: 2, Failures: 0, Errors: 0, Skipped: 0, Time elapsed: 0 sec - in org.apache.poi.hssf.record.chart.TestSheetPropertiesRecord
Running org.apache.poi.hssf.record.chart.TestPlotAreaRecord
Tests run: 2, Failures: 0, Errors: 0, Skipped: 0, Time elapsed: 0 sec - in org.apache.poi.hssf.record.chart.TestPlotAreaRecord
Running org.apache.poi.hssf.record.chart.TestChartFormatRecord
Tests run: 1, Failures: 0, Errors: 0, Skipped: 0, Time elapsed: 0 sec - in org.apache.poi.hssf.record.chart.TestChartFormatRecord
Running org.apache.poi.hssf.record.chart.TestObjectLinkRecord
Tests run: 2, Failures: 0, Errors: 0, Skipped: 0, Time elapsed: 0.001 sec - in org.apache.poi.hssf.record.chart.TestObjectLinkRecord
Running org.apache.poi.hssf.record.chart.TestBarRecord
Tests run: 2, Failures: 0, Errors: 0, Skipped: 0, Time elapsed: 0 sec - in org.apache.poi.hssf.record.chart.TestBarRecord
Running org.apache.poi.hssf.record.chart.TestAxisParentRecord
Tests run: 2, Failures: 0, Errors: 0, Skipped: 0, Time elapsed: 0 sec - in org.apache.poi.hssf.record.chart.TestAxisParentRecord
Running org.apache.poi.hssf.record.chart.TestDefaultDataLabelTextPropertiesRecord
Tests run: 2, Failures: 0, Errors: 0, Skipped: 0, Time elapsed: 0 sec - in org.apache.poi.hssf.record.chart.TestDefaultDataLabelTextPropertiesRecord
Running org.apache.poi.hssf.record.chart.TestPlotGrowthRecord
Tests run: 2, Failures: 0, Errors: 0, Skipped: 0, Time elapsed: 0 sec - in org.apache.poi.hssf.record.chart.TestPlotGrowthRecord
Running org.apache.poi.hssf.record.chart.TestAreaFormatRecord
Tests run: 2, Failures: 0, Errors: 0, Skipped: 0, Time elapsed: 0 sec - in org.apache.poi.hssf.record.chart.TestAreaFormatRecord
Running org.apache.poi.hssf.record.chart.TestSeriesListRecord
Tests run: 2, Failures: 0, Errors: 0, Skipped: 0, Time elapsed: 0 sec - in org.apache.poi.hssf.record.chart.TestSeriesListRecord
Running org.apache.poi.hssf.record.TestBOFRecord
Tests run: 1, Failures: 0, Errors: 0, Skipped: 0, Time elapsed: 0 sec - in org.apache.poi.hssf.record.TestBOFRecord
Running org.apache.poi.hssf.record.TestObjRecord
Tests run: 5, Failures: 0, Errors: 0, Skipped: 0, Time elapsed: 0 sec - in org.apache.poi.hssf.record.TestObjRecord
Running org.apache.poi.hssf.record.TestExtSSTRecord
Tests run: 1, Failures: 0, Errors: 0, Skipped: 0, Time elapsed: 0 sec - in org.apache.poi.hssf.record.TestExtSSTRecord
Running org.apache.poi.hssf.record.TestTextObjectRecord
Tests run: 6, Failures: 0, Errors: 0, Skipped: 0, Time elapsed: 0 sec - in org.apache.poi.hssf.record.TestTextObjectRecord
Running org.apache.poi.hssf.record.TestAutoFilterInfoRecord
Tests run: 3, Failures: 0, Errors: 0, Skipped: 0, Time elapsed: 0 sec - in org.apache.poi.hssf.record.TestAutoFilterInfoRecord
Running org.apache.poi.hssf.record.TestSCLRecord
Tests run: 2, Failures: 0, Errors: 0, Skipped: 0, Time elapsed: 0 sec - in org.apache.poi.hssf.record.TestSCLRecord
Running org.apache.poi.hssf.record.TestEscherAggregate
Tests run: 2, Failures: 0, Errors: 0, Skipped: 0, Time elapsed: 0 sec - in org.apache.poi.hssf.record.TestEscherAggregate
Running org.apache.poi.hssf.record.TestTextObjectBaseRecord
Tests run: 2, Failures: 0, Errors: 0, Skipped: 0, Time elapsed: 0 sec - in org.apache.poi.hssf.record.TestTextObjectBaseRecord
Running org.apache.poi.hssf.record.TestHyperlinkRecord
Tests run: 15, Failures: 0, Errors: 0, Skipped: 0, Time elapsed: 0 sec - in org.apache.poi.hssf.record.TestHyperlinkRecord
Running org.apache.poi.hssf.record.TestLbsDataSubRecord
Tests run: 4, Failures: 0, Errors: 0, Skipped: 0, Time elapsed: 0 sec - in org.apache.poi.hssf.record.TestLbsDataSubRecord
Running org.apache.poi.hssf.record.TestNameRecord
Tests run: 6, Failures: 0, Errors: 0, Skipped: 0, Time elapsed: 0 sec - in org.apache.poi.hssf.record.TestNameRecord

Results :

Tests run: 6130, Failures: 0, Errors: 0, Skipped: 741

[JENKINS] Recording test results
[INFO] 
[INFO] --- maven-jar-plugin:3.0.1:jar (default-jar) @ poi-main ---
[INFO] Building jar: <https://builds.apache.org/job/POI-Maven/ws/sonar/main/target/poi-main-3.15-beta3-SNAPSHOT.jar>
[INFO] 
[INFO] --- maven-jar-plugin:3.0.1:test-jar (default) @ poi-main ---
[INFO] Building jar: <https://builds.apache.org/job/POI-Maven/ws/sonar/main/target/poi-main-3.15-beta3-SNAPSHOT-tests.jar>
[INFO]                                                                         
[INFO] ------------------------------------------------------------------------
[INFO] Building Apache POI Scratchpad package 3.15-beta3-SNAPSHOT
[INFO] ------------------------------------------------------------------------
[INFO] 
[INFO] --- maven-resources-plugin:3.0.1:copy-resources (copy-sources) @ poi-scratchpad ---
[INFO] Using 'ASCII' encoding to copy filtered resources.
[INFO] Copying 465 resources
[INFO] 
[INFO] --- maven-resources-plugin:3.0.1:copy-resources (copy-resources) @ poi-scratchpad ---
[INFO] Using 'ASCII' encoding to copy filtered resources.
[INFO] Copying 2 resources
[INFO] 
[INFO] --- maven-resources-plugin:3.0.1:resources (default-resources) @ poi-scratchpad ---
[INFO] Using 'ASCII' encoding to copy filtered resources.
[INFO] Copying 2 resources
[INFO] 
[INFO] --- maven-compiler-plugin:3.5.1:compile (default-compile) @ poi-scratchpad ---
[INFO] Changes detected - recompiling the module!
[INFO] Compiling 465 source files to <https://builds.apache.org/job/POI-Maven/ws/sonar/scratchpad/target/classes>
[INFO] -------------------------------------------------------------
[ERROR] COMPILATION ERROR : 
[INFO] -------------------------------------------------------------
[ERROR] <https://builds.apache.org/job/POI-Maven/ws/sonar/scratchpad/src/main/java/org/apache/poi/hwpf/sprm/TableSprmUncompressor.java>:[52,41]
cannot find symbol
symbol  : variable TAP_TYPE
location: class org.apache.poi.hwpf.sprm.SprmOperation
[INFO] 1 error
[INFO] -------------------------------------------------------------
[INFO] ------------------------------------------------------------------------
[INFO] Reactor Summary:
[INFO] 
[INFO] Apache POI - the Java API for Microsoft Documents . SUCCESS [0.181s]
[INFO] Apache POI Main package ........................... SUCCESS [3:31.759s]
[INFO] Apache POI Scratchpad package ..................... FAILURE [26.765s]
[INFO] Apache POI - Openxmlformats Schema package ........ SKIPPED
[INFO] Apache POI - Openxmlformats Encryption Schema package  SKIPPED
[INFO] Apache POI - Openxmlformats Security-Schema package  SKIPPED
[INFO] Apache POI OOXML package .......................... SKIPPED
[INFO] Apache POI ExcelAnt package ....................... SKIPPED
[INFO] Apache POI Examples package ....................... SKIPPED
[INFO] ------------------------------------------------------------------------
[INFO] BUILD FAILURE
[INFO] ------------------------------------------------------------------------
[INFO] Total time: 4:29.339s
[INFO] Finished at: Sun Jul 17 12:36:39 UTC 2016
[INFO] Final Memory: 15M/240M
[INFO] ------------------------------------------------------------------------
Waiting for Jenkins to finish collecting data[ERROR] Failed to execute goal org.apache.maven.plugins:maven-compiler-plugin:3.5.1:compile
(default-compile) on project poi-scratchpad: Compilation failure
[ERROR] <https://builds.apache.org/job/POI-Maven/ws/sonar/scratchpad/src/main/java/org/apache/poi/hwpf/sprm/TableSprmUncompressor.java>:[52,41]
cannot find symbol
[ERROR] symbol  : variable TAP_TYPE
[ERROR] location: class org.apache.poi.hwpf.sprm.SprmOperation
[ERROR] -> [Help 1]
[ERROR] 
[ERROR] To see the full stack trace of the errors, re-run Maven with the -e switch.
[ERROR] Re-run Maven using the -X switch to enable full debug logging.
[ERROR] 
[ERROR] For more information about the errors and possible solutions, please read the following
articles:
[ERROR] [Help 1] http://cwiki.apache.org/confluence/display/MAVEN/MojoFailureException
[ERROR] 
[ERROR] After correcting the problems, you can resume the build with the command
[ERROR]   mvn <goals> -rf :poi-scratchpad

[JENKINS] Archiving <https://builds.apache.org/job/POI-Maven/ws/sonar/scratchpad/pom.xml>
to org.apache.poi/poi-scratchpad/3.15-beta3-SNAPSHOT/poi-scratchpad-3.15-beta3-SNAPSHOT.pom
[JENKINS] Archiving <https://builds.apache.org/job/POI-Maven/ws/sonar/ooxml-schema-encryption/pom.xml>
to org.apache.poi/poi-ooxml-schema-encryption/3.15-beta3-SNAPSHOT/poi-ooxml-schema-encryption-3.15-beta3-SNAPSHOT.pom
[JENKINS] Archiving <https://builds.apache.org/job/POI-Maven/ws/sonar/ooxml-schema-security/pom.xml>
to org.apache.poi/poi-ooxml-schema-security/3.15-beta3-SNAPSHOT/poi-ooxml-schema-security-3.15-beta3-SNAPSHOT.pom
[JENKINS] Archiving <https://builds.apache.org/job/POI-Maven/ws/sonar/ooxml-schema/pom.xml>
to org.apache.poi/poi-ooxml-schema/3.15-beta3-SNAPSHOT/poi-ooxml-schema-3.15-beta3-SNAPSHOT.pom
[JENKINS] Archiving <https://builds.apache.org/job/POI-Maven/ws/sonar/main/pom.xml>
to org.apache.poi/poi-main/3.15-beta3-SNAPSHOT/poi-main-3.15-beta3-SNAPSHOT.pom
[JENKINS] Archiving <https://builds.apache.org/job/POI-Maven/ws/sonar/main/target/poi-main-3.15-beta3-SNAPSHOT.jar>
to org.apache.poi/poi-main/3.15-beta3-SNAPSHOT/poi-main-3.15-beta3-SNAPSHOT.jar
[JENKINS] Archiving <https://builds.apache.org/job/POI-Maven/ws/sonar/main/target/poi-main-3.15-beta3-SNAPSHOT-tests.jar>
to org.apache.poi/poi-main/3.15-beta3-SNAPSHOT/poi-main-3.15-beta3-SNAPSHOT-tests.jar
[JENKINS] Archiving <https://builds.apache.org/job/POI-Maven/ws/sonar/ooxml/pom.xml>
to org.apache.poi/poi-ooxml/3.15-beta3-SNAPSHOT/poi-ooxml-3.15-beta3-SNAPSHOT.pom
[JENKINS] Archiving <https://builds.apache.org/job/POI-Maven/ws/sonar/pom.xml> to org.apache.poi/poi-parent/3.15-beta3-SNAPSHOT/poi-parent-3.15-beta3-SNAPSHOT.pom
[JENKINS] Archiving <https://builds.apache.org/job/POI-Maven/ws/sonar/examples/pom.xml>
to org.apache.poi/poi-examples/3.15-beta3-SNAPSHOT/poi-examples-3.15-beta3-SNAPSHOT.pom
[JENKINS] Archiving <https://builds.apache.org/job/POI-Maven/ws/sonar/excelant/pom.xml>
to org.apache.poi/poi-excelant/3.15-beta3-SNAPSHOT/poi-excelant-3.15-beta3-SNAPSHOT.pom
Sending e-mails to: dev@poi.apache.org
channel stopped

---------------------------------------------------------------------
To unsubscribe, e-mail: dev-unsubscribe@poi.apache.org
For additional commands, e-mail: dev-help@poi.apache.org


Mime
View raw message